SHARE
TWEET

[1.12.2] gradlew setupDecompWorkspace build failed

a guest Nov 21st, 2017 173 Never
Not a member of Pastebin yet? Sign Up, it unlocks many cool features!
  1. D:\D\Minecraft related\forge 1.12 workspace>gradlew setupDecompWorkspace --debug --info --stacktrace
  2. To honour the JVM settings for this build a new JVM will be forked. Please consider using the daemon: https://docs.gradle.org/2.14/userguide/gradle_da
  3. emon.html.
  4. Starting daemon process: workingDir = C:\Users\wjg\.gradle\daemon\2.14, daemonArgs: [C:\Program Files\Java\jdk1.8.0\bin\java.exe, -Xmx3G, -Dfile.encod
  5. ing=windows-1252, -Duser.country=NL, -Duser.language=nl, -Duser.variant, -cp, C:\Users\wjg\.gradle\wrapper\dists\gradle-2.14-bin\76oc0mnc3ieqtsukq90mp
  6. 0rxk\gradle-2.14\lib\gradle-launcher-2.14.jar, org.gradle.launcher.daemon.bootstrap.GradleDaemon, 2.14]
  7. Starting process 'Gradle build daemon'. Working directory: C:\Users\wjg\.gradle\daemon\2.14 Command: C:\Program Files\Java\jdk1.8.0\bin\java.exe -Xmx3
  8. G -Dfile.encoding=windows-1252 -Duser.country=NL -Duser.language=nl -Duser.variant -cp C:\Users\wjg\.gradle\wrapper\dists\gradle-2.14-bin\76oc0mnc3ieq
  9. tsukq90mp0rxk\gradle-2.14\lib\gradle-launcher-2.14.jar org.gradle.launcher.daemon.bootstrap.GradleDaemon 2.14
  10. Successfully started process 'Gradle build daemon'
  11. An attempt to start the daemon took 0.774 secs.
  12. Connected to daemon DaemonInfo{pid=1268, address=[7d3d9bc2-c848-4f23-ab7a-5b7aef2e3d4a port:58752, addresses:[/127.0.0.1, /0:0:0:0:0:0:0:1]], idle=fal
  13. se, lastBusy=1511268809077, context=DefaultDaemonContext[uid=9906a16e-1ca8-4298-bf60-26e9832e4a26,javaHome=C:\Program Files\Java\jdk1.8.0,daemonRegist
  14. ryDir=C:\Users\wjg\.gradle\daemon,pid=1268,idleTimeout=120000,daemonOpts=-Xmx3G,-Dfile.encoding=windows-1252,-Duser.country=NL,-Duser.language=nl,-Dus
  15. er.variant]}. Dispatching request BuildAndStop{id=617167b0-1e27-4e85-9eab-76db3a9de3f0.1, currentDir=D:\D\Minecraft related\forge 1.12 workspace}.
  16. Received result org.gradle.launcher.daemon.protocol.BuildStarted@258d79be from daemon DaemonInfo{pid=1268, address=[7d3d9bc2-c848-4f23-ab7a-5b7aef2e3d
  17. 4a port:58752, addresses:[/127.0.0.1, /0:0:0:0:0:0:0:1]], idle=false, lastBusy=1511268809077, context=DefaultDaemonContext[uid=9906a16e-1ca8-4298-bf60
  18. -26e9832e4a26,javaHome=C:\Program Files\Java\jdk1.8.0,daemonRegistryDir=C:\Users\wjg\.gradle\daemon,pid=1268,idleTimeout=120000,daemonOpts=-Xmx3G,-Dfi
  19. le.encoding=windows-1252,-Duser.country=NL,-Duser.language=nl,-Duser.variant]} (build should be starting).
  20. The client will now receive all logging from the daemon (pid: 1268). The daemon log file: C:\Users\wjg\.gradle\daemon\2.14\daemon-1268.out.log
  21. Executing build with daemon context: DefaultDaemonContext[uid=9906a16e-1ca8-4298-bf60-26e9832e4a26,javaHome=C:\Program Files\Java\jdk1.8.0,daemonRegis
  22. tryDir=C:\Users\wjg\.gradle\daemon,pid=1268,idleTimeout=120000,daemonOpts=-Xmx3G,-Dfile.encoding=windows-1252,-Duser.country=NL,-Duser.language=nl,-Du
  23. ser.variant]
  24. Starting Build
  25. Settings evaluated using settings file 'D:\master\settings.gradle'.
  26. Projects loaded. Root project using build file 'D:\D\Minecraft related\forge 1.12 workspace\build.gradle'.
  27. Included projects: [root project 'forge 1.12 workspace']
  28. Evaluating root project 'forge 1.12 workspace' using build file 'D:\D\Minecraft related\forge 1.12 workspace\build.gradle'.
  29. This mapping 'snapshot_20170624' was designed for MC 1.12! Use at your own peril.
  30. #################################################
  31.          ForgeGradle 2.3-SNAPSHOT-f49079d
  32.   https://github.com/MinecraftForge/ForgeGradle
  33. #################################################
  34.                Powered by MCP unknown
  35.              http://modcoderpack.com
  36.          by: Searge, ProfMobius, Fesh0r,
  37.          R4wk, ZeuX, IngisKahn, bspkrs
  38. #################################################
  39. file or directory 'D:\D\Minecraft related\forge 1.12 workspace\src\api\resources', not found
  40. All projects evaluated.
  41. Selected primary task 'setupDecompWorkspace' from project :
  42. Tasks to be executed: [task ':deobfCompileDummyTask', task ':deobfProvidedDummyTask', task ':getVersionJson', task ':extractUserdev', task ':extractDe
  43. pendencyATs', task ':extractMcpData', task ':extractMcpMappings', task ':genSrgs', task ':downloadClient', task ':downloadServer', task ':splitServerJ
  44. ar', task ':mergeJars', task ':deobfMcSRG', task ':decompileMc', task ':fixMcSources', task ':applySourcePatches', task ':remapMcSources', task ':reco
  45. mpileMc', task ':extractNatives', task ':getAssetIndex', task ':getAssets', task ':makeStart', task ':setupDecompWorkspace']
  46. Creating In-memory cache of D:\D\Minecraft related\forge 1.12 workspace\.gradle\2.14\taskArtifacts\fileHashes.bin: MaxSize{1358400}
  47. Creating In-memory cache of D:\D\Minecraft related\forge 1.12 workspace\.gradle\2.14\taskArtifacts\treeSnapshots.bin: MaxSize{67900}
  48. Creating In-memory cache of D:\D\Minecraft related\forge 1.12 workspace\.gradle\2.14\taskArtifacts\treeSnapshotUsage.bin: MaxSize{67900}
  49. Creating In-memory cache of D:\D\Minecraft related\forge 1.12 workspace\.gradle\2.14\taskArtifacts\fileSnapshotsToTreeSnapshotsIndex.bin: MaxSize{3390
  50. 0}
  51. Creating In-memory cache of D:\D\Minecraft related\forge 1.12 workspace\.gradle\2.14\taskArtifacts\fileSnapshots.bin: MaxSize{33900}
  52. Creating In-memory cache of D:\D\Minecraft related\forge 1.12 workspace\.gradle\2.14\taskArtifacts\taskArtifacts.bin: MaxSize{6700}
  53. :deobfCompileDummyTask (Thread[Daemon worker,5,main]) started.
  54. :deobfCompileDummyTask
  55. Executing task ':deobfCompileDummyTask' (up-to-date check took 0.001 secs) due to:
  56.   Task has not declared any outputs.
  57. :deobfCompileDummyTask (Thread[Daemon worker,5,main]) completed. Took 0.007 secs.
  58. :deobfProvidedDummyTask (Thread[Daemon worker,5,main]) started.
  59. :deobfProvidedDummyTask
  60. Executing task ':deobfProvidedDummyTask' (up-to-date check took 0.0 secs) due to:
  61.   Task has not declared any outputs.
  62. :deobfProvidedDummyTask (Thread[Daemon worker,5,main]) completed. Took 0.002 secs.
  63. :getVersionJson (Thread[Daemon worker,5,main]) started.
  64. :getVersionJson
  65. Invalidating in-memory cache of D:\D\Minecraft related\forge 1.12 workspace\.gradle\2.14\taskArtifacts\fileSnapshotsToTreeSnapshotsIndex.bin
  66. Invalidating in-memory cache of D:\D\Minecraft related\forge 1.12 workspace\.gradle\2.14\taskArtifacts\treeSnapshots.bin
  67. Invalidating in-memory cache of D:\D\Minecraft related\forge 1.12 workspace\.gradle\2.14\taskArtifacts\treeSnapshotUsage.bin
  68. Invalidating in-memory cache of D:\D\Minecraft related\forge 1.12 workspace\.gradle\2.14\taskArtifacts\fileSnapshots.bin
  69. Invalidating in-memory cache of D:\D\Minecraft related\forge 1.12 workspace\.gradle\2.14\taskArtifacts\taskArtifacts.bin
  70. Invalidating in-memory cache of D:\D\Minecraft related\forge 1.12 workspace\.gradle\2.14\taskArtifacts\fileHashes.bin
  71. Executing task ':getVersionJson' (up-to-date check took 0.009 secs) due to:
  72.   Task.upToDateWhen is false.
  73. :getVersionJson (Thread[Daemon worker,5,main]) completed. Took 0.065 secs.
  74. :extractUserdev (Thread[Daemon worker,5,main]) started.
  75. :extractUserdev
  76. Skipping task ':extractUserdev' as it is up-to-date (took 0.014 secs).
  77. :extractUserdev UP-TO-DATE
  78. :extractUserdev (Thread[Daemon worker,5,main]) completed. Took 0.016 secs.
  79. :extractDependencyATs (Thread[Daemon worker,5,main]) started.
  80. :extractDependencyATs
  81. Skipping task ':extractDependencyATs' as task onlyIf is false.
  82. :extractDependencyATs SKIPPED
  83. :extractDependencyATs (Thread[Daemon worker,5,main]) completed. Took 0.001 secs.
  84. :extractMcpData (Thread[Daemon worker,5,main]) started.
  85. :extractMcpData
  86. Skipping task ':extractMcpData' as task onlyIf is false.
  87. :extractMcpData SKIPPED
  88. :extractMcpData (Thread[Daemon worker,5,main]) completed. Took 0.335 secs.
  89. :extractMcpMappings (Thread[Daemon worker,5,main]) started.
  90. :extractMcpMappings
  91. Skipping task ':extractMcpMappings' as task onlyIf is false.
  92. :extractMcpMappings SKIPPED
  93. :extractMcpMappings (Thread[Daemon worker,5,main]) completed. Took 0.25 secs.
  94. :genSrgs (Thread[Daemon worker,5,main]) started.
  95. :genSrgs
  96. Skipping task ':genSrgs' as task onlyIf is false.
  97. :genSrgs SKIPPED
  98. :genSrgs (Thread[Daemon worker,5,main]) completed. Took 0.453 secs.
  99. :downloadClient (Thread[Daemon worker,5,main]) started.
  100. :downloadClient
  101. Skipping task ':downloadClient' as task onlyIf is false.
  102. :downloadClient SKIPPED
  103. :downloadClient (Thread[Daemon worker,5,main]) completed. Took 0.346 secs.
  104. :downloadServer (Thread[Daemon worker,5,main]) started.
  105. :downloadServer
  106. Skipping task ':downloadServer' as task onlyIf is false.
  107. :downloadServer SKIPPED
  108. :downloadServer (Thread[Daemon worker,5,main]) completed. Took 1.193 secs.
  109. :splitServerJar (Thread[Daemon worker,5,main]) started.
  110. :splitServerJar
  111. Skipping task ':splitServerJar' as task onlyIf is false.
  112. :splitServerJar SKIPPED
  113. :splitServerJar (Thread[Daemon worker,5,main]) completed. Took 5.313 secs.
  114. :mergeJars (Thread[Daemon worker,5,main]) started.
  115. :mergeJars
  116. Skipping task ':mergeJars' as task onlyIf is false.
  117. :mergeJars SKIPPED
  118. :mergeJars (Thread[Daemon worker,5,main]) completed. Took 1.09 secs.
  119. :deobfMcSRG (Thread[Daemon worker,5,main]) started.
  120. :deobfMcSRG
  121. Skipping task ':deobfMcSRG' as task onlyIf is false.
  122. :deobfMcSRG SKIPPED
  123. :deobfMcSRG (Thread[Daemon worker,5,main]) completed. Took 0.881 secs.
  124. :decompileMc (Thread[Daemon worker,5,main]) started.
  125. :decompileMc
  126. Skipping task ':decompileMc' as task onlyIf is false.
  127. :decompileMc SKIPPED
  128. :decompileMc (Thread[Daemon worker,5,main]) completed. Took 0.817 secs.
  129. :fixMcSources (Thread[Daemon worker,5,main]) started.
  130. :fixMcSources
  131. Skipping task ':fixMcSources' as task onlyIf is false.
  132. :fixMcSources SKIPPED
  133. :fixMcSources (Thread[Daemon worker,5,main]) completed. Took 2.168 secs.
  134. :applySourcePatches (Thread[Daemon worker,5,main]) started.
  135. :applySourcePatches
  136. Skipping task ':applySourcePatches' as task onlyIf is false.
  137. :applySourcePatches SKIPPED
  138. :applySourcePatches (Thread[Daemon worker,5,main]) completed. Took 0.804 secs.
  139. :remapMcSources (Thread[Daemon worker,5,main]) started.
  140. :remapMcSources
  141. Skipping task ':remapMcSources' as task onlyIf is false.
  142. :remapMcSources SKIPPED
  143. :remapMcSources (Thread[Daemon worker,5,main]) completed. Took 0.844 secs.
  144. :recompileMc (Thread[Daemon worker,5,main]) started.
  145. :recompileMc
  146. No output file found.
  147. Executing task ':recompileMc' (up-to-date check took 0.001 secs) due to:
  148.   No history is available.
  149. [ant:javac] Compiling 2828 source files to D:\D\Minecraft related\forge 1.12 workspace\build\tmp\recompileMc\compiled
  150. [ant:javac] C:\Users\wjg\.gradle\caches\modules-2\files-2.1\com.google.guava\guava\21.0\3a3d111be1be1b745edfa7d91678a12d7ed38709\guava-21.0.jar(com/go
  151. ogle/common/collect/Multimap.class): warning: Cannot find annotation method 'value()' in type 'CompatibleWith': class file for com.google.errorprone.a
  152. nnotations.CompatibleWith not found
  153. [ant:javac] C:\Users\wjg\.gradle\caches\modules-2\files-2.1\com.google.guava\guava\21.0\3a3d111be1be1b745edfa7d91678a12d7ed38709\guava-21.0.jar(com/go
  154. ogle/common/collect/Multimap.class): warning: Cannot find annotation method 'value()' in type 'CompatibleWith'
  155. [ant:javac] C:\Users\wjg\.gradle\caches\modules-2\files-2.1\com.google.guava\guava\21.0\3a3d111be1be1b745edfa7d91678a12d7ed38709\guava-21.0.jar(com/go
  156. ogle/common/collect/Multimap.class): warning: Cannot find annotation method 'value()' in type 'CompatibleWith'
  157. [ant:javac] C:\Users\wjg\.gradle\caches\modules-2\files-2.1\com.google.guava\guava\21.0\3a3d111be1be1b745edfa7d91678a12d7ed38709\guava-21.0.jar(com/go
  158. ogle/common/collect/Multimap.class): warning: Cannot find annotation method 'value()' in type 'CompatibleWith'
  159. [ant:javac] C:\Users\wjg\.gradle\caches\modules-2\files-2.1\com.google.guava\guava\21.0\3a3d111be1be1b745edfa7d91678a12d7ed38709\guava-21.0.jar(com/go
  160. ogle/common/collect/Multimap.class): warning: Cannot find annotation method 'value()' in type 'CompatibleWith'
  161. [ant:javac] C:\Users\wjg\.gradle\caches\modules-2\files-2.1\com.google.guava\guava\21.0\3a3d111be1be1b745edfa7d91678a12d7ed38709\guava-21.0.jar(com/go
  162. ogle/common/collect/Multimap.class): warning: Cannot find annotation method 'value()' in type 'CompatibleWith'
  163. [ant:javac] C:\Users\wjg\.gradle\caches\modules-2\files-2.1\com.google.guava\guava\21.0\3a3d111be1be1b745edfa7d91678a12d7ed38709\guava-21.0.jar(com/go
  164. ogle/common/collect/Multimap.class): warning: Cannot find annotation method 'value()' in type 'CompatibleWith'
  165. [ant:javac] C:\Users\wjg\.gradle\caches\modules-2\files-2.1\com.google.guava\guava\21.0\3a3d111be1be1b745edfa7d91678a12d7ed38709\guava-21.0.jar(com/go
  166. ogle/common/collect/Table.class): warning: Cannot find annotation method 'value()' in type 'CompatibleWith'
  167. [ant:javac] C:\Users\wjg\.gradle\caches\modules-2\files-2.1\com.google.guava\guava\21.0\3a3d111be1be1b745edfa7d91678a12d7ed38709\guava-21.0.jar(com/go
  168. ogle/common/collect/Table.class): warning: Cannot find annotation method 'value()' in type 'CompatibleWith'
  169. [ant:javac] C:\Users\wjg\.gradle\caches\modules-2\files-2.1\com.google.guava\guava\21.0\3a3d111be1be1b745edfa7d91678a12d7ed38709\guava-21.0.jar(com/go
  170. ogle/common/collect/Table.class): warning: Cannot find annotation method 'value()' in type 'CompatibleWith'
  171. [ant:javac] C:\Users\wjg\.gradle\caches\modules-2\files-2.1\com.google.guava\guava\21.0\3a3d111be1be1b745edfa7d91678a12d7ed38709\guava-21.0.jar(com/go
  172. ogle/common/collect/Table.class): warning: Cannot find annotation method 'value()' in type 'CompatibleWith'
  173. [ant:javac] C:\Users\wjg\.gradle\caches\modules-2\files-2.1\com.google.guava\guava\21.0\3a3d111be1be1b745edfa7d91678a12d7ed38709\guava-21.0.jar(com/go
  174. ogle/common/collect/Table.class): warning: Cannot find annotation method 'value()' in type 'CompatibleWith'
  175. [ant:javac] C:\Users\wjg\.gradle\caches\modules-2\files-2.1\com.google.guava\guava\21.0\3a3d111be1be1b745edfa7d91678a12d7ed38709\guava-21.0.jar(com/go
  176. ogle/common/collect/Table.class): warning: Cannot find annotation method 'value()' in type 'CompatibleWith'
  177. [ant:javac] C:\Users\wjg\.gradle\caches\modules-2\files-2.1\com.google.guava\guava\21.0\3a3d111be1be1b745edfa7d91678a12d7ed38709\guava-21.0.jar(com/go
  178. ogle/common/collect/Table.class): warning: Cannot find annotation method 'value()' in type 'CompatibleWith'
  179. [ant:javac] C:\Users\wjg\.gradle\caches\modules-2\files-2.1\com.google.guava\guava\21.0\3a3d111be1be1b745edfa7d91678a12d7ed38709\guava-21.0.jar(com/go
  180. ogle/common/collect/Table.class): warning: Cannot find annotation method 'value()' in type 'CompatibleWith'
  181. [ant:javac] C:\Users\wjg\.gradle\caches\modules-2\files-2.1\com.google.guava\guava\21.0\3a3d111be1be1b745edfa7d91678a12d7ed38709\guava-21.0.jar(com/go
  182. ogle/common/collect/Table.class): warning: Cannot find annotation method 'value()' in type 'CompatibleWith'
  183. [ant:javac] C:\Users\wjg\.gradle\caches\modules-2\files-2.1\com.google.guava\guava\21.0\3a3d111be1be1b745edfa7d91678a12d7ed38709\guava-21.0.jar(com/go
  184. ogle/common/collect/Multiset.class): warning: Cannot find annotation method 'value()' in type 'CompatibleWith'
  185. [ant:javac] C:\Users\wjg\.gradle\caches\modules-2\files-2.1\com.google.guava\guava\21.0\3a3d111be1be1b745edfa7d91678a12d7ed38709\guava-21.0.jar(com/go
  186. ogle/common/collect/Multiset.class): warning: Cannot find annotation method 'value()' in type 'CompatibleWith'
  187. [ant:javac] C:\Users\wjg\.gradle\caches\modules-2\files-2.1\com.google.guava\guava\21.0\3a3d111be1be1b745edfa7d91678a12d7ed38709\guava-21.0.jar(com/go
  188. ogle/common/collect/Multimap.class): warning: Cannot find annotation method 'value()' in type 'CompatibleWith': class file for com.google.errorprone.a
  189. nnotations.CompatibleWith not found
  190. [ant:javac] C:\Users\wjg\.gradle\caches\modules-2\files-2.1\com.google.guava\guava\21.0\3a3d111be1be1b745edfa7d91678a12d7ed38709\guava-21.0.jar(com/go
  191. ogle/common/collect/Multimap.class): warning: Cannot find annotation method 'value()' in type 'CompatibleWith'
  192. [ant:javac] C:\Users\wjg\.gradle\caches\modules-2\files-2.1\com.google.guava\guava\21.0\3a3d111be1be1b745edfa7d91678a12d7ed38709\guava-21.0.jar(com/go
  193. ogle/common/collect/Multimap.class): warning: Cannot find annotation method 'value()' in type 'CompatibleWith'
  194. [ant:javac] C:\Users\wjg\.gradle\caches\modules-2\files-2.1\com.google.guava\guava\21.0\3a3d111be1be1b745edfa7d91678a12d7ed38709\guava-21.0.jar(com/go
  195. ogle/common/collect/Multimap.class): warning: Cannot find annotation method 'value()' in type 'CompatibleWith'
  196. [ant:javac] C:\Users\wjg\.gradle\caches\modules-2\files-2.1\com.google.guava\guava\21.0\3a3d111be1be1b745edfa7d91678a12d7ed38709\guava-21.0.jar(com/go
  197. ogle/common/collect/Multimap.class): warning: Cannot find annotation method 'value()' in type 'CompatibleWith'
  198. [ant:javac] C:\Users\wjg\.gradle\caches\modules-2\files-2.1\com.google.guava\guava\21.0\3a3d111be1be1b745edfa7d91678a12d7ed38709\guava-21.0.jar(com/go
  199. ogle/common/collect/Multimap.class): warning: Cannot find annotation method 'value()' in type 'CompatibleWith'
  200. [ant:javac] C:\Users\wjg\.gradle\caches\modules-2\files-2.1\com.google.guava\guava\21.0\3a3d111be1be1b745edfa7d91678a12d7ed38709\guava-21.0.jar(com/go
  201. ogle/common/collect/Multimap.class): warning: Cannot find annotation method 'value()' in type 'CompatibleWith'
  202. [ant:javac] C:\Users\wjg\.gradle\caches\modules-2\files-2.1\com.google.guava\guava\21.0\3a3d111be1be1b745edfa7d91678a12d7ed38709\guava-21.0.jar(com/go
  203. ogle/common/collect/Table.class): warning: Cannot find annotation method 'value()' in type 'CompatibleWith'
  204. [ant:javac] C:\Users\wjg\.gradle\caches\modules-2\files-2.1\com.google.guava\guava\21.0\3a3d111be1be1b745edfa7d91678a12d7ed38709\guava-21.0.jar(com/go
  205. ogle/common/collect/Table.class): warning: Cannot find annotation method 'value()' in type 'CompatibleWith'
  206. [ant:javac] C:\Users\wjg\.gradle\caches\modules-2\files-2.1\com.google.guava\guava\21.0\3a3d111be1be1b745edfa7d91678a12d7ed38709\guava-21.0.jar(com/go
  207. ogle/common/collect/Table.class): warning: Cannot find annotation method 'value()' in type 'CompatibleWith'
  208. [ant:javac] C:\Users\wjg\.gradle\caches\modules-2\files-2.1\com.google.guava\guava\21.0\3a3d111be1be1b745edfa7d91678a12d7ed38709\guava-21.0.jar(com/go
  209. ogle/common/collect/Table.class): warning: Cannot find annotation method 'value()' in type 'CompatibleWith'
  210. [ant:javac] C:\Users\wjg\.gradle\caches\modules-2\files-2.1\com.google.guava\guava\21.0\3a3d111be1be1b745edfa7d91678a12d7ed38709\guava-21.0.jar(com/go
  211. ogle/common/collect/Table.class): warning: Cannot find annotation method 'value()' in type 'CompatibleWith'
  212. [ant:javac] C:\Users\wjg\.gradle\caches\modules-2\files-2.1\com.google.guava\guava\21.0\3a3d111be1be1b745edfa7d91678a12d7ed38709\guava-21.0.jar(com/go
  213. ogle/common/collect/Table.class): warning: Cannot find annotation method 'value()' in type 'CompatibleWith'
  214. [ant:javac] C:\Users\wjg\.gradle\caches\modules-2\files-2.1\com.google.guava\guava\21.0\3a3d111be1be1b745edfa7d91678a12d7ed38709\guava-21.0.jar(com/go
  215. ogle/common/collect/Table.class): warning: Cannot find annotation method 'value()' in type 'CompatibleWith'
  216. [ant:javac] C:\Users\wjg\.gradle\caches\modules-2\files-2.1\com.google.guava\guava\21.0\3a3d111be1be1b745edfa7d91678a12d7ed38709\guava-21.0.jar(com/go
  217. ogle/common/collect/Table.class): warning: Cannot find annotation method 'value()' in type 'CompatibleWith'
  218. [ant:javac] C:\Users\wjg\.gradle\caches\modules-2\files-2.1\com.google.guava\guava\21.0\3a3d111be1be1b745edfa7d91678a12d7ed38709\guava-21.0.jar(com/go
  219. ogle/common/collect/Table.class): warning: Cannot find annotation method 'value()' in type 'CompatibleWith'
  220. [ant:javac] C:\Users\wjg\.gradle\caches\modules-2\files-2.1\com.google.guava\guava\21.0\3a3d111be1be1b745edfa7d91678a12d7ed38709\guava-21.0.jar(com/go
  221. ogle/common/collect/Multiset.class): warning: Cannot find annotation method 'value()' in type 'CompatibleWith'
  222. [ant:javac] C:\Users\wjg\.gradle\caches\modules-2\files-2.1\com.google.guava\guava\21.0\3a3d111be1be1b745edfa7d91678a12d7ed38709\guava-21.0.jar(com/go
  223. ogle/common/collect/Multiset.class): warning: Cannot find annotation method 'value()' in type 'CompatibleWith'
  224. [ant:javac] C:\Users\wjg\.gradle\caches\modules-2\files-2.1\com.google.guava\guava\21.0\3a3d111be1be1b745edfa7d91678a12d7ed38709\guava-21.0.jar(com/go
  225. ogle/common/collect/Multimap.class): warning: Cannot find annotation method 'value()' in type 'CompatibleWith': class file for com.google.errorprone.a
  226. nnotations.CompatibleWith not found
  227. [ant:javac] C:\Users\wjg\.gradle\caches\modules-2\files-2.1\com.google.guava\guava\21.0\3a3d111be1be1b745edfa7d91678a12d7ed38709\guava-21.0.jar(com/go
  228. ogle/common/collect/Multimap.class): warning: Cannot find annotation method 'value()' in type 'CompatibleWith'
  229. [ant:javac] C:\Users\wjg\.gradle\caches\modules-2\files-2.1\com.google.guava\guava\21.0\3a3d111be1be1b745edfa7d91678a12d7ed38709\guava-21.0.jar(com/go
  230. ogle/common/collect/Multimap.class): warning: Cannot find annotation method 'value()' in type 'CompatibleWith'
  231. [ant:javac] C:\Users\wjg\.gradle\caches\modules-2\files-2.1\com.google.guava\guava\21.0\3a3d111be1be1b745edfa7d91678a12d7ed38709\guava-21.0.jar(com/go
  232. ogle/common/collect/Multimap.class): warning: Cannot find annotation method 'value()' in type 'CompatibleWith'
  233. [ant:javac] C:\Users\wjg\.gradle\caches\modules-2\files-2.1\com.google.guava\guava\21.0\3a3d111be1be1b745edfa7d91678a12d7ed38709\guava-21.0.jar(com/go
  234. ogle/common/collect/Multimap.class): warning: Cannot find annotation method 'value()' in type 'CompatibleWith'
  235. [ant:javac] C:\Users\wjg\.gradle\caches\modules-2\files-2.1\com.google.guava\guava\21.0\3a3d111be1be1b745edfa7d91678a12d7ed38709\guava-21.0.jar(com/go
  236. ogle/common/collect/Multimap.class): warning: Cannot find annotation method 'value()' in type 'CompatibleWith'
  237. [ant:javac] C:\Users\wjg\.gradle\caches\modules-2\files-2.1\com.google.guava\guava\21.0\3a3d111be1be1b745edfa7d91678a12d7ed38709\guava-21.0.jar(com/go
  238. ogle/common/collect/Multimap.class): warning: Cannot find annotation method 'value()' in type 'CompatibleWith'
  239. [ant:javac] C:\Users\wjg\.gradle\caches\modules-2\files-2.1\com.google.guava\guava\21.0\3a3d111be1be1b745edfa7d91678a12d7ed38709\guava-21.0.jar(com/go
  240. ogle/common/collect/Table.class): warning: Cannot find annotation method 'value()' in type 'CompatibleWith'
  241. [ant:javac] C:\Users\wjg\.gradle\caches\modules-2\files-2.1\com.google.guava\guava\21.0\3a3d111be1be1b745edfa7d91678a12d7ed38709\guava-21.0.jar(com/go
  242. ogle/common/collect/Table.class): warning: Cannot find annotation method 'value()' in type 'CompatibleWith'
  243. [ant:javac] C:\Users\wjg\.gradle\caches\modules-2\files-2.1\com.google.guava\guava\21.0\3a3d111be1be1b745edfa7d91678a12d7ed38709\guava-21.0.jar(com/go
  244. ogle/common/collect/Table.class): warning: Cannot find annotation method 'value()' in type 'CompatibleWith'
  245. [ant:javac] C:\Users\wjg\.gradle\caches\modules-2\files-2.1\com.google.guava\guava\21.0\3a3d111be1be1b745edfa7d91678a12d7ed38709\guava-21.0.jar(com/go
  246. ogle/common/collect/Table.class): warning: Cannot find annotation method 'value()' in type 'CompatibleWith'
  247. [ant:javac] C:\Users\wjg\.gradle\caches\modules-2\files-2.1\com.google.guava\guava\21.0\3a3d111be1be1b745edfa7d91678a12d7ed38709\guava-21.0.jar(com/go
  248. ogle/common/collect/Table.class): warning: Cannot find annotation method 'value()' in type 'CompatibleWith'
  249. [ant:javac] C:\Users\wjg\.gradle\caches\modules-2\files-2.1\com.google.guava\guava\21.0\3a3d111be1be1b745edfa7d91678a12d7ed38709\guava-21.0.jar(com/go
  250. ogle/common/collect/Table.class): warning: Cannot find annotation method 'value()' in type 'CompatibleWith'
  251. [ant:javac] C:\Users\wjg\.gradle\caches\modules-2\files-2.1\com.google.guava\guava\21.0\3a3d111be1be1b745edfa7d91678a12d7ed38709\guava-21.0.jar(com/go
  252. ogle/common/collect/Table.class): warning: Cannot find annotation method 'value()' in type 'CompatibleWith'
  253. [ant:javac] C:\Users\wjg\.gradle\caches\modules-2\files-2.1\com.google.guava\guava\21.0\3a3d111be1be1b745edfa7d91678a12d7ed38709\guava-21.0.jar(com/go
  254. ogle/common/collect/Table.class): warning: Cannot find annotation method 'value()' in type 'CompatibleWith'
  255. [ant:javac] C:\Users\wjg\.gradle\caches\modules-2\files-2.1\com.google.guava\guava\21.0\3a3d111be1be1b745edfa7d91678a12d7ed38709\guava-21.0.jar(com/go
  256. ogle/common/collect/Table.class): warning: Cannot find annotation method 'value()' in type 'CompatibleWith'
  257. [ant:javac] C:\Users\wjg\.gradle\caches\modules-2\files-2.1\com.google.guava\guava\21.0\3a3d111be1be1b745edfa7d91678a12d7ed38709\guava-21.0.jar(com/go
  258. ogle/common/collect/Multiset.class): warning: Cannot find annotation method 'value()' in type 'CompatibleWith'
  259. [ant:javac] C:\Users\wjg\.gradle\caches\modules-2\files-2.1\com.google.guava\guava\21.0\3a3d111be1be1b745edfa7d91678a12d7ed38709\guava-21.0.jar(com/go
  260. ogle/common/collect/Multiset.class): warning: Cannot find annotation method 'value()' in type 'CompatibleWith'
  261. [ant:javac] D:\D\Minecraft related\forge 1.12 workspace\build\tmp\recompileMc\sources\net\minecraftforge\fml\common\Loader.java:249: error: no suitabl
  262. e method found for uniqueIndex(Set<ArtifactVersion>,ArtifactVe[...]Label)
  263. [ant:javac]                 Map<String,ArtifactVersion> names = Maps.uniqueIndex(mod.getRequirements(), ArtifactVersion::getLabel);
  264. [ant:javac]                                                         ^
  265. [ant:javac]     method Maps.<K#1,V#1>uniqueIndex(Iterable<V#1>,Function<? super V#1,K#1>) is not applicable
  266. [ant:javac]       (cannot infer type-variable(s) K#1,V#1
  267. [ant:javac]         (argument mismatch; invalid method reference
  268. [ant:javac]           method getLabel in interface ArtifactVersion cannot be applied to given types
  269. [ant:javac]             required: no arguments
  270. [ant:javac]             found: ? super V#1
  271. [ant:javac]             reason: actual and formal argument lists differ in length))
  272. [ant:javac]     method Maps.<K#2,V#2>uniqueIndex(Iterator<V#2>,Function<? super V#2,K#2>) is not applicable
  273. [ant:javac]       (cannot infer type-variable(s) K#2,V#2
  274. [ant:javac]         (argument mismatch; Set<ArtifactVersion> cannot be converted to Iterator<V#2>))
  275. [ant:javac]   where K#1,V#1,K#2,V#2 are type-variables:
  276. [ant:javac]     K#1 extends Object declared in method <K#1,V#1>uniqueIndex(Iterable<V#1>,Function<? super V#1,K#1>)
  277. [ant:javac]     V#1 extends Object declared in method <K#1,V#1>uniqueIndex(Iterable<V#1>,Function<? super V#1,K#1>)
  278. [ant:javac]     K#2 extends Object declared in method <K#2,V#2>uniqueIndex(Iterator<V#2>,Function<? super V#2,K#2>)
  279. [ant:javac]     V#2 extends Object declared in method <K#2,V#2>uniqueIndex(Iterator<V#2>,Function<? super V#2,K#2>)
  280. [ant:javac] D:\D\Minecraft related\forge 1.12 workspace\build\tmp\recompileMc\sources\net\minecraftforge\fml\common\Loader.java:249: error: invalid me
  281. thod reference
  282. [ant:javac]                 Map<String,ArtifactVersion> names = Maps.uniqueIndex(mod.getRequirements(), ArtifactVersion::getLabel);
  283. [ant:javac]                                                                                             ^
  284. [ant:javac]   non-static method getLabel() cannot be referenced from a static context
  285. [ant:javac] D:\D\Minecraft related\forge 1.12 workspace\build\tmp\recompileMc\sources\net\minecraftforge\fml\common\Loader.java:405: error: no suitabl
  286. e method found for uniqueIndex(List<ModContainer>,ModContain[...]ModId)
  287. [ant:javac]         namedMods = Maps.uniqueIndex(mods, ModContainer::getModId);
  288. [ant:javac]                         ^
  289. [ant:javac]     method Maps.<K#1,V#1>uniqueIndex(Iterable<V#1>,Function<? super V#1,K#1>) is not applicable
  290. [ant:javac]       (cannot infer type-variable(s) K#1,V#1
  291. [ant:javac]         (argument mismatch; invalid method reference
  292. [ant:javac]           method getModId in interface ModContainer cannot be applied to given types
  293. [ant:javac]             required: no arguments
  294. [ant:javac]             found: ? super V#1
  295. [ant:javac]             reason: actual and formal argument lists differ in length))
  296. [ant:javac]     method Maps.<K#2,V#2>uniqueIndex(Iterator<V#2>,Function<? super V#2,K#2>) is not applicable
  297. [ant:javac]       (cannot infer type-variable(s) K#2,V#2
  298. [ant:javac]         (argument mismatch; List<ModContainer> cannot be converted to Iterator<V#2>))
  299. [ant:javac]   where K#1,V#1,K#2,V#2 are type-variables:
  300. [ant:javac]     K#1 extends Object declared in method <K#1,V#1>uniqueIndex(Iterable<V#1>,Function<? super V#1,K#1>)
  301. [ant:javac]     V#1 extends Object declared in method <K#1,V#1>uniqueIndex(Iterable<V#1>,Function<? super V#1,K#1>)
  302. [ant:javac]     K#2 extends Object declared in method <K#2,V#2>uniqueIndex(Iterator<V#2>,Function<? super V#2,K#2>)
  303. [ant:javac]     V#2 extends Object declared in method <K#2,V#2>uniqueIndex(Iterator<V#2>,Function<? super V#2,K#2>)
  304. [ant:javac] D:\D\Minecraft related\forge 1.12 workspace\build\tmp\recompileMc\sources\net\minecraftforge\fml\common\Loader.java:405: error: invalid me
  305. thod reference
  306. [ant:javac]         namedMods = Maps.uniqueIndex(mods, ModContainer::getModId);
  307. [ant:javac]                                            ^
  308. [ant:javac]   non-static method getModId() cannot be referenced from a static context
  309. [ant:javac] D:\D\Minecraft related\forge 1.12 workspace\build\tmp\recompileMc\sources\net\minecraftforge\fml\common\Loader.java:522: error: no suitabl
  310. e method found for uniqueIndex(List<ModContainer>,ModContain[...]ModId)
  311. [ant:javac]         namedMods = Maps.uniqueIndex(mods, ModContainer::getModId);
  312. [ant:javac]                         ^
  313. [ant:javac]     method Maps.<K#1,V#1>uniqueIndex(Iterable<V#1>,Function<? super V#1,K#1>) is not applicable
  314. [ant:javac]       (cannot infer type-variable(s) K#1,V#1
  315. [ant:javac]         (argument mismatch; invalid method reference
  316. [ant:javac]           method getModId in interface ModContainer cannot be applied to given types
  317. [ant:javac]             required: no arguments
  318. [ant:javac]             found: ? super V#1
  319. [ant:javac]             reason: actual and formal argument lists differ in length))
  320. [ant:javac]     method Maps.<K#2,V#2>uniqueIndex(Iterator<V#2>,Function<? super V#2,K#2>) is not applicable
  321. [ant:javac]       (cannot infer type-variable(s) K#2,V#2
  322. [ant:javac]         (argument mismatch; List<ModContainer> cannot be converted to Iterator<V#2>))
  323. [ant:javac]   where K#1,V#1,K#2,V#2 are type-variables:
  324. [ant:javac]     K#1 extends Object declared in method <K#1,V#1>uniqueIndex(Iterable<V#1>,Function<? super V#1,K#1>)
  325. [ant:javac]     V#1 extends Object declared in method <K#1,V#1>uniqueIndex(Iterable<V#1>,Function<? super V#1,K#1>)
  326. [ant:javac]     K#2 extends Object declared in method <K#2,V#2>uniqueIndex(Iterator<V#2>,Function<? super V#2,K#2>)
  327. [ant:javac]     V#2 extends Object declared in method <K#2,V#2>uniqueIndex(Iterator<V#2>,Function<? super V#2,K#2>)
  328. [ant:javac] D:\D\Minecraft related\forge 1.12 workspace\build\tmp\recompileMc\sources\net\minecraftforge\fml\common\Loader.java:522: error: invalid me
  329. thod reference
  330. [ant:javac]         namedMods = Maps.uniqueIndex(mods, ModContainer::getModId);
  331. [ant:javac]                                            ^
  332. [ant:javac]   non-static method getModId() cannot be referenced from a static context
  333. [ant:javac] D:\D\Minecraft related\forge 1.12 workspace\build\tmp\recompileMc\sources\net\minecraftforge\fml\common\Loader.java:642: error: no suitabl
  334. e method found for transformValues(Map<String,String>,Boolean::p[...]olean)
  335. [ant:javac]         Map<String, Boolean> isEnabled = Maps.transformValues(modStates, Boolean::parseBoolean);
  336. [ant:javac]                                              ^
  337. [ant:javac]     method Maps.<K#1,V1#1,V2#1>transformValues(Map<K#1,V1#1>,Function<? super V1#1,V2#1>) is not applicable
  338. [ant:javac]       (cannot infer type-variable(s) K#1,V1#1,V2#1
  339. [ant:javac]         (argument mismatch; invalid method reference
  340. [ant:javac]           incompatible types: Object cannot be converted to String))
  341. [ant:javac]     method Maps.<K#2,V1#2,V2#2>transformValues(SortedMap<K#2,V1#2>,Function<? super V1#2,V2#2>) is not applicable
  342. [ant:javac]       (cannot infer type-variable(s) K#2,V1#2,V2#2
  343. [ant:javac]         (argument mismatch; Map<String,String> cannot be converted to SortedMap<K#2,V1#2>))
  344. [ant:javac]     method Maps.<K#3,V1#3,V2#3>transformValues(NavigableMap<K#3,V1#3>,Function<? super V1#3,V2#3>) is not applicable
  345. [ant:javac]       (cannot infer type-variable(s) K#3,V1#3,V2#3
  346. [ant:javac]         (argument mismatch; Map<String,String> cannot be converted to NavigableMap<K#3,V1#3>))
  347. [ant:javac]   where K#1,V1#1,V2#1,K#2,V1#2,V2#2,K#3,V1#3,V2#3 are type-variables:
  348. [ant:javac]     K#1 extends Object declared in method <K#1,V1#1,V2#1>transformValues(Map<K#1,V1#1>,Function<? super V1#1,V2#1>)
  349. [ant:javac]     V1#1 extends Object declared in method <K#1,V1#1,V2#1>transformValues(Map<K#1,V1#1>,Function<? super V1#1,V2#1>)
  350. [ant:javac]     V2#1 extends Object declared in method <K#1,V1#1,V2#1>transformValues(Map<K#1,V1#1>,Function<? super V1#1,V2#1>)
  351. [ant:javac]     K#2 extends Object declared in method <K#2,V1#2,V2#2>transformValues(SortedMap<K#2,V1#2>,Function<? super V1#2,V2#2>)
  352. [ant:javac]     V1#2 extends Object declared in method <K#2,V1#2,V2#2>transformValues(SortedMap<K#2,V1#2>,Function<? super V1#2,V2#2>)
  353. [ant:javac]     V2#2 extends Object declared in method <K#2,V1#2,V2#2>transformValues(SortedMap<K#2,V1#2>,Function<? super V1#2,V2#2>)
  354. [ant:javac]     K#3 extends Object declared in method <K#3,V1#3,V2#3>transformValues(NavigableMap<K#3,V1#3>,Function<? super V1#3,V2#3>)
  355. [ant:javac]     V1#3 extends Object declared in method <K#3,V1#3,V2#3>transformValues(NavigableMap<K#3,V1#3>,Function<? super V1#3,V2#3>)
  356. [ant:javac]     V2#3 extends Object declared in method <K#3,V1#3,V2#3>transformValues(NavigableMap<K#3,V1#3>,Function<? super V1#3,V2#3>)
  357. [ant:javac] D:\D\Minecraft related\forge 1.12 workspace\build\tmp\recompileMc\sources\net\minecraftforge\client\model\b3d\B3DModel.java:479: error: in
  358. compatible types: inference variable K has incompatible bounds
  359. [ant:javac]             else if(bone != null) node = Node.create(name, pos, scale, rot, nodes, new Bone(bone));
  360. [ant:javac]                                                     ^
  361. [ant:javac]     equality constraints: Bone
  362. [ant:javac]     upper bounds: IKind<CAP#1>,IKind<K>
  363. [ant:javac]   where K is a type-variable:
  364. [ant:javac]     K extends IKind<K> declared in method <K>create(String,Vector3f,Vector3f,Quat4f,List<Node<?>>,K)
  365. [ant:javac]   where CAP#1 is a fresh type-variable:
  366. [ant:javac]     CAP#1 extends IKind<CAP#1> from capture of ?
  367. [ant:javac] D:\D\Minecraft related\forge 1.12 workspace\build\tmp\recompileMc\sources\net\minecraftforge\client\model\b3d\B3DModel.java:480: error: in
  368. compatible types: inference variable K has incompatible bounds
  369. [ant:javac]             else node = Node.create(name, pos, scale, rot, nodes, new Pivot());
  370. [ant:javac]                                    ^
  371. [ant:javac]     equality constraints: Pivot
  372. [ant:javac]     upper bounds: IKind<CAP#1>,IKind<K>
  373. [ant:javac]   where K is a type-variable:
  374. [ant:javac]     K extends IKind<K> declared in method <K>create(String,Vector3f,Vector3f,Quat4f,List<Node<?>>,K)
  375. [ant:javac]   where CAP#1 is a fresh type-variable:
  376. [ant:javac]     CAP#1 extends IKind<CAP#1> from capture of ?
  377. [ant:javac] D:\D\Minecraft related\forge 1.12 workspace\build\tmp\recompileMc\sources\net\minecraftforge\common\model\animation\AnimationStateMachine.
  378. java:96: error: incompatible types: no instance(s) of type variable(s) E exist so that HashSet<E> conforms to ? extends Set<V>
  379. [ant:javac]         this(parameters, clips, states, ImmutableMultimap.copyOf(Multimaps.newSetMultimap(Maps.transformValues(transitions, ImmutableSet::
  380. of), Sets::newHashSet)), startState);
  381. [ant:javac]                                                                                          ^
  382. [ant:javac]   where E,V,K are type-variables:
  383. [ant:javac]     E extends Object declared in method <E>newHashSet()
  384. [ant:javac]     V extends Object declared in method <K,V>newSetMultimap(Map<K,Collection<V>>,Supplier<? extends Set<V>>)
  385. [ant:javac]     K extends Object declared in method <K,V>newSetMultimap(Map<K,Collection<V>>,Supplier<? extends Set<V>>)
  386. [ant:javac] D:\D\Minecraft related\forge 1.12 workspace\build\tmp\recompileMc\sources\net\minecraftforge\common\model\animation\AnimationStateMachine.
  387. java:94: error: recursive constructor invocation
  388. [ant:javac]     public AnimationStateMachine(ImmutableMap<String, ITimeValue> parameters, ImmutableMap<String, IClip> clips, ImmutableList<String> sta
  389. tes, ImmutableMap<String, String> transitions, String startState)
  390. [ant:javac]            ^
  391. [ant:javac] D:\D\Minecraft related\forge 1.12 workspace\build\tmp\recompileMc\sources\net\minecraftforge\registries\GameData.java:539: error: incompat
  392. ible types: inferred type does not conform to upper bound(s)
  393. [ant:javac]                 ForgeRegistry<?> reg = STAGING.getRegistry(key);
  394. [ant:javac]                                                           ^
  395. [ant:javac]     inferred: IForgeRegistryEntry<CAP#1>
  396. [ant:javac]     upper bound(s): IForgeRegistryEntry<IForgeRegistryEntry<CAP#1>>,IForgeRegistryEntry<CAP#1>
  397. [ant:javac]   where CAP#1 is a fresh type-variable:
  398. [ant:javac]     CAP#1 extends IForgeRegistryEntry<CAP#1> from capture of ?
  399. [ant:javac] D:\D\Minecraft related\forge 1.12 workspace\build\tmp\recompileMc\sources\net\minecraftforge\registries\GameData.java:573: error: incompat
  400. ible types: inferred type does not conform to upper bound(s)
  401. [ant:javac]                 ForgeRegistry<?> reg = STAGING.getRegistry(name);
  402. [ant:javac]                                                           ^
  403. [ant:javac]     inferred: IForgeRegistryEntry<CAP#1>
  404. [ant:javac]     upper bound(s): IForgeRegistryEntry<IForgeRegistryEntry<CAP#1>>,IForgeRegistryEntry<CAP#1>
  405. [ant:javac]   where CAP#1 is a fresh type-variable:
  406. [ant:javac]     CAP#1 extends IForgeRegistryEntry<CAP#1> from capture of ?
  407. [ant:javac] D:\D\Minecraft related\forge 1.12 workspace\build\tmp\recompileMc\sources\net\minecraftforge\registries\GameData.java:644: error: incompat
  408. ible types: inferred type does not conform to upper bound(s)
  409. [ant:javac]                 ForgeRegistry<?> reg = STAGING.getRegistry(name);
  410. [ant:javac]                                                           ^
  411. [ant:javac]     inferred: IForgeRegistryEntry<CAP#1>
  412. [ant:javac]     upper bound(s): IForgeRegistryEntry<IForgeRegistryEntry<CAP#1>>,IForgeRegistryEntry<CAP#1>
  413. [ant:javac]   where CAP#1 is a fresh type-variable:
  414. [ant:javac]     CAP#1 extends IForgeRegistryEntry<CAP#1> from capture of ?
  415. [ant:javac] Note: Some input files use or override a deprecated API.
  416. [ant:javac] Note: Recompile with -Xlint:deprecation for details.
  417. [ant:javac] Note: Some input files use unchecked or unsafe operations.
  418. [ant:javac] Note: Recompile with -Xlint:unchecked for details.
  419. [ant:javac] 14 errors
  420. [ant:javac] 54 warnings
  421. :recompileMc FAILED
  422. :recompileMc (Thread[Daemon worker,5,main]) completed. Took 29.815 secs.
  423.  
  424. FAILURE: Build failed with an exception.
  425.  
  426. * What went wrong:
  427. Execution failed for task ':recompileMc'.
  428. > Compile failed; see the compiler error output for details.
  429.  
  430. * Try:
  431. Run with --debug option to get more log output.
  432.  
  433. * Exception is:
  434. org.gradle.api.tasks.TaskExecutionException: Execution failed for task ':recompileMc'.
  435.         at org.gradle.api.internal.tasks.execution.ExecuteActionsTaskExecuter.executeActions(ExecuteActionsTaskExecuter.java:69)
  436.         at org.gradle.api.internal.tasks.execution.ExecuteActionsTaskExecuter.execute(ExecuteActionsTaskExecuter.java:46)
  437.         at org.gradle.api.internal.tasks.execution.PostExecutionAnalysisTaskExecuter.execute(PostExecutionAnalysisTaskExecuter.java:35)
  438.         at org.gradle.api.internal.tasks.execution.SkipUpToDateTaskExecuter.execute(SkipUpToDateTaskExecuter.java:66)
  439.         at org.gradle.api.internal.tasks.execution.ValidatingTaskExecuter.execute(ValidatingTaskExecuter.java:58)
  440.         at org.gradle.api.internal.tasks.execution.SkipEmptySourceFilesTaskExecuter.execute(SkipEmptySourceFilesTaskExecuter.java:52)
  441.         at org.gradle.api.internal.tasks.execution.SkipTaskWithNoActionsExecuter.execute(SkipTaskWithNoActionsExecuter.java:52)
  442.         at org.gradle.api.internal.tasks.execution.SkipOnlyIfTaskExecuter.execute(SkipOnlyIfTaskExecuter.java:53)
  443.         at org.gradle.api.internal.tasks.execution.ExecuteAtMostOnceTaskExecuter.execute(ExecuteAtMostOnceTaskExecuter.java:43)
  444.         at org.gradle.execution.taskgraph.DefaultTaskGraphExecuter$EventFiringTaskWorker.execute(DefaultTaskGraphExecuter.java:203)
  445.         at org.gradle.execution.taskgraph.DefaultTaskGraphExecuter$EventFiringTaskWorker.execute(DefaultTaskGraphExecuter.java:185)
  446.         at org.gradle.execution.taskgraph.AbstractTaskPlanExecutor$TaskExecutorWorker.processTask(AbstractTaskPlanExecutor.java:66)
  447.         at org.gradle.execution.taskgraph.AbstractTaskPlanExecutor$TaskExecutorWorker.run(AbstractTaskPlanExecutor.java:50)
  448.         at org.gradle.execution.taskgraph.DefaultTaskPlanExecutor.process(DefaultTaskPlanExecutor.java:25)
  449.         at org.gradle.execution.taskgraph.DefaultTaskGraphExecuter.execute(DefaultTaskGraphExecuter.java:110)
  450.         at org.gradle.execution.SelectedTaskExecutionAction.execute(SelectedTaskExecutionAction.java:37)
  451.         at org.gradle.execution.DefaultBuildExecuter.execute(DefaultBuildExecuter.java:37)
  452.         at org.gradle.execution.DefaultBuildExecuter.access$000(DefaultBuildExecuter.java:23)
  453.         at org.gradle.execution.DefaultBuildExecuter$1.proceed(DefaultBuildExecuter.java:43)
  454.         at org.gradle.execution.DryRunBuildExecutionAction.execute(DryRunBuildExecutionAction.java:32)
  455.         at org.gradle.execution.DefaultBuildExecuter.execute(DefaultBuildExecuter.java:37)
  456.         at org.gradle.execution.DefaultBuildExecuter.execute(DefaultBuildExecuter.java:30)
  457.         at org.gradle.initialization.DefaultGradleLauncher$4.run(DefaultGradleLauncher.java:153)
  458.         at org.gradle.internal.Factories$1.create(Factories.java:22)
  459.         at org.gradle.internal.progress.DefaultBuildOperationExecutor.run(DefaultBuildOperationExecutor.java:91)
  460.         at org.gradle.internal.progress.DefaultBuildOperationExecutor.run(DefaultBuildOperationExecutor.java:53)
  461.         at org.gradle.initialization.DefaultGradleLauncher.doBuildStages(DefaultGradleLauncher.java:150)
  462.         at org.gradle.initialization.DefaultGradleLauncher.access$200(DefaultGradleLauncher.java:32)
  463.         at org.gradle.initialization.DefaultGradleLauncher$1.create(DefaultGradleLauncher.java:98)
  464.         at org.gradle.initialization.DefaultGradleLauncher$1.create(DefaultGradleLauncher.java:92)
  465.         at org.gradle.internal.progress.DefaultBuildOperationExecutor.run(DefaultBuildOperationExecutor.java:91)
  466.         at org.gradle.internal.progress.DefaultBuildOperationExecutor.run(DefaultBuildOperationExecutor.java:63)
  467.         at org.gradle.initialization.DefaultGradleLauncher.doBuild(DefaultGradleLauncher.java:92)
  468.         at org.gradle.initialization.DefaultGradleLauncher.run(DefaultGradleLauncher.java:83)
  469.         at org.gradle.launcher.exec.InProcessBuildActionExecuter$DefaultBuildController.run(InProcessBuildActionExecuter.java:99)
  470.         at org.gradle.tooling.internal.provider.ExecuteBuildActionRunner.run(ExecuteBuildActionRunner.java:28)
  471.         at org.gradle.launcher.exec.ChainingBuildActionRunner.run(ChainingBuildActionRunner.java:35)
  472.         at org.gradle.launcher.exec.InProcessBuildActionExecuter.execute(InProcessBuildActionExecuter.java:48)
  473.         at org.gradle.launcher.exec.InProcessBuildActionExecuter.execute(InProcessBuildActionExecuter.java:30)
  474.         at org.gradle.launcher.exec.ContinuousBuildActionExecuter.execute(ContinuousBuildActionExecuter.java:81)
  475.         at org.gradle.launcher.exec.ContinuousBuildActionExecuter.execute(ContinuousBuildActionExecuter.java:46)
  476.         at org.gradle.launcher.daemon.server.exec.ExecuteBuild.doBuild(ExecuteBuild.java:52)
  477.         at org.gradle.launcher.daemon.server.exec.BuildCommandOnly.execute(BuildCommandOnly.java:36)
  478.         at org.gradle.launcher.daemon.server.api.DaemonCommandExecution.proceed(DaemonCommandExecution.java:120)
  479.         at org.gradle.launcher.daemon.server.exec.WatchForDisconnection.execute(WatchForDisconnection.java:37)
  480.         at org.gradle.launcher.daemon.server.api.DaemonCommandExecution.proceed(DaemonCommandExecution.java:120)
  481.         at org.gradle.launcher.daemon.server.exec.ResetDeprecationLogger.execute(ResetDeprecationLogger.java:26)
  482.         at org.gradle.launcher.daemon.server.api.DaemonCommandExecution.proceed(DaemonCommandExecution.java:120)
  483.         at org.gradle.launcher.daemon.server.exec.RequestStopIfSingleUsedDaemon.execute(RequestStopIfSingleUsedDaemon.java:34)
  484.         at org.gradle.launcher.daemon.server.api.DaemonCommandExecution.proceed(DaemonCommandExecution.java:120)
  485.         at org.gradle.launcher.daemon.server.exec.ForwardClientInput$2.call(ForwardClientInput.java:74)
  486.         at org.gradle.launcher.daemon.server.exec.ForwardClientInput$2.call(ForwardClientInput.java:72)
  487.         at org.gradle.util.Swapper.swap(Swapper.java:38)
  488.         at org.gradle.launcher.daemon.server.exec.ForwardClientInput.execute(ForwardClientInput.java:72)
  489.         at org.gradle.launcher.daemon.server.api.DaemonCommandExecution.proceed(DaemonCommandExecution.java:120)
  490.         at org.gradle.launcher.daemon.server.health.DaemonHealthTracker.execute(DaemonHealthTracker.java:40)
  491.         at org.gradle.launcher.daemon.server.api.DaemonCommandExecution.proceed(DaemonCommandExecution.java:120)
  492.         at org.gradle.launcher.daemon.server.exec.LogToClient.doBuild(LogToClient.java:60)
  493.         at org.gradle.launcher.daemon.server.exec.BuildCommandOnly.execute(BuildCommandOnly.java:36)
  494.         at org.gradle.launcher.daemon.server.api.DaemonCommandExecution.proceed(DaemonCommandExecution.java:120)
  495.         at org.gradle.launcher.daemon.server.exec.EstablishBuildEnvironment.doBuild(EstablishBuildEnvironment.java:72)
  496.         at org.gradle.launcher.daemon.server.exec.BuildCommandOnly.execute(BuildCommandOnly.java:36)
  497.         at org.gradle.launcher.daemon.server.api.DaemonCommandExecution.proceed(DaemonCommandExecution.java:120)
  498.         at org.gradle.launcher.daemon.server.health.HintGCAfterBuild.execute(HintGCAfterBuild.java:41)
  499.         at org.gradle.launcher.daemon.server.api.DaemonCommandExecution.proceed(DaemonCommandExecution.java:120)
  500.         at org.gradle.launcher.daemon.server.exec.StartBuildOrRespondWithBusy$1.run(StartBuildOrRespondWithBusy.java:50)
  501.         at org.gradle.launcher.daemon.server.DaemonStateCoordinator$1.run(DaemonStateCoordinator.java:237)
  502.         at org.gradle.internal.concurrent.ExecutorPolicy$CatchAndRecordFailures.onExecute(ExecutorPolicy.java:54)
  503.         at org.gradle.internal.concurrent.StoppableExecutorImpl$1.run(StoppableExecutorImpl.java:40)
  504. Caused by: : Compile failed; see the compiler error output for details.
  505.         at org.apache.tools.ant.taskdefs.Javac.compile(Javac.java:1181)
  506.         at org.apache.tools.ant.taskdefs.Javac.execute(Javac.java:936)
  507.         at org.apache.tools.ant.UnknownElement.execute(UnknownElement.java:293)
  508.         at org.apache.tools.ant.dispatch.DispatchUtils.execute(DispatchUtils.java:106)
  509.         at org.gradle.api.internal.project.ant.BasicAntBuilder.nodeCompleted(BasicAntBuilder.java:78)
  510.         at org.gradle.api.internal.project.ant.BasicAntBuilder.doInvokeMethod(BasicAntBuilder.java:103)
  511.         at net.minecraftforge.gradle.user.TaskRecompileMc.doStuff(TaskRecompileMc.java:85)
  512.         at org.gradle.internal.reflect.JavaMethod.invoke(JavaMethod.java:75)
  513.         at org.gradle.api.internal.project.taskfactory.AnnotationProcessingTaskFactory$StandardTaskAction.doExecute(AnnotationProcessingTaskFactory.ja
  514. va:228)
  515.         at org.gradle.api.internal.project.taskfactory.AnnotationProcessingTaskFactory$StandardTaskAction.execute(AnnotationProcessingTaskFactory.java
  516. :221)
  517.         at org.gradle.api.internal.project.taskfactory.AnnotationProcessingTaskFactory$StandardTaskAction.execute(AnnotationProcessingTaskFactory.java
  518. :210)
  519.         at org.gradle.api.internal.AbstractTask$TaskActionWrapper.execute(AbstractTask.java:621)
  520.         at org.gradle.api.internal.AbstractTask$TaskActionWrapper.execute(AbstractTask.java:604)
  521.         at org.gradle.api.internal.tasks.execution.ExecuteActionsTaskExecuter.executeAction(ExecuteActionsTaskExecuter.java:80)
  522.         at org.gradle.api.internal.tasks.execution.ExecuteActionsTaskExecuter.executeActions(ExecuteActionsTaskExecuter.java:61)
  523.         ... 68 more
  524.  
  525.  
  526. BUILD FAILED
  527.  
  528. Total time: 51.376 secs
  529. Stopped 0 compiler daemon(s).
  530. Received result Failure[value=org.gradle.initialization.ReportedException: org.gradle.internal.exceptions.LocationAwareException: Execution failed for
  531.  task ':recompileMc'.] from daemon DaemonInfo{pid=1268, address=[7d3d9bc2-c848-4f23-ab7a-5b7aef2e3d4a port:58752, addresses:[/127.0.0.1, /0:0:0:0:0:0:
  532. 0:1]], idle=false, lastBusy=1511268809077, context=DefaultDaemonContext[uid=9906a16e-1ca8-4298-bf60-26e9832e4a26,javaHome=C:\Program Files\Java\jdk1.8
  533. .0,daemonRegistryDir=C:\Users\wjg\.gradle\daemon,pid=1268,idleTimeout=120000,daemonOpts=-Xmx3G,-Dfile.encoding=windows-1252,-Duser.country=NL,-Duser.l
  534. anguage=nl,-Duser.variant]} (build should be done).
RAW Paste Data
We use cookies for various purposes including analytics. By continuing to use Pastebin, you agree to our use of cookies as described in the Cookies Policy. OK, I Understand
 
Top