Guest User

Untitled

a guest
May 21st, 2019
230
0
Never
Not a member of Pastebin yet? Sign Up, it unlocks many cool features!
text 8.19 KB | None | 0 0
  1. MS make.log for rtl8192eu-1.0 for kernel 5.1.3-arch1-1-ARCH (x86_64)
  2. dom 19 mag 2019, 22:31:52, CEST
  3. make ARCH=x86_64 CROSS_COMPILE= -C /lib/modules/5.1.3-arch1-1-ARCH/build M=/var/lib/dkms/rtl8192eu/1.0/build modules
  4. make[1]: ingresso nella directory "/usr/lib/modules/5.1.3-arch1-1-ARCH/build"
  5. CC [M] /var/lib/dkms/rtl8192eu/1.0/build/core/rtw_cmd.o
  6. CC [M] /var/lib/dkms/rtl8192eu/1.0/build/core/rtw_security.o
  7. /var/lib/dkms/rtl8192eu/1.0/build/core/rtw_security.c: In function ‘aes_cipher’:
  8. /var/lib/dkms/rtl8192eu/1.0/build/core/rtw_security.c:1598:5: warning: this ‘for’ clause does not guard... [-Wmisleading-indentation]
  9. for (j = 0; j < 8; j++)
  10. ^~~
  11. /var/lib/dkms/rtl8192eu/1.0/build/core/rtw_security.c:1601:2: note: ...this statement, but the latter is misleadingly indented as if it were guarded by the ‘for’
  12. payload_index = hdrlen + 8;
  13. ^~~~~~~~~~~~~
  14. /var/lib/dkms/rtl8192eu/1.0/build/core/rtw_security.c: In function ‘aes_decipher’:
  15. /var/lib/dkms/rtl8192eu/1.0/build/core/rtw_security.c:1984:5: warning: this ‘for’ clause does not guard... [-Wmisleading-indentation]
  16. for (j = 0; j < 8; j++)
  17. ^~~
  18. /var/lib/dkms/rtl8192eu/1.0/build/core/rtw_security.c:1987:2: note: ...this statement, but the latter is misleadingly indented as if it were guarded by the ‘for’
  19. payload_index = hdrlen + 8;
  20. ^~~~~~~~~~~~~
  21. CC [M] /var/lib/dkms/rtl8192eu/1.0/build/core/rtw_debug.o
  22. CC [M] /var/lib/dkms/rtl8192eu/1.0/build/core/rtw_io.o
  23. CC [M] /var/lib/dkms/rtl8192eu/1.0/build/core/rtw_ioctl_query.o
  24. CC [M] /var/lib/dkms/rtl8192eu/1.0/build/core/rtw_ioctl_set.o
  25. CC [M] /var/lib/dkms/rtl8192eu/1.0/build/core/rtw_ieee80211.o
  26. CC [M] /var/lib/dkms/rtl8192eu/1.0/build/core/rtw_mlme.o
  27. CC [M] /var/lib/dkms/rtl8192eu/1.0/build/core/rtw_mlme_ext.o
  28. /var/lib/dkms/rtl8192eu/1.0/build/core/rtw_mlme_ext.c: In function ‘rtw_delba_check’:
  29. /var/lib/dkms/rtl8192eu/1.0/build/core/rtw_mlme_ext.c:12427:7: warning: this ‘else’ clause does not guard... [-Wmisleading-indentation]
  30. else
  31. ^~~~
  32. /var/lib/dkms/rtl8192eu/1.0/build/core/rtw_mlme_ext.c:12429:8: note: ...this statement, but the latter is misleadingly indented as if it were guarded by the ‘else’
  33. psta->recvreorder_ctrl[i].enable = _FALSE;
  34. ^~~~
  35. /var/lib/dkms/rtl8192eu/1.0/build/core/rtw_mlme_ext.c:12430:7: warning: this ‘if’ clause does not guard... [-Wmisleading-indentation]
  36. if (ret != _FAIL)
  37. ^~
  38. /var/lib/dkms/rtl8192eu/1.0/build/core/rtw_mlme_ext.c:12432:8: note: ...this statement, but the latter is misleadingly indented as if it were guarded by the ‘if’
  39. rtw_reset_continual_no_rx_packet(psta, i);
  40. ^~~~~~~~~~~~~~~~~~~~~~~~~~~~~~~~
  41. CC [M] /var/lib/dkms/rtl8192eu/1.0/build/core/rtw_wlan_util.o
  42. CC [M] /var/lib/dkms/rtl8192eu/1.0/build/core/rtw_vht.o
  43. CC [M] /var/lib/dkms/rtl8192eu/1.0/build/core/rtw_pwrctrl.o
  44. CC [M] /var/lib/dkms/rtl8192eu/1.0/build/core/rtw_rf.o
  45. CC [M] /var/lib/dkms/rtl8192eu/1.0/build/core/rtw_recv.o
  46. CC [M] /var/lib/dkms/rtl8192eu/1.0/build/core/rtw_sta_mgt.o
  47. CC [M] /var/lib/dkms/rtl8192eu/1.0/build/core/rtw_ap.o
  48. CC [M] /var/lib/dkms/rtl8192eu/1.0/build/core/rtw_xmit.o
  49. CC [M] /var/lib/dkms/rtl8192eu/1.0/build/core/rtw_p2p.o
  50. CC [M] /var/lib/dkms/rtl8192eu/1.0/build/core/rtw_tdls.o
  51. CC [M] /var/lib/dkms/rtl8192eu/1.0/build/core/rtw_br_ext.o
  52. CC [M] /var/lib/dkms/rtl8192eu/1.0/build/core/rtw_iol.o
  53. CC [M] /var/lib/dkms/rtl8192eu/1.0/build/core/rtw_sreset.o
  54. CC [M] /var/lib/dkms/rtl8192eu/1.0/build/core/rtw_btcoex.o
  55. CC [M] /var/lib/dkms/rtl8192eu/1.0/build/core/rtw_beamforming.o
  56. CC [M] /var/lib/dkms/rtl8192eu/1.0/build/core/rtw_odm.o
  57. CC [M] /var/lib/dkms/rtl8192eu/1.0/build/core/efuse/rtw_efuse.o
  58. CC [M] /var/lib/dkms/rtl8192eu/1.0/build/os_dep/osdep_service.o
  59. /var/lib/dkms/rtl8192eu/1.0/build/os_dep/osdep_service.c: In function ‘isFileReadable’:
  60. /var/lib/dkms/rtl8192eu/1.0/build/os_dep/osdep_service.c:1970:28: error: implicit declaration of function ‘get_ds’; did you mean ‘get_da’? [-Werror=implicit-function-declaration]
  61. oldfs = get_fs(); set_fs(get_ds());
  62. ^~~~~~
  63. get_da
  64. /var/lib/dkms/rtl8192eu/1.0/build/os_dep/osdep_service.c:1970:28: error: incompatible type for argument 1 of ‘set_fs’
  65. oldfs = get_fs(); set_fs(get_ds());
  66. ^~~~~~~~
  67. In file included from ./include/linux/uaccess.h:11,
  68. from ./include/linux/crypto.h:26,
  69. from ./include/crypto/hash.h:16,
  70. from ./include/linux/uio.h:14,
  71. from ./include/linux/socket.h:8,
  72. from ./include/linux/compat.h:15,
  73. from ./include/linux/ethtool.h:17,
  74. from ./include/linux/netdevice.h:41,
  75. from /var/lib/dkms/rtl8192eu/1.0/build/include/osdep_service_linux.h:35,
  76. from /var/lib/dkms/rtl8192eu/1.0/build/include/osdep_service.h:45,
  77. from /var/lib/dkms/rtl8192eu/1.0/build/include/drv_types.h:32,
  78. from /var/lib/dkms/rtl8192eu/1.0/build/os_dep/osdep_service.c:24:
  79. ./arch/x86/include/asm/uaccess.h:29:40: note: expected ‘mm_segment_t’ {aka ‘struct <anonymous>’} but argument is of type ‘int’
  80. static inline void set_fs(mm_segment_t fs)
  81. ~~~~~~~~~~~~~^~
  82. /var/lib/dkms/rtl8192eu/1.0/build/os_dep/osdep_service.c: In function ‘retriveFromFile’:
  83. /var/lib/dkms/rtl8192eu/1.0/build/os_dep/osdep_service.c:1998:29: error: incompatible type for argument 1 of ‘set_fs’
  84. oldfs = get_fs(); set_fs(get_ds());
  85. ^~~~~~~~
  86. In file included from ./include/linux/uaccess.h:11,
  87. from ./include/linux/crypto.h:26,
  88. from ./include/crypto/hash.h:16,
  89. from ./include/linux/uio.h:14,
  90. from ./include/linux/socket.h:8,
  91. from ./include/linux/compat.h:15,
  92. from ./include/linux/ethtool.h:17,
  93. from ./include/linux/netdevice.h:41,
  94. from /var/lib/dkms/rtl8192eu/1.0/build/include/osdep_service_linux.h:35,
  95. from /var/lib/dkms/rtl8192eu/1.0/build/include/osdep_service.h:45,
  96. from /var/lib/dkms/rtl8192eu/1.0/build/include/drv_types.h:32,
  97. from /var/lib/dkms/rtl8192eu/1.0/build/os_dep/osdep_service.c:24:
  98. ./arch/x86/include/asm/uaccess.h:29:40: note: expected ‘mm_segment_t’ {aka ‘struct <anonymous>’} but argument is of type ‘int’
  99. static inline void set_fs(mm_segment_t fs)
  100. ~~~~~~~~~~~~~^~
  101. /var/lib/dkms/rtl8192eu/1.0/build/os_dep/osdep_service.c: In function ‘storeToFile’:
  102. /var/lib/dkms/rtl8192eu/1.0/build/os_dep/osdep_service.c:2032:29: error: incompatible type for argument 1 of ‘set_fs’
  103. oldfs = get_fs(); set_fs(get_ds());
  104. ^~~~~~~~
  105. In file included from ./include/linux/uaccess.h:11,
  106. from ./include/linux/crypto.h:26,
  107. from ./include/crypto/hash.h:16,
  108. from ./include/linux/uio.h:14,
  109. from ./include/linux/socket.h:8,
  110. from ./include/linux/compat.h:15,
  111. from ./include/linux/ethtool.h:17,
  112. from ./include/linux/netdevice.h:41,
  113. from /var/lib/dkms/rtl8192eu/1.0/build/include/osdep_service_linux.h:35,
  114. from /var/lib/dkms/rtl8192eu/1.0/build/include/osdep_service.h:45,
  115. from /var/lib/dkms/rtl8192eu/1.0/build/include/drv_types.h:32,
  116. from /var/lib/dkms/rtl8192eu/1.0/build/os_dep/osdep_service.c:24:
  117. ./arch/x86/include/asm/uaccess.h:29:40: note: expected ‘mm_segment_t’ {aka ‘struct <anonymous>’} but argument is of type ‘int’
  118. static inline void set_fs(mm_segment_t fs)
  119. ~~~~~~~~~~~~~^~
  120. cc1: some warnings being treated as errors
  121. make[2]: *** [scripts/Makefile.build:276: /var/lib/dkms/rtl8192eu/1.0/build/os_dep/osdep_service.o] Error 1
  122. make[1]: *** [Makefile:1571: _module_/var/lib/dkms/rtl8192eu/1.0/build] Error 2
  123. make[1]: uscita dalla directory "/usr/lib/modules/5.1.3-arch1-1-ARCH/build"
  124. make: *** [Makefile:1700: modules] Error 2
Advertisement
Add Comment
Please, Sign In to add comment