daily pastebin goal
14%
SHARE
TWEET

VS2015 - Output log

boberski Jan 24th, 2017 95 Never
Not a member of Pastebin yet? Sign Up, it unlocks many cool features!
  1. 1>------ Rebuild All started: Project: clib, Configuration: Debug Win32 ------
  2. 2>------ Rebuild All started: Project: plib, Configuration: Debug Win32 ------
  3. 3>------ Rebuild All started: Project: bscript, Configuration: Debug Win32 ------
  4. 4>------ Rebuild All started: Project: doc, Configuration: Debug Win32 ------
  5. 5>------ Skipped Rebuild All: Project: support, Configuration: Debug Win32 ------
  6. 5>Project not selected to build for this solution configuration
  7. 1>  StdAfx.cpp
  8. 2>  uofile00.cpp
  9. 3>  berror.cpp
  10. 3>  blong.cpp
  11. 2>  uofile01.cpp
  12. 2>  uofile02.cpp
  13. 3>  bstruct.cpp
  14. 3>  compctx.cpp
  15. 2>  uofile06.cpp
  16. 1>C:\Program Files (x86)\Microsoft SDKs\Windows\v7.1A\include\dbghelp.h(1540): warning C4091: 'typedef ': ignored on left of '' when no variable is declared
  17. 1>C:\Program Files (x86)\Microsoft SDKs\Windows\v7.1A\include\dbghelp.h(3056): warning C4091: 'typedef ': ignored on left of '' when no variable is declared
  18. 1>  Unknown compiler version - please run the configure tests and report the results
  19. 2>D:\Apps\Microsoft Visual Studio 2015\VC\include\CodeAnalysis/sourceannotations.h(68): warning C4467: usage of ATL attributes is deprecated (compiling source file ..\pol\uofile02.cpp)
  20. 2>  Unknown compiler version - please run the configure tests and report the results
  21. 2>D:\Apps\Microsoft Visual Studio 2015\VC\include\CodeAnalysis/sourceannotations.h(68): warning C4467: usage of ATL attributes is deprecated (compiling source file ..\pol\uofile01.cpp)
  22. 3>D:\Apps\Microsoft Visual Studio 2015\VC\include\CodeAnalysis/sourceannotations.h(68): warning C4467: usage of ATL attributes is deprecated (compiling source file blong.cpp)
  23. 3>D:\Apps\Microsoft Visual Studio 2015\VC\include\CodeAnalysis/sourceannotations.h(68): warning C4467: usage of ATL attributes is deprecated (compiling source file berror.cpp)
  24. 2>C:\Program Files (x86)\Microsoft SDKs\Windows\v7.1A\include\dbghelp.h(1540): warning C4091: 'typedef ': ignored on left of '' when no variable is declared (compiling source file ..\pol\uofile02.cpp)
  25. 2>C:\Program Files (x86)\Microsoft SDKs\Windows\v7.1A\include\dbghelp.h(3056): warning C4091: 'typedef ': ignored on left of '' when no variable is declared (compiling source file ..\pol\uofile02.cpp)
  26. 3>D:\Apps\Microsoft Visual Studio 2015\VC\include\CodeAnalysis/sourceannotations.h(68): warning C4467: usage of ATL attributes is deprecated (compiling source file bstruct.cpp)
  27. 3>C:\Program Files (x86)\Microsoft SDKs\Windows\v7.1A\include\dbghelp.h(1540): warning C4091: 'typedef ': ignored on left of '' when no variable is declared (compiling source file blong.cpp)
  28. 3>C:\Program Files (x86)\Microsoft SDKs\Windows\v7.1A\include\dbghelp.h(3056): warning C4091: 'typedef ': ignored on left of '' when no variable is declared (compiling source file blong.cpp)
  29. 3>C:\Program Files (x86)\Microsoft SDKs\Windows\v7.1A\include\dbghelp.h(1540): warning C4091: 'typedef ': ignored on left of '' when no variable is declared (compiling source file bstruct.cpp)
  30. 3>C:\Program Files (x86)\Microsoft SDKs\Windows\v7.1A\include\dbghelp.h(3056): warning C4091: 'typedef ': ignored on left of '' when no variable is declared (compiling source file bstruct.cpp)
  31. 2>  Unknown compiler version - please run the configure tests and report the results
  32. 3>  Unknown compiler version - please run the configure tests and report the results
  33. 2>D:\Apps\Microsoft Visual Studio 2015\VC\include\CodeAnalysis/sourceannotations.h(68): warning C4467: usage of ATL attributes is deprecated (compiling source file ..\pol\uofile00.cpp)
  34. 2>  Unknown compiler version - please run the configure tests and report the results
  35. 2>  uofile07.cpp
  36. 2>  uofile08.cpp
  37. 3>  compiler.cpp
  38. 2>C:\Program Files (x86)\Microsoft SDKs\Windows\v7.1A\include\dbghelp.h(1540): warning C4091: 'typedef ': ignored on left of '' when no variable is declared (compiling source file ..\pol\uofile00.cpp)
  39. 2>C:\Program Files (x86)\Microsoft SDKs\Windows\v7.1A\include\dbghelp.h(3056): warning C4091: 'typedef ': ignored on left of '' when no variable is declared (compiling source file ..\pol\uofile00.cpp)
  40. 3>  compilercfg.cpp
  41. 2>D:\Apps\Microsoft Visual Studio 2015\VC\include\CodeAnalysis/sourceannotations.h(68): warning C4467: usage of ATL attributes is deprecated (compiling source file ..\pol\uofile07.cpp)
  42. 2>D:\Apps\Microsoft Visual Studio 2015\VC\include\CodeAnalysis/sourceannotations.h(68): warning C4467: usage of ATL attributes is deprecated (compiling source file ..\pol\uofile08.cpp)
  43. 3>  dbl.cpp
  44. 3>D:\Apps\Microsoft Visual Studio 2015\VC\include\CodeAnalysis/sourceannotations.h(68): warning C4467: usage of ATL attributes is deprecated (compiling source file compiler.cpp)
  45. 3>C:\Program Files (x86)\Microsoft SDKs\Windows\v7.1A\include\dbghelp.h(1540): warning C4091: 'typedef ': ignored on left of '' when no variable is declared (compiling source file compiler.cpp)
  46. 3>C:\Program Files (x86)\Microsoft SDKs\Windows\v7.1A\include\dbghelp.h(3056): warning C4091: 'typedef ': ignored on left of '' when no variable is declared (compiling source file compiler.cpp)
  47. 3>  Unknown compiler version - please run the configure tests and report the results
  48. 3>D:\Apps\Microsoft Visual Studio 2015\VC\include\CodeAnalysis/sourceannotations.h(68): warning C4467: usage of ATL attributes is deprecated (compiling source file compilercfg.cpp)
  49. 2>  uofile04.cpp
  50. 3>C:\Program Files (x86)\Microsoft SDKs\Windows\v7.1A\include\dbghelp.h(1540): warning C4091: 'typedef ': ignored on left of '' when no variable is declared (compiling source file compilercfg.cpp)
  51. 3>C:\Program Files (x86)\Microsoft SDKs\Windows\v7.1A\include\dbghelp.h(3056): warning C4091: 'typedef ': ignored on left of '' when no variable is declared (compiling source file compilercfg.cpp)
  52. 2>  uofile05.cpp
  53. 1>D:\Apps\Microsoft Visual Studio 2015\VC\include\CodeAnalysis/sourceannotations.h(68): warning C4467: usage of ATL attributes is deprecated
  54. 3>D:\Apps\Microsoft Visual Studio 2015\VC\include\CodeAnalysis/sourceannotations.h(68): warning C4467: usage of ATL attributes is deprecated (compiling source file dbl.cpp)
  55. 3>  dict.cpp
  56. 1>  format.cc
  57. 1>  StackWalker.cpp
  58. 1>  binaryfile.cpp
  59. 1>  boostutils.cpp
  60. 1>  Unknown compiler version - please run the configure tests and report the results
  61. 3>C:\Program Files (x86)\Microsoft SDKs\Windows\v7.1A\include\dbghelp.h(1540): warning C4091: 'typedef ': ignored on left of '' when no variable is declared (compiling source file dbl.cpp)
  62. 3>C:\Program Files (x86)\Microsoft SDKs\Windows\v7.1A\include\dbghelp.h(3056): warning C4091: 'typedef ': ignored on left of '' when no variable is declared (compiling source file dbl.cpp)
  63. 1>C:\Program Files (x86)\Microsoft SDKs\Windows\v7.1A\include\dbghelp.h(1540): warning C4091: 'typedef ': ignored on left of '' when no variable is declared (compiling source file ..\..\lib\StackWalker\StackWalker.cpp)
  64. 1>C:\Program Files (x86)\Microsoft SDKs\Windows\v7.1A\include\dbghelp.h(3056): warning C4091: 'typedef ': ignored on left of '' when no variable is declared (compiling source file ..\..\lib\StackWalker\StackWalker.cpp)
  65. 1>  cfgfile.cpp
  66. 1>D:\Apps\Microsoft Visual Studio 2015\VC\include\CodeAnalysis/sourceannotations.h(68): warning C4467: usage of ATL attributes is deprecated (compiling source file binaryfile.cpp)
  67. 3>D:\Apps\Microsoft Visual Studio 2015\VC\include\CodeAnalysis/sourceannotations.h(68): warning C4467: usage of ATL attributes is deprecated (compiling source file dict.cpp)
  68. 2>  Unknown compiler version - please run the configure tests and report the results
  69. 2>  Unknown compiler version - please run the configure tests and report the results
  70. 1>..\..\lib\format\format.cc(472): warning C4456: declaration of 'c' hides previous local declaration
  71. 1>  ..\..\lib\format\format.cc(452): note: see declaration of 'c'
  72. 1>  ..\..\lib\format\format.cc(445): note: while compiling class template member function 'void fmt::BasicWriter<char>::FormatParser::Format(fmt::BasicWriter<char> &,fmt::BasicStringRef<char>,std::size_t,const fmt::BasicWriter<char>::ArgInfo *)'
  73. 1>  e:\ultimaonline\pol\polserver\lib\format\format.h(987): note: see reference to function template instantiation 'void fmt::BasicWriter<char>::FormatParser::Format(fmt::BasicWriter<char> &,fmt::BasicStringRef<char>,std::size_t,const fmt::BasicWriter<char>::ArgInfo *)' being compiled (compiling source file ..\..\lib\format\format.cc)
  74. 1>  ..\..\lib\format\format.cc(715): note: see reference to class template instantiation 'fmt::BasicWriter<char>::FormatParser' being compiled
  75. 2>D:\Apps\Microsoft Visual Studio 2015\VC\include\CodeAnalysis/sourceannotations.h(68): warning C4467: usage of ATL attributes is deprecated (compiling source file ..\uotool\uofile04.cpp)
  76. 1>D:\Apps\Microsoft Visual Studio 2015\VC\include\CodeAnalysis/sourceannotations.h(68): warning C4467: usage of ATL attributes is deprecated (compiling source file cfgfile.cpp)
  77. 1>..\..\lib\format\format.cc(349): warning C4456: declaration of 'width' hides previous local declaration
  78. 1>  ..\..\lib\format\format.cc(287): note: see declaration of 'width'
  79. 1>  ..\..\lib\format\format.cc(702): note: see reference to function template instantiation 'void fmt::BasicWriter<char>::FormatDouble<double>(double,const fmt::FormatSpec &,int)' being compiled
  80. 1>  ..\..\lib\format\format.cc(630): note: see reference to function template instantiation 'void fmt::BasicWriter<char>::FormatDouble<double>(double,const fmt::FormatSpec &,int)' being compiled
  81. 2>  filemapserver.cpp
  82. 2>D:\Apps\Microsoft Visual Studio 2015\VC\include\CodeAnalysis/sourceannotations.h(68): warning C4467: usage of ATL attributes is deprecated (compiling source file filemapserver.cpp)
  83. 2>D:\Apps\Microsoft Visual Studio 2015\VC\include\CodeAnalysis/sourceannotations.h(68): warning C4467: usage of ATL attributes is deprecated (compiling source file ..\uotool\uofile05.cpp)
  84. 1>C:\Program Files (x86)\Microsoft SDKs\Windows\v7.1A\include\dbghelp.h(1540): warning C4091: 'typedef ': ignored on left of '' when no variable is declared (compiling source file cfgfile.cpp)
  85. 1>C:\Program Files (x86)\Microsoft SDKs\Windows\v7.1A\include\dbghelp.h(3056): warning C4091: 'typedef ': ignored on left of '' when no variable is declared (compiling source file cfgfile.cpp)
  86. 3>  eprog.cpp
  87. 3>D:\Apps\Microsoft Visual Studio 2015\VC\include\CodeAnalysis/sourceannotations.h(68): warning C4467: usage of ATL attributes is deprecated (compiling source file eprog.cpp)
  88. 2>  inmemorymapserver.cpp
  89. 2>D:\Apps\Microsoft Visual Studio 2015\VC\include\CodeAnalysis/sourceannotations.h(68): warning C4467: usage of ATL attributes is deprecated (compiling source file inmemorymapserver.cpp)
  90. 1>  cfgsect.cpp
  91. 3>C:\Program Files (x86)\Microsoft SDKs\Windows\v7.1A\include\dbghelp.h(1540): warning C4091: 'typedef ': ignored on left of '' when no variable is declared (compiling source file dict.cpp)
  92. 3>C:\Program Files (x86)\Microsoft SDKs\Windows\v7.1A\include\dbghelp.h(3056): warning C4091: 'typedef ': ignored on left of '' when no variable is declared (compiling source file dict.cpp)
  93. 3>  Unknown compiler version - please run the configure tests and report the results
  94. 1>  clib_MD5.cpp
  95. 3>  eprog2.cpp
  96. 3>D:\Apps\Microsoft Visual Studio 2015\VC\include\CodeAnalysis/sourceannotations.h(68): warning C4467: usage of ATL attributes is deprecated (compiling source file eprog2.cpp)
  97. 3>C:\Program Files (x86)\Microsoft SDKs\Windows\v7.1A\include\dbghelp.h(1540): warning C4091: 'typedef ': ignored on left of '' when no variable is declared (compiling source file eprog.cpp)
  98. 3>C:\Program Files (x86)\Microsoft SDKs\Windows\v7.1A\include\dbghelp.h(3056): warning C4091: 'typedef ': ignored on left of '' when no variable is declared (compiling source file eprog.cpp)
  99. 1>  clib_utils.cpp
  100. 1>D:\Apps\Microsoft Visual Studio 2015\VC\include\CodeAnalysis/sourceannotations.h(68): warning C4467: usage of ATL attributes is deprecated (compiling source file cfgsect.cpp)
  101. 1>  ExceptionParser.cpp
  102. 1>cfgsect.cpp(29): warning C4297: 'Pol::Clib::ConfigSection::~ConfigSection': function assumed not to throw an exception but does
  103. 1>  cfgsect.cpp(29): note: destructor or deallocator has a (possibly implicit) non-throwing exception specification
  104. 3>  Unknown compiler version - please run the configure tests and report the results
  105. 1>D:\Apps\Microsoft Visual Studio 2015\VC\include\CodeAnalysis/sourceannotations.h(68): warning C4467: usage of ATL attributes is deprecated (compiling source file clib_MD5.cpp)
  106. 1>  Unknown compiler version - please run the configure tests and report the results
  107. 1>C:\Program Files (x86)\Microsoft SDKs\Windows\v7.1A\include\dbghelp.h(1540): warning C4091: 'typedef ': ignored on left of '' when no variable is declared (compiling source file clib_MD5.cpp)
  108. 1>C:\Program Files (x86)\Microsoft SDKs\Windows\v7.1A\include\dbghelp.h(3056): warning C4091: 'typedef ': ignored on left of '' when no variable is declared (compiling source file clib_MD5.cpp)
  109. 3>C:\Program Files (x86)\Microsoft SDKs\Windows\v7.1A\include\dbghelp.h(1540): warning C4091: 'typedef ': ignored on left of '' when no variable is declared (compiling source file eprog2.cpp)
  110. 3>C:\Program Files (x86)\Microsoft SDKs\Windows\v7.1A\include\dbghelp.h(3056): warning C4091: 'typedef ': ignored on left of '' when no variable is declared (compiling source file eprog2.cpp)
  111. 2>  mapfunc.cpp
  112. 3>  Unknown compiler version - please run the configure tests and report the results
  113. 1>  LogSink.cpp
  114. 1>  Unknown compiler version - please run the configure tests and report the results
  115. 2>  mapserver.cpp
  116. 1>C:\Program Files (x86)\Microsoft SDKs\Windows\v7.1A\include\dbghelp.h(1540): warning C4091: 'typedef ': ignored on left of '' when no variable is declared (compiling source file Debugging\ExceptionParser.cpp)
  117. 1>C:\Program Files (x86)\Microsoft SDKs\Windows\v7.1A\include\dbghelp.h(3056): warning C4091: 'typedef ': ignored on left of '' when no variable is declared (compiling source file Debugging\ExceptionParser.cpp)
  118. 2>D:\Apps\Microsoft Visual Studio 2015\VC\include\CodeAnalysis/sourceannotations.h(68): warning C4467: usage of ATL attributes is deprecated (compiling source file mapfunc.cpp)
  119. 1>  Unknown compiler version - please run the configure tests and report the results
  120. 2>D:\Apps\Microsoft Visual Studio 2015\VC\include\CodeAnalysis/sourceannotations.h(68): warning C4467: usage of ATL attributes is deprecated (compiling source file mapserver.cpp)
  121. 1>  Unknown compiler version - please run the configure tests and report the results
  122. 2>  maptileserver.cpp
  123. 1>D:\Apps\Microsoft Visual Studio 2015\VC\include\CodeAnalysis/sourceannotations.h(68): warning C4467: usage of ATL attributes is deprecated (compiling source file Debugging\ExceptionParser.cpp)
  124. 2>  mapwriter.cpp
  125. 1>  dirfunc.cpp
  126. 3>  eprog3.cpp
  127. 2>  Unknown compiler version - please run the configure tests and report the results
  128. 3>D:\Apps\Microsoft Visual Studio 2015\VC\include\CodeAnalysis/sourceannotations.h(68): warning C4467: usage of ATL attributes is deprecated (compiling source file eprog3.cpp)
  129. 2>  pkg.cpp
  130. 1>C:\Program Files (x86)\Microsoft SDKs\Windows\v7.1A\include\dbghelp.h(1540): warning C4091: 'typedef ': ignored on left of '' when no variable is declared (compiling source file dirfunc.cpp)
  131. 1>C:\Program Files (x86)\Microsoft SDKs\Windows\v7.1A\include\dbghelp.h(3056): warning C4091: 'typedef ': ignored on left of '' when no variable is declared (compiling source file dirfunc.cpp)
  132. 1>  dirlist.cpp
  133. 2>D:\Apps\Microsoft Visual Studio 2015\VC\include\CodeAnalysis/sourceannotations.h(68): warning C4467: usage of ATL attributes is deprecated (compiling source file mapwriter.cpp)
  134. 2>mapwriter.cpp(178): warning C4244: '=': conversion from 'std::streamoff' to 'std::size_t', possible loss of data
  135. 2>mapwriter.cpp(184): warning C4244: '=': conversion from 'std::streamoff' to 'std::size_t', possible loss of data
  136. 2>  Unknown compiler version - please run the configure tests and report the results
  137. 3>C:\Program Files (x86)\Microsoft SDKs\Windows\v7.1A\include\dbghelp.h(1540): warning C4091: 'typedef ': ignored on left of '' when no variable is declared (compiling source file eprog3.cpp)
  138. 3>  eprog_read.cpp
  139. 3>C:\Program Files (x86)\Microsoft SDKs\Windows\v7.1A\include\dbghelp.h(3056): warning C4091: 'typedef ': ignored on left of '' when no variable is declared (compiling source file eprog3.cpp)
  140. 2>D:\Apps\Microsoft Visual Studio 2015\VC\include\CodeAnalysis/sourceannotations.h(68): warning C4467: usage of ATL attributes is deprecated (compiling source file pkg.cpp)
  141. 3>D:\Apps\Microsoft Visual Studio 2015\VC\include\CodeAnalysis/sourceannotations.h(68): warning C4467: usage of ATL attributes is deprecated (compiling source file eprog_read.cpp)
  142. 2>C:\Program Files (x86)\Microsoft SDKs\Windows\v7.1A\include\dbghelp.h(1540): warning C4091: 'typedef ': ignored on left of '' when no variable is declared (compiling source file pkg.cpp)
  143. 2>C:\Program Files (x86)\Microsoft SDKs\Windows\v7.1A\include\dbghelp.h(3056): warning C4091: 'typedef ': ignored on left of '' when no variable is declared (compiling source file pkg.cpp)
  144. 3>  Unknown compiler version - please run the configure tests and report the results
  145. 2>  realmdescriptor.cpp
  146. 1>C:\Program Files (x86)\Microsoft SDKs\Windows\v7.1A\include\dbghelp.h(1540): warning C4091: 'typedef ': ignored on left of '' when no variable is declared (compiling source file dirlist.cpp)
  147. 1>C:\Program Files (x86)\Microsoft SDKs\Windows\v7.1A\include\dbghelp.h(3056): warning C4091: 'typedef ': ignored on left of '' when no variable is declared (compiling source file dirlist.cpp)
  148. 2>  staticserver.cpp
  149. 3>C:\Program Files (x86)\Microsoft SDKs\Windows\v7.1A\include\dbghelp.h(1540): warning C4091: 'typedef ': ignored on left of '' when no variable is declared (compiling source file eprog_read.cpp)
  150. 3>C:\Program Files (x86)\Microsoft SDKs\Windows\v7.1A\include\dbghelp.h(3056): warning C4091: 'typedef ': ignored on left of '' when no variable is declared (compiling source file eprog_read.cpp)
  151. 1>  esignal.cpp
  152. 2>D:\Apps\Microsoft Visual Studio 2015\VC\include\CodeAnalysis/sourceannotations.h(68): warning C4467: usage of ATL attributes is deprecated (compiling source file realmdescriptor.cpp)
  153. 3>  Unknown compiler version - please run the configure tests and report the results
  154. 1>e:\ultimaonline\pol\polserver\pol-core\clib\cfgfile.cpp(430): warning C4702: unreachable code
  155. 1>e:\ultimaonline\pol\polserver\pol-core\clib\cfgfile.cpp(444): warning C4702: unreachable code
  156. 1>  fdump.cpp
  157. 3>  escript_config.cpp
  158. 3>  escriptv.cpp
  159. 2>D:\Apps\Microsoft Visual Studio 2015\VC\include\CodeAnalysis/sourceannotations.h(68): warning C4467: usage of ATL attributes is deprecated (compiling source file staticserver.cpp)
  160. 2>C:\Program Files (x86)\Microsoft SDKs\Windows\v7.1A\include\dbghelp.h(1540): warning C4091: 'typedef ': ignored on left of '' when no variable is declared (compiling source file staticserver.cpp)
  161. 2>C:\Program Files (x86)\Microsoft SDKs\Windows\v7.1A\include\dbghelp.h(3056): warning C4091: 'typedef ': ignored on left of '' when no variable is declared (compiling source file staticserver.cpp)
  162. 2>  StdAfx.cpp
  163. 1>  filecont.cpp
  164. 3>  escrutil.cpp
  165. 2>C:\Program Files (x86)\Microsoft SDKs\Windows\v7.1A\include\dbghelp.h(1540): warning C4091: 'typedef ': ignored on left of '' when no variable is declared (compiling source file StdAfx.cpp)
  166. 2>C:\Program Files (x86)\Microsoft SDKs\Windows\v7.1A\include\dbghelp.h(3056): warning C4091: 'typedef ': ignored on left of '' when no variable is declared (compiling source file StdAfx.cpp)
  167. 1>  fileutil.cpp
  168. 1>  Unknown compiler version - please run the configure tests and report the results
  169. 2>  Unknown compiler version - please run the configure tests and report the results
  170. 3>D:\Apps\Microsoft Visual Studio 2015\VC\include\CodeAnalysis/sourceannotations.h(68): warning C4467: usage of ATL attributes is deprecated (compiling source file escrutil.cpp)
  171. 2>  systemstate.cpp
  172. 2>  Unknown compiler version - please run the configure tests and report the results
  173. 1>C:\Program Files (x86)\Microsoft SDKs\Windows\v7.1A\include\dbghelp.h(1540): warning C4091: 'typedef ': ignored on left of '' when no variable is declared (compiling source file fileutil.cpp)
  174. 1>C:\Program Files (x86)\Microsoft SDKs\Windows\v7.1A\include\dbghelp.h(3056): warning C4091: 'typedef ': ignored on left of '' when no variable is declared (compiling source file fileutil.cpp)
  175. 1>D:\Apps\Microsoft Visual Studio 2015\VC\include\CodeAnalysis/sourceannotations.h(68): warning C4467: usage of ATL attributes is deprecated (compiling source file esignal.cpp)
  176. 3>  execmodl.cpp
  177. 1>C:\Program Files (x86)\Microsoft SDKs\Windows\v7.1A\include\dbghelp.h(1540): warning C4091: 'typedef ': ignored on left of '' when no variable is declared (compiling source file esignal.cpp)
  178. 1>C:\Program Files (x86)\Microsoft SDKs\Windows\v7.1A\include\dbghelp.h(3056): warning C4091: 'typedef ': ignored on left of '' when no variable is declared (compiling source file esignal.cpp)
  179. 2>  Unknown compiler version - please run the configure tests and report the results
  180. 1>  Unknown compiler version - please run the configure tests and report the results
  181. 1>D:\Apps\Microsoft Visual Studio 2015\VC\include\CodeAnalysis/sourceannotations.h(68): warning C4467: usage of ATL attributes is deprecated (compiling source file fdump.cpp)
  182. 2>D:\Apps\Microsoft Visual Studio 2015\VC\include\CodeAnalysis/sourceannotations.h(68): warning C4467: usage of ATL attributes is deprecated (compiling source file systemstate.cpp)
  183. 1>  forspcnt.cpp
  184. 2>C:\Program Files (x86)\Microsoft SDKs\Windows\v7.1A\include\dbghelp.h(1540): warning C4091: 'typedef ': ignored on left of '' when no variable is declared (compiling source file systemstate.cpp)
  185. 2>C:\Program Files (x86)\Microsoft SDKs\Windows\v7.1A\include\dbghelp.h(3056): warning C4091: 'typedef ': ignored on left of '' when no variable is declared (compiling source file systemstate.cpp)
  186. 1>C:\Program Files (x86)\Microsoft SDKs\Windows\v7.1A\include\dbghelp.h(1540): warning C4091: 'typedef ': ignored on left of '' when no variable is declared (compiling source file forspcnt.cpp)
  187. 1>C:\Program Files (x86)\Microsoft SDKs\Windows\v7.1A\include\dbghelp.h(3056): warning C4091: 'typedef ': ignored on left of '' when no variable is declared (compiling source file forspcnt.cpp)
  188. 3>  executor.cpp
  189. 3>D:\Apps\Microsoft Visual Studio 2015\VC\include\CodeAnalysis/sourceannotations.h(68): warning C4467: usage of ATL attributes is deprecated (compiling source file executor.cpp)
  190. 1>  iohelp.cpp
  191. 1>  Unknown compiler version - please run the configure tests and report the results
  192. 3>D:\Apps\Microsoft Visual Studio 2015\VC\include\CodeAnalysis/sourceannotations.h(68): warning C4467: usage of ATL attributes is deprecated (compiling source file execmodl.cpp)
  193. 2>D:\Apps\Microsoft Visual Studio 2015\VC\include\CodeAnalysis/sourceannotations.h(68): warning C4467: usage of ATL attributes is deprecated (compiling source file StdAfx.cpp)
  194. 1>D:\Apps\Microsoft Visual Studio 2015\VC\include\CodeAnalysis/sourceannotations.h(68): warning C4467: usage of ATL attributes is deprecated (compiling source file filecont.cpp)
  195. 3>  fmodule.cpp
  196. 2>  uoexpansion.cpp
  197. 2>D:\Apps\Microsoft Visual Studio 2015\VC\include\CodeAnalysis/sourceannotations.h(68): warning C4467: usage of ATL attributes is deprecated (compiling source file uoexpansion.cpp)
  198. 3>C:\Program Files (x86)\Microsoft SDKs\Windows\v7.1A\include\dbghelp.h(1540): warning C4091: 'typedef ': ignored on left of '' when no variable is declared (compiling source file executor.cpp)
  199. 3>C:\Program Files (x86)\Microsoft SDKs\Windows\v7.1A\include\dbghelp.h(3056): warning C4091: 'typedef ': ignored on left of '' when no variable is declared (compiling source file executor.cpp)
  200. 3>  Unknown compiler version - please run the configure tests and report the results
  201. 3>  Unknown compiler version - please run the configure tests and report the results
  202. 1>  kbhit.cpp
  203. 1>  logfacility.cpp
  204. 3>C:\Program Files (x86)\Microsoft SDKs\Windows\v7.1A\include\dbghelp.h(1540): warning C4091: 'typedef ': ignored on left of '' when no variable is declared (compiling source file execmodl.cpp)
  205. 3>C:\Program Files (x86)\Microsoft SDKs\Windows\v7.1A\include\dbghelp.h(3056): warning C4091: 'typedef ': ignored on left of '' when no variable is declared (compiling source file execmodl.cpp)
  206. 3>  Unknown compiler version - please run the configure tests and report the results
  207. 3>D:\Apps\Microsoft Visual Studio 2015\VC\include\CodeAnalysis/sourceannotations.h(68): warning C4467: usage of ATL attributes is deprecated (compiling source file fmodule.cpp)
  208. 3>C:\Program Files (x86)\Microsoft SDKs\Windows\v7.1A\include\dbghelp.h(1540): warning C4091: 'typedef ': ignored on left of '' when no variable is declared (compiling source file fmodule.cpp)
  209. 3>C:\Program Files (x86)\Microsoft SDKs\Windows\v7.1A\include\dbghelp.h(3056): warning C4091: 'typedef ': ignored on left of '' when no variable is declared (compiling source file fmodule.cpp)
  210. 1>  mdump.cpp
  211. 1>  mlog.cpp
  212. 1>  msjexhnd.cpp
  213. 1>C:\Program Files (x86)\Microsoft SDKs\Windows\v7.1A\include\dbghelp.h(1540): warning C4091: 'typedef ': ignored on left of '' when no variable is declared (compiling source file msjexhnd.cpp)
  214. 1>C:\Program Files (x86)\Microsoft SDKs\Windows\v7.1A\include\dbghelp.h(3056): warning C4091: 'typedef ': ignored on left of '' when no variable is declared (compiling source file msjexhnd.cpp)
  215. 1>D:\Apps\Microsoft Visual Studio 2015\VC\include\CodeAnalysis/sourceannotations.h(68): warning C4467: usage of ATL attributes is deprecated (compiling source file mdump.cpp)
  216. 1>  NTService.cpp
  217. 1>  Unknown compiler version - please run the configure tests and report the results
  218. 1>C:\Program Files (x86)\Microsoft SDKs\Windows\v7.1A\include\dbghelp.h(1540): warning C4091: 'typedef ': ignored on left of '' when no variable is declared (compiling source file NTService.cpp)
  219. 1>C:\Program Files (x86)\Microsoft SDKs\Windows\v7.1A\include\dbghelp.h(3056): warning C4091: 'typedef ': ignored on left of '' when no variable is declared (compiling source file NTService.cpp)
  220. 1>D:\Apps\Microsoft Visual Studio 2015\VC\include\CodeAnalysis/sourceannotations.h(68): warning C4467: usage of ATL attributes is deprecated (compiling source file logfacility.cpp)
  221. 1>  opnew.cpp
  222. 3>  object.cpp
  223. 3>  objstrm.cpp
  224. 3>  parser.cpp
  225. 2>  plib-2015.vcxproj -> E:\UltimaOnline\POL\polserver\pol-core\plib\.\Debug\plib.lib
  226. 1>  Unknown compiler version - please run the configure tests and report the results
  227. 3>D:\Apps\Microsoft Visual Studio 2015\VC\include\CodeAnalysis/sourceannotations.h(68): warning C4467: usage of ATL attributes is deprecated (compiling source file parser.cpp)
  228. 3>D:\Apps\Microsoft Visual Studio 2015\VC\include\CodeAnalysis/sourceannotations.h(68): warning C4467: usage of ATL attributes is deprecated (compiling source file objstrm.cpp)
  229. 3>D:\Apps\Microsoft Visual Studio 2015\VC\include\CodeAnalysis/sourceannotations.h(68): warning C4467: usage of ATL attributes is deprecated (compiling source file object.cpp)
  230. 3>C:\Program Files (x86)\Microsoft SDKs\Windows\v7.1A\include\dbghelp.h(1540): warning C4091: 'typedef ': ignored on left of '' when no variable is declared (compiling source file parser.cpp)
  231. 3>C:\Program Files (x86)\Microsoft SDKs\Windows\v7.1A\include\dbghelp.h(3056): warning C4091: 'typedef ': ignored on left of '' when no variable is declared (compiling source file parser.cpp)
  232. 1>  Unknown compiler version - please run the configure tests and report the results
  233. 1>C:\Program Files (x86)\Microsoft SDKs\Windows\v7.1A\include\dbghelp.h(1540): warning C4091: 'typedef ': ignored on left of '' when no variable is declared (compiling source file mdump.cpp)
  234. 1>C:\Program Files (x86)\Microsoft SDKs\Windows\v7.1A\include\dbghelp.h(3056): warning C4091: 'typedef ': ignored on left of '' when no variable is declared (compiling source file mdump.cpp)
  235. 3>  Unknown compiler version - please run the configure tests and report the results
  236. 1>D:\Apps\Microsoft Visual Studio 2015\VC\include\CodeAnalysis/sourceannotations.h(68): warning C4467: usage of ATL attributes is deprecated (compiling source file msjexhnd.cpp)
  237. 3>C:\Program Files (x86)\Microsoft SDKs\Windows\v7.1A\include\dbghelp.h(1540): warning C4091: 'typedef ': ignored on left of '' when no variable is declared (compiling source file object.cpp)
  238. 3>C:\Program Files (x86)\Microsoft SDKs\Windows\v7.1A\include\dbghelp.h(3056): warning C4091: 'typedef ': ignored on left of '' when no variable is declared (compiling source file object.cpp)
  239. 3>  Unknown compiler version - please run the configure tests and report the results
  240. 1>  Unknown compiler version - please run the configure tests and report the results
  241. 1>D:\Apps\Microsoft Visual Studio 2015\VC\include\CodeAnalysis/sourceannotations.h(68): warning C4467: usage of ATL attributes is deprecated (compiling source file opnew.cpp)
  242. 3>  StdAfx.cpp
  243. 3>C:\Program Files (x86)\Microsoft SDKs\Windows\v7.1A\include\dbghelp.h(1540): warning C4091: 'typedef ': ignored on left of '' when no variable is declared (compiling source file StdAfx.cpp)
  244. 3>C:\Program Files (x86)\Microsoft SDKs\Windows\v7.1A\include\dbghelp.h(3056): warning C4091: 'typedef ': ignored on left of '' when no variable is declared (compiling source file StdAfx.cpp)
  245. 3>  Unknown compiler version - please run the configure tests and report the results
  246. 1>  passert.cpp
  247. 1>D:\Apps\Microsoft Visual Studio 2015\VC\include\CodeAnalysis/sourceannotations.h(68): warning C4467: usage of ATL attributes is deprecated (compiling source file passert.cpp)
  248. 1>  ProgramConfig.cpp
  249. 3>  str.cpp
  250. 3>D:\Apps\Microsoft Visual Studio 2015\VC\include\CodeAnalysis/sourceannotations.h(68): warning C4467: usage of ATL attributes is deprecated (compiling source file StdAfx.cpp)
  251. 1>  ProgramMain.cpp
  252. 1>  random.cpp
  253. 3>D:\Apps\Microsoft Visual Studio 2015\VC\include\CodeAnalysis/sourceannotations.h(68): warning C4467: usage of ATL attributes is deprecated (compiling source file str.cpp)
  254. 1>  sckutil.cpp
  255. 3>C:\Program Files (x86)\Microsoft SDKs\Windows\v7.1A\include\dbghelp.h(1540): warning C4091: 'typedef ': ignored on left of '' when no variable is declared (compiling source file str.cpp)
  256. 3>C:\Program Files (x86)\Microsoft SDKs\Windows\v7.1A\include\dbghelp.h(3056): warning C4091: 'typedef ': ignored on left of '' when no variable is declared (compiling source file str.cpp)
  257. 1>  Unknown compiler version - please run the configure tests and report the results
  258. 3>  Unknown compiler version - please run the configure tests and report the results
  259. 1>  socketsvc.cpp
  260. 1>C:\Program Files (x86)\Microsoft SDKs\Windows\v7.1A\include\dbghelp.h(1540): warning C4091: 'typedef ': ignored on left of '' when no variable is declared (compiling source file passert.cpp)
  261. 1>C:\Program Files (x86)\Microsoft SDKs\Windows\v7.1A\include\dbghelp.h(3056): warning C4091: 'typedef ': ignored on left of '' when no variable is declared (compiling source file passert.cpp)
  262. 1>passert.cpp(105): warning C4996: 'sprintf': This function or variable may be unsafe. Consider using sprintf_s instead. To disable deprecation, use _CRT_SECURE_NO_WARNINGS. See online help for details.
  263. 1>  C:\Program Files (x86)\Windows Kits\10\Include\10.0.10240.0\ucrt\stdio.h(1769): note: see declaration of 'sprintf'
  264. 1>C:\Program Files (x86)\Microsoft SDKs\Windows\v7.1A\include\dbghelp.h(1540): warning C4091: 'typedef ': ignored on left of '' when no variable is declared (compiling source file sckutil.cpp)
  265. 1>C:\Program Files (x86)\Microsoft SDKs\Windows\v7.1A\include\dbghelp.h(3056): warning C4091: 'typedef ': ignored on left of '' when no variable is declared (compiling source file sckutil.cpp)
  266. 3>  symcont.cpp
  267. 3>D:\Apps\Microsoft Visual Studio 2015\VC\include\CodeAnalysis/sourceannotations.h(68): warning C4467: usage of ATL attributes is deprecated (compiling source file symcont.cpp)
  268. 1>  Unknown compiler version - please run the configure tests and report the results
  269. 1>D:\Apps\Microsoft Visual Studio 2015\VC\include\CodeAnalysis/sourceannotations.h(68): warning C4467: usage of ATL attributes is deprecated (compiling source file Program\ProgramMain.cpp)
  270. 1>  stracpy.cpp
  271. 3>C:\Program Files (x86)\Microsoft SDKs\Windows\v7.1A\include\dbghelp.h(1540): warning C4091: 'typedef ': ignored on left of '' when no variable is declared (compiling source file symcont.cpp)
  272. 3>C:\Program Files (x86)\Microsoft SDKs\Windows\v7.1A\include\dbghelp.h(3056): warning C4091: 'typedef ': ignored on left of '' when no variable is declared (compiling source file symcont.cpp)
  273. 1>C:\Program Files (x86)\Microsoft SDKs\Windows\v7.1A\include\dbghelp.h(1540): warning C4091: 'typedef ': ignored on left of '' when no variable is declared (compiling source file stracpy.cpp)
  274. 1>C:\Program Files (x86)\Microsoft SDKs\Windows\v7.1A\include\dbghelp.h(3056): warning C4091: 'typedef ': ignored on left of '' when no variable is declared (compiling source file stracpy.cpp)
  275. 1>  streamsaver.cpp
  276. 3>  tkn_strm.cpp
  277. 1>  Unknown compiler version - please run the configure tests and report the results
  278. 1>D:\Apps\Microsoft Visual Studio 2015\VC\include\CodeAnalysis/sourceannotations.h(68): warning C4467: usage of ATL attributes is deprecated (compiling source file socketsvc.cpp)
  279. 1>C:\Program Files (x86)\Microsoft SDKs\Windows\v7.1A\include\dbghelp.h(1540): warning C4091: 'typedef ': ignored on left of '' when no variable is declared (compiling source file socketsvc.cpp)
  280. 1>C:\Program Files (x86)\Microsoft SDKs\Windows\v7.1A\include\dbghelp.h(3056): warning C4091: 'typedef ': ignored on left of '' when no variable is declared (compiling source file socketsvc.cpp)
  281. 3>  token.cpp
  282. 3>D:\Apps\Microsoft Visual Studio 2015\VC\include\CodeAnalysis/sourceannotations.h(68): warning C4467: usage of ATL attributes is deprecated (compiling source file tkn_strm.cpp)
  283. 1>  Unknown compiler version - please run the configure tests and report the results
  284. 1>D:\Apps\Microsoft Visual Studio 2015\VC\include\CodeAnalysis/sourceannotations.h(68): warning C4467: usage of ATL attributes is deprecated (compiling source file streamsaver.cpp)
  285. 3>  Unknown compiler version - please run the configure tests and report the results
  286. 3>C:\Program Files (x86)\Microsoft SDKs\Windows\v7.1A\include\dbghelp.h(1540): warning C4091: 'typedef ': ignored on left of '' when no variable is declared (compiling source file tkn_strm.cpp)
  287. 3>C:\Program Files (x86)\Microsoft SDKs\Windows\v7.1A\include\dbghelp.h(3056): warning C4091: 'typedef ': ignored on left of '' when no variable is declared (compiling source file tkn_strm.cpp)
  288. 3>  tokens.cpp
  289. 3>D:\Apps\Microsoft Visual Studio 2015\VC\include\CodeAnalysis/sourceannotations.h(68): warning C4467: usage of ATL attributes is deprecated (compiling source file token.cpp)
  290. 3>C:\Program Files (x86)\Microsoft SDKs\Windows\v7.1A\include\dbghelp.h(1540): warning C4091: 'typedef ': ignored on left of '' when no variable is declared (compiling source file token.cpp)
  291. 3>C:\Program Files (x86)\Microsoft SDKs\Windows\v7.1A\include\dbghelp.h(3056): warning C4091: 'typedef ': ignored on left of '' when no variable is declared (compiling source file token.cpp)
  292. 1>  strexcpt.cpp
  293. 3>  userfunc.cpp
  294. 3>D:\Apps\Microsoft Visual Studio 2015\VC\include\CodeAnalysis/sourceannotations.h(68): warning C4467: usage of ATL attributes is deprecated (compiling source file tokens.cpp)
  295. 3>C:\Program Files (x86)\Microsoft SDKs\Windows\v7.1A\include\dbghelp.h(1540): warning C4091: 'typedef ': ignored on left of '' when no variable is declared (compiling source file tokens.cpp)
  296. 3>C:\Program Files (x86)\Microsoft SDKs\Windows\v7.1A\include\dbghelp.h(3056): warning C4091: 'typedef ': ignored on left of '' when no variable is declared (compiling source file tokens.cpp)
  297. 1>  strset.cpp
  298. 3>D:\Apps\Microsoft Visual Studio 2015\VC\include\CodeAnalysis/sourceannotations.h(68): warning C4467: usage of ATL attributes is deprecated (compiling source file userfunc.cpp)
  299. 3>C:\Program Files (x86)\Microsoft SDKs\Windows\v7.1A\include\dbghelp.h(1540): warning C4091: 'typedef ': ignored on left of '' when no variable is declared (compiling source file userfunc.cpp)
  300. 3>C:\Program Files (x86)\Microsoft SDKs\Windows\v7.1A\include\dbghelp.h(3056): warning C4091: 'typedef ': ignored on left of '' when no variable is declared (compiling source file userfunc.cpp)
  301. 1>D:\Apps\Microsoft Visual Studio 2015\VC\include\CodeAnalysis/sourceannotations.h(68): warning C4467: usage of ATL attributes is deprecated (compiling source file strset.cpp)
  302. 1>C:\Program Files (x86)\Microsoft SDKs\Windows\v7.1A\include\dbghelp.h(1540): warning C4091: 'typedef ': ignored on left of '' when no variable is declared (compiling source file strset.cpp)
  303. 1>C:\Program Files (x86)\Microsoft SDKs\Windows\v7.1A\include\dbghelp.h(3056): warning C4091: 'typedef ': ignored on left of '' when no variable is declared (compiling source file strset.cpp)
  304. 1>  Unknown compiler version - please run the configure tests and report the results
  305. 1>  strutil.cpp
  306. 1>D:\Apps\Microsoft Visual Studio 2015\VC\include\CodeAnalysis/sourceannotations.h(68): warning C4467: usage of ATL attributes is deprecated (compiling source file strexcpt.cpp)
  307. 1>C:\Program Files (x86)\Microsoft SDKs\Windows\v7.1A\include\dbghelp.h(1540): warning C4091: 'typedef ': ignored on left of '' when no variable is declared (compiling source file strexcpt.cpp)
  308. 1>C:\Program Files (x86)\Microsoft SDKs\Windows\v7.1A\include\dbghelp.h(3056): warning C4091: 'typedef ': ignored on left of '' when no variable is declared (compiling source file strexcpt.cpp)
  309. 1>strexcpt.cpp(119): warning C4456: declaration of 'tmp' hides previous local declaration
  310. 1>  strexcpt.cpp(40): note: see declaration of 'tmp'
  311. 3>  Unknown compiler version - please run the configure tests and report the results
  312. 1>  threadhelp.cpp
  313. 1>D:\Apps\Microsoft Visual Studio 2015\VC\include\CodeAnalysis/sourceannotations.h(68): warning C4467: usage of ATL attributes is deprecated (compiling source file strutil.cpp)
  314. 1>C:\Program Files (x86)\Microsoft SDKs\Windows\v7.1A\include\dbghelp.h(1540): warning C4091: 'typedef ': ignored on left of '' when no variable is declared (compiling source file threadhelp.cpp)
  315. 1>C:\Program Files (x86)\Microsoft SDKs\Windows\v7.1A\include\dbghelp.h(3056): warning C4091: 'typedef ': ignored on left of '' when no variable is declared (compiling source file threadhelp.cpp)
  316. 1>C:\Program Files (x86)\Microsoft SDKs\Windows\v7.1A\include\dbghelp.h(1540): warning C4091: 'typedef ': ignored on left of '' when no variable is declared (compiling source file strutil.cpp)
  317. 1>C:\Program Files (x86)\Microsoft SDKs\Windows\v7.1A\include\dbghelp.h(3056): warning C4091: 'typedef ': ignored on left of '' when no variable is declared (compiling source file strutil.cpp)
  318. 1>  timer.cpp
  319. 1>  Unknown compiler version - please run the configure tests and report the results
  320. 1>  Unknown compiler version - please run the configure tests and report the results
  321. 1>D:\Apps\Microsoft Visual Studio 2015\VC\include\CodeAnalysis/sourceannotations.h(68): warning C4467: usage of ATL attributes is deprecated (compiling source file threadhelp.cpp)
  322. 1>  Unknown compiler version - please run the configure tests and report the results
  323. 1>  tracebuf.cpp
  324. 1>D:\Apps\Microsoft Visual Studio 2015\VC\include\CodeAnalysis/sourceannotations.h(68): warning C4467: usage of ATL attributes is deprecated (compiling source file timer.cpp)
  325. 3>StdAfx.obj : warning LNK4221: This object file does not define any previously undefined public symbols, so it will not be used by any link operation that consumes this library
  326. 3>  bscript-2015.vcxproj -> E:\UltimaOnline\POL\polserver\pol-core\bscript\.\Debug\bscript.lib
  327. 1>  Unknown compiler version - please run the configure tests and report the results
  328. 1>D:\Apps\Microsoft Visual Studio 2015\VC\include\CodeAnalysis/sourceannotations.h(68): warning C4467: usage of ATL attributes is deprecated (compiling source file tracebuf.cpp)
  329. 1>  wallclock.cpp
  330. 1>  wnsckt.cpp
  331. 1>  xmain.cpp
  332. 1>  tinystr.cpp
  333. 1>  tinyxml.cpp
  334. 1>C:\Program Files (x86)\Microsoft SDKs\Windows\v7.1A\include\dbghelp.h(1540): warning C4091: 'typedef ': ignored on left of '' when no variable is declared (compiling source file xmain.cpp)
  335. 1>C:\Program Files (x86)\Microsoft SDKs\Windows\v7.1A\include\dbghelp.h(3056): warning C4091: 'typedef ': ignored on left of '' when no variable is declared (compiling source file xmain.cpp)
  336. 1>  tinyxmlerror.cpp
  337. 1>C:\Program Files (x86)\Microsoft SDKs\Windows\v7.1A\include\dbghelp.h(1540): warning C4091: 'typedef ': ignored on left of '' when no variable is declared (compiling source file wnsckt.cpp)
  338. 1>C:\Program Files (x86)\Microsoft SDKs\Windows\v7.1A\include\dbghelp.h(3056): warning C4091: 'typedef ': ignored on left of '' when no variable is declared (compiling source file wnsckt.cpp)
  339. 1>..\..\lib\tinyxml\tinyxml.cpp(670): warning C4458: declaration of 'value' hides class member
  340. 1>  e:\ultimaonline\pol\polserver\lib\tinyxml\tinyxml.h(761): note: see declaration of 'TiXmlNode::value' (compiling source file ..\..\lib\tinyxml\tinyxml.cpp)
  341. 1>  tinyxmlparser.cpp
  342. 1>  Unknown compiler version - please run the configure tests and report the results
  343. 1>D:\Apps\Microsoft Visual Studio 2015\VC\include\CodeAnalysis/sourceannotations.h(68): warning C4467: usage of ATL attributes is deprecated (compiling source file wnsckt.cpp)
  344. 1>boostutils.obj : warning LNK4221: This object file does not define any previously undefined public symbols, so it will not be used by any link operation that consumes this library
  345. 1>  clib-2015.vcxproj -> E:\UltimaOnline\POL\polserver\pol-core\clib\.\Debug\clib.lib
  346. 6>------ Rebuild All started: Project: ecompile, Configuration: Debug Win32 ------
  347. 7>------ Rebuild All started: Project: runecl, Configuration: Debug Win32 ------
  348. 8>------ Rebuild All started: Project: pol, Configuration: Debug Win32 ------
  349. 9>------ Rebuild All started: Project: uotool, Configuration: Debug Win32 ------
  350. 9>  Assembling ..\clib\win2kcompat.masm...
  351. 6>  Assembling ..\clib\win2kcompat.masm...
  352. 8>  Assembling ..\clib\win2kcompat.masm...
  353. 7>  Assembling ..\clib\win2kcompat.masm...
  354. 6>  ECompileMain.cpp
  355. 9>  multidefs.cpp
  356. 6>  StdAfx.cpp
  357. 9>  multidef.cpp
  358. 7>  pkg.cpp
  359. 7>  systemstate.cpp
  360. 9>  polfile1.cpp
  361. 7>  binaryfilescrobj.cpp
  362. 8>  allocd.cpp
  363. 9>  StdAfx.cpp
  364. 8>  binaryfilescrobj.cpp
  365. 8>  bowsalut.cpp
  366. 8>  cfgrepos.cpp
  367. 7>  cfgrepos.cpp
  368. 7>  Unknown compiler version - please run the configure tests and report the results
  369. 6>C:\Program Files (x86)\Microsoft SDKs\Windows\v7.1A\include\dbghelp.h(1540): warning C4091: 'typedef ': ignored on left of '' when no variable is declared (compiling source file StdAfx.cpp)
  370. 6>C:\Program Files (x86)\Microsoft SDKs\Windows\v7.1A\include\dbghelp.h(3056): warning C4091: 'typedef ': ignored on left of '' when no variable is declared (compiling source file StdAfx.cpp)
  371. 9>C:\Program Files (x86)\Microsoft SDKs\Windows\v7.1A\include\dbghelp.h(1540): warning C4091: 'typedef ': ignored on left of '' when no variable is declared (compiling source file StdAfx.cpp)
  372. 9>C:\Program Files (x86)\Microsoft SDKs\Windows\v7.1A\include\dbghelp.h(3056): warning C4091: 'typedef ': ignored on left of '' when no variable is declared (compiling source file StdAfx.cpp)
  373. 9>  Unknown compiler version - please run the configure tests and report the results
  374. 7>  Unknown compiler version - please run the configure tests and report the results
  375. 9>  Unknown compiler version - please run the configure tests and report the results
  376. 9>D:\Apps\Microsoft Visual Studio 2015\VC\include\CodeAnalysis/sourceannotations.h(68): warning C4467: usage of ATL attributes is deprecated (compiling source file ..\pol\multi\multidef.cpp)
  377. 9>  Unknown compiler version - please run the configure tests and report the results
  378. 8>D:\Apps\Microsoft Visual Studio 2015\VC\include\CodeAnalysis/sourceannotations.h(68): warning C4467: usage of ATL attributes is deprecated (compiling source file bowsalut.cpp)
  379. 7>D:\Apps\Microsoft Visual Studio 2015\VC\include\CodeAnalysis/sourceannotations.h(68): warning C4467: usage of ATL attributes is deprecated (compiling source file ..\pol\cfgrepos.cpp)
  380. 8>D:\Apps\Microsoft Visual Studio 2015\VC\include\CodeAnalysis/sourceannotations.h(68): warning C4467: usage of ATL attributes is deprecated (compiling source file cfgrepos.cpp)
  381. 7>D:\Apps\Microsoft Visual Studio 2015\VC\include\CodeAnalysis/sourceannotations.h(68): warning C4467: usage of ATL attributes is deprecated (compiling source file ..\plib\pkg.cpp)
  382. 7>D:\Apps\Microsoft Visual Studio 2015\VC\include\CodeAnalysis/sourceannotations.h(68): warning C4467: usage of ATL attributes is deprecated (compiling source file ..\plib\systemstate.cpp)
  383. 6>C:\Program Files (x86)\Microsoft SDKs\Windows\v7.1A\include\dbghelp.h(1540): warning C4091: 'typedef ': ignored on left of '' when no variable is declared (compiling source file ECompileMain.cpp)
  384. 6>C:\Program Files (x86)\Microsoft SDKs\Windows\v7.1A\include\dbghelp.h(3056): warning C4091: 'typedef ': ignored on left of '' when no variable is declared (compiling source file ECompileMain.cpp)
  385. 8>C:\Program Files (x86)\Microsoft SDKs\Windows\v7.1A\include\dbghelp.h(1540): warning C4091: 'typedef ': ignored on left of '' when no variable is declared (compiling source file bowsalut.cpp)
  386. 7>C:\Program Files (x86)\Microsoft SDKs\Windows\v7.1A\include\dbghelp.h(1540): warning C4091: 'typedef ': ignored on left of '' when no variable is declared (compiling source file ..\plib\pkg.cpp)
  387. 8>C:\Program Files (x86)\Microsoft SDKs\Windows\v7.1A\include\dbghelp.h(3056): warning C4091: 'typedef ': ignored on left of '' when no variable is declared (compiling source file bowsalut.cpp)
  388. 7>C:\Program Files (x86)\Microsoft SDKs\Windows\v7.1A\include\dbghelp.h(3056): warning C4091: 'typedef ': ignored on left of '' when no variable is declared (compiling source file ..\plib\pkg.cpp)
  389. 7>C:\Program Files (x86)\Microsoft SDKs\Windows\v7.1A\include\dbghelp.h(1540): warning C4091: 'typedef ': ignored on left of '' when no variable is declared (compiling source file ..\plib\systemstate.cpp)
  390. 7>C:\Program Files (x86)\Microsoft SDKs\Windows\v7.1A\include\dbghelp.h(3056): warning C4091: 'typedef ': ignored on left of '' when no variable is declared (compiling source file ..\plib\systemstate.cpp)
  391. 8>D:\Apps\Microsoft Visual Studio 2015\VC\include\CodeAnalysis/sourceannotations.h(68): warning C4467: usage of ATL attributes is deprecated (compiling source file binaryfilescrobj.cpp)
  392. 7>D:\Apps\Microsoft Visual Studio 2015\VC\include\CodeAnalysis/sourceannotations.h(68): warning C4467: usage of ATL attributes is deprecated (compiling source file ..\pol\binaryfilescrobj.cpp)
  393. 9>D:\Apps\Microsoft Visual Studio 2015\VC\include\CodeAnalysis/sourceannotations.h(68): warning C4467: usage of ATL attributes is deprecated (compiling source file ..\pol\polfile1.cpp)
  394. 7>  Unknown compiler version - please run the configure tests and report the results
  395. 8>  Unknown compiler version - please run the configure tests and report the results
  396. 9>  Unknown compiler version - please run the configure tests and report the results
  397. 6>  Unknown compiler version - please run the configure tests and report the results
  398. 8>C:\Program Files (x86)\Microsoft SDKs\Windows\v7.1A\include\dbghelp.h(1540): warning C4091: 'typedef ': ignored on left of '' when no variable is declared (compiling source file binaryfilescrobj.cpp)
  399. 8>C:\Program Files (x86)\Microsoft SDKs\Windows\v7.1A\include\dbghelp.h(3056): warning C4091: 'typedef ': ignored on left of '' when no variable is declared (compiling source file binaryfilescrobj.cpp)
  400. 7>C:\Program Files (x86)\Microsoft SDKs\Windows\v7.1A\include\dbghelp.h(1540): warning C4091: 'typedef ': ignored on left of '' when no variable is declared (compiling source file ..\pol\binaryfilescrobj.cpp)
  401. 7>C:\Program Files (x86)\Microsoft SDKs\Windows\v7.1A\include\dbghelp.h(3056): warning C4091: 'typedef ': ignored on left of '' when no variable is declared (compiling source file ..\pol\binaryfilescrobj.cpp)
  402. 7>  Unknown compiler version - please run the configure tests and report the results
  403. 8>  Unknown compiler version - please run the configure tests and report the results
  404. 9>D:\Apps\Microsoft Visual Studio 2015\VC\include\CodeAnalysis/sourceannotations.h(68): warning C4467: usage of ATL attributes is deprecated (compiling source file StdAfx.cpp)
  405. 6>D:\Apps\Microsoft Visual Studio 2015\VC\include\CodeAnalysis/sourceannotations.h(68): warning C4467: usage of ATL attributes is deprecated (compiling source file StdAfx.cpp)
  406. 9>  UoToolMain.cpp
  407. 7>  dice.cpp
  408. 8>  Unknown compiler version - please run the configure tests and report the results
  409. 6>  Unknown compiler version - please run the configure tests and report the results
  410. 8>  Unknown compiler version - please run the configure tests and report the results
  411. 8>D:\Apps\Microsoft Visual Studio 2015\VC\include\CodeAnalysis/sourceannotations.h(68): warning C4467: usage of ATL attributes is deprecated (compiling source file allocd.cpp)
  412. 6>D:\Apps\Microsoft Visual Studio 2015\VC\include\CodeAnalysis/sourceannotations.h(68): warning C4467: usage of ATL attributes is deprecated (compiling source file ECompileMain.cpp)
  413. 9>C:\Program Files (x86)\Microsoft SDKs\Windows\v7.1A\include\dbghelp.h(1540): warning C4091: 'typedef ': ignored on left of '' when no variable is declared (compiling source file ..\pol\polfile1.cpp)
  414. 9>C:\Program Files (x86)\Microsoft SDKs\Windows\v7.1A\include\dbghelp.h(3056): warning C4091: 'typedef ': ignored on left of '' when no variable is declared (compiling source file ..\pol\polfile1.cpp)
  415. 9>C:\Program Files (x86)\Microsoft SDKs\Windows\v7.1A\include\dbghelp.h(1540): warning C4091: 'typedef ': ignored on left of '' when no variable is declared (compiling source file ..\pol\multi\multidef.cpp)
  416. 9>C:\Program Files (x86)\Microsoft SDKs\Windows\v7.1A\include\dbghelp.h(3056): warning C4091: 'typedef ': ignored on left of '' when no variable is declared (compiling source file ..\pol\multi\multidef.cpp)
  417. 9>  Unknown compiler version - please run the configure tests and report the results
  418. 9>D:\Apps\Microsoft Visual Studio 2015\VC\include\CodeAnalysis/sourceannotations.h(68): warning C4467: usage of ATL attributes is deprecated (compiling source file UoToolMain.cpp)
  419. 7>D:\Apps\Microsoft Visual Studio 2015\VC\include\CodeAnalysis/sourceannotations.h(68): warning C4467: usage of ATL attributes is deprecated (compiling source file ..\pol\dice.cpp)
  420. 7>C:\Program Files (x86)\Microsoft SDKs\Windows\v7.1A\include\dbghelp.h(1540): warning C4091: 'typedef ': ignored on left of '' when no variable is declared (compiling source file ..\pol\dice.cpp)
  421. 7>C:\Program Files (x86)\Microsoft SDKs\Windows\v7.1A\include\dbghelp.h(3056): warning C4091: 'typedef ': ignored on left of '' when no variable is declared (compiling source file ..\pol\dice.cpp)
  422. 9>C:\Program Files (x86)\Microsoft SDKs\Windows\v7.1A\include\dbghelp.h(1540): warning C4091: 'typedef ': ignored on left of '' when no variable is declared (compiling source file UoToolMain.cpp)
  423. 9>C:\Program Files (x86)\Microsoft SDKs\Windows\v7.1A\include\dbghelp.h(3056): warning C4091: 'typedef ': ignored on left of '' when no variable is declared (compiling source file UoToolMain.cpp)
  424. 6>ECompileMain.cpp(822): warning C4996: 'getenv': This function or variable may be unsafe. Consider using _dupenv_s instead. To disable deprecation, use _CRT_SECURE_NO_WARNINGS. See online help for details.
  425. 6>  C:\Program Files (x86)\Windows Kits\10\Include\10.0.10240.0\ucrt\stdlib.h(1183): note: see declaration of 'getenv'
  426. 7>  Unknown compiler version - please run the configure tests and report the results
  427. 9>UoToolMain.cpp(140): warning C4996: 'fopen': This function or variable may be unsafe. Consider using fopen_s instead. To disable deprecation, use _CRT_SECURE_NO_WARNINGS. See online help for details.
  428. 9>  C:\Program Files (x86)\Windows Kits\10\Include\10.0.10240.0\ucrt\stdio.h(205): note: see declaration of 'fopen'
  429. 9>UoToolMain.cpp(411): warning C4996: 'fopen': This function or variable may be unsafe. Consider using fopen_s instead. To disable deprecation, use _CRT_SECURE_NO_WARNINGS. See online help for details.
  430. 9>  C:\Program Files (x86)\Windows Kits\10\Include\10.0.10240.0\ucrt\stdio.h(205): note: see declaration of 'fopen'
  431. 9>UoToolMain.cpp(628): warning C4996: 'fopen': This function or variable may be unsafe. Consider using fopen_s instead. To disable deprecation, use _CRT_SECURE_NO_WARNINGS. See online help for details.
  432. 9>  C:\Program Files (x86)\Windows Kits\10\Include\10.0.10240.0\ucrt\stdio.h(205): note: see declaration of 'fopen'
  433. 9>UoToolMain.cpp(926): warning C4996: 'fopen': This function or variable may be unsafe. Consider using fopen_s instead. To disable deprecation, use _CRT_SECURE_NO_WARNINGS. See online help for details.
  434. 9>  C:\Program Files (x86)\Windows Kits\10\Include\10.0.10240.0\ucrt\stdio.h(205): note: see declaration of 'fopen'
  435. 9>UoToolMain.cpp(927): warning C4996: 'fopen': This function or variable may be unsafe. Consider using fopen_s instead. To disable deprecation, use _CRT_SECURE_NO_WARNINGS. See online help for details.
  436. 9>  C:\Program Files (x86)\Windows Kits\10\Include\10.0.10240.0\ucrt\stdio.h(205): note: see declaration of 'fopen'
  437. 9>UoToolMain.cpp(1030): warning C4996: 'sprintf': This function or variable may be unsafe. Consider using sprintf_s instead. To disable deprecation, use _CRT_SECURE_NO_WARNINGS. See online help for details.
  438. 9>  C:\Program Files (x86)\Windows Kits\10\Include\10.0.10240.0\ucrt\stdio.h(1769): note: see declaration of 'sprintf'
  439. 8>  checkpnt.cpp
  440. 7>  ucfg.cpp
  441. 8>  Unknown compiler version - please run the configure tests and report the results
  442. 7>D:\Apps\Microsoft Visual Studio 2015\VC\include\CodeAnalysis/sourceannotations.h(68): warning C4467: usage of ATL attributes is deprecated (compiling source file ..\pol\globals\ucfg.cpp)
  443. 8>  clfunc.cpp
  444. 7>  Unknown compiler version - please run the configure tests and report the results
  445. 7>  basiciomod.cpp
  446. 8>D:\Apps\Microsoft Visual Studio 2015\VC\include\CodeAnalysis/sourceannotations.h(68): warning C4467: usage of ATL attributes is deprecated (compiling source file checkpnt.cpp)
  447. 7>D:\Apps\Microsoft Visual Studio 2015\VC\include\CodeAnalysis/sourceannotations.h(68): warning C4467: usage of ATL attributes is deprecated (compiling source file ..\pol\module\basiciomod.cpp)
  448. 7>  basicmod.cpp
  449. 8>  Unknown compiler version - please run the configure tests and report the results
  450. 7>  cfgmod.cpp
  451. 8>  cmbtcfg.cpp
  452. 8>  Unknown compiler version - please run the configure tests and report the results
  453. 8>D:\Apps\Microsoft Visual Studio 2015\VC\include\CodeAnalysis/sourceannotations.h(68): warning C4467: usage of ATL attributes is deprecated (compiling source file clfunc.cpp)
  454. 8>C:\Program Files (x86)\Microsoft SDKs\Windows\v7.1A\include\dbghelp.h(1540): warning C4091: 'typedef ': ignored on left of '' when no variable is declared (compiling source file clfunc.cpp)
  455. 8>C:\Program Files (x86)\Microsoft SDKs\Windows\v7.1A\include\dbghelp.h(3056): warning C4091: 'typedef ': ignored on left of '' when no variable is declared (compiling source file clfunc.cpp)
  456. 7>  Unknown compiler version - please run the configure tests and report the results
  457. 7>D:\Apps\Microsoft Visual Studio 2015\VC\include\CodeAnalysis/sourceannotations.h(68): warning C4467: usage of ATL attributes is deprecated (compiling source file ..\pol\module\basicmod.cpp)
  458. 8>D:\Apps\Microsoft Visual Studio 2015\VC\include\CodeAnalysis/sourceannotations.h(68): warning C4467: usage of ATL attributes is deprecated (compiling source file cmbtcfg.cpp)
  459. 6>LINK : fatal error LNK1104: cannot open file '.\Debug\win2kcompat.obj'
  460. 10>------ Rebuild All started: Project: poltool, Configuration: Debug Win32 ------
  461. 7>D:\Apps\Microsoft Visual Studio 2015\VC\include\CodeAnalysis/sourceannotations.h(68): warning C4467: usage of ATL attributes is deprecated (compiling source file ..\pol\module\cfgmod.cpp)
  462. 10>  Assembling ..\clib\win2kcompat.masm...
  463. 7>C:\Program Files (x86)\Microsoft SDKs\Windows\v7.1A\include\dbghelp.h(1540): warning C4091: 'typedef ': ignored on left of '' when no variable is declared (compiling source file ..\pol\module\basiciomod.cpp)
  464. 7>C:\Program Files (x86)\Microsoft SDKs\Windows\v7.1A\include\dbghelp.h(3056): warning C4091: 'typedef ': ignored on left of '' when no variable is declared (compiling source file ..\pol\module\basiciomod.cpp)
  465. 7>  Unknown compiler version - please run the configure tests and report the results
  466. 10>  PolToolMain.cpp
  467. 10>  StdAfx.cpp
  468. 9>LINK : fatal error LNK1104: cannot open file '.\Debug\win2kcompat.obj'
  469. 11>------ Rebuild All started: Project: uoconvert, Configuration: Debug Win32 ------
  470. 10>C:\Program Files (x86)\Microsoft SDKs\Windows\v7.1A\include\dbghelp.h(1540): warning C4091: 'typedef ': ignored on left of '' when no variable is declared (compiling source file StdAfx.cpp)
  471. 10>C:\Program Files (x86)\Microsoft SDKs\Windows\v7.1A\include\dbghelp.h(3056): warning C4091: 'typedef ': ignored on left of '' when no variable is declared (compiling source file StdAfx.cpp)
  472. 11>  Assembling ..\clib\win2kcompat.masm...
  473. 7>  Unknown compiler version - please run the configure tests and report the results
  474. 7>C:\Program Files (x86)\Microsoft SDKs\Windows\v7.1A\include\dbghelp.h(1540): warning C4091: 'typedef ': ignored on left of '' when no variable is declared (compiling source file ..\pol\module\basicmod.cpp)
  475. 7>C:\Program Files (x86)\Microsoft SDKs\Windows\v7.1A\include\dbghelp.h(3056): warning C4091: 'typedef ': ignored on left of '' when no variable is declared (compiling source file ..\pol\module\basicmod.cpp)
  476. 7>..\pol\module\basicmod.cpp(500): warning C4244: 'argument': conversion from 'std::streamoff' to 'unsigned int', possible loss of data
  477. 7>  datastore.cpp
  478. 8>  cmdlevel.cpp
  479. 10>  Unknown compiler version - please run the configure tests and report the results
  480. 8>D:\Apps\Microsoft Visual Studio 2015\VC\include\CodeAnalysis/sourceannotations.h(68): warning C4467: usage of ATL attributes is deprecated (compiling source file cmdlevel.cpp)
  481. 10>  Unknown compiler version - please run the configure tests and report the results
  482. 8>C:\Program Files (x86)\Microsoft SDKs\Windows\v7.1A\include\dbghelp.h(1540): warning C4091: 'typedef ': ignored on left of '' when no variable is declared (compiling source file cmdlevel.cpp)
  483. 8>C:\Program Files (x86)\Microsoft SDKs\Windows\v7.1A\include\dbghelp.h(3056): warning C4091: 'typedef ': ignored on left of '' when no variable is declared (compiling source file cmdlevel.cpp)
  484. 10>D:\Apps\Microsoft Visual Studio 2015\VC\include\CodeAnalysis/sourceannotations.h(68): warning C4467: usage of ATL attributes is deprecated (compiling source file StdAfx.cpp)
  485. 10>D:\Apps\Microsoft Visual Studio 2015\VC\include\CodeAnalysis/sourceannotations.h(68): warning C4467: usage of ATL attributes is deprecated (compiling source file PolToolMain.cpp)
  486. 8>  Unknown compiler version - please run the configure tests and report the results
  487. 8>  console.cpp
  488. 8>  containr.cpp
  489. 8>D:\Apps\Microsoft Visual Studio 2015\VC\include\CodeAnalysis/sourceannotations.h(68): warning C4467: usage of ATL attributes is deprecated (compiling source file containr.cpp)
  490. 8>D:\Apps\Microsoft Visual Studio 2015\VC\include\CodeAnalysis/sourceannotations.h(68): warning C4467: usage of ATL attributes is deprecated (compiling source file console.cpp)
  491. 11>  polfile1.cpp
  492. 7>C:\Program Files (x86)\Microsoft SDKs\Windows\v7.1A\include\dbghelp.h(1540): warning C4091: 'typedef ': ignored on left of '' when no variable is declared (compiling source file ..\pol\module\cfgmod.cpp)
  493. 7>C:\Program Files (x86)\Microsoft SDKs\Windows\v7.1A\include\dbghelp.h(3056): warning C4091: 'typedef ': ignored on left of '' when no variable is declared (compiling source file ..\pol\module\cfgmod.cpp)
  494. 11>  StdAfx.cpp
  495. 7>D:\Apps\Microsoft Visual Studio 2015\VC\include\CodeAnalysis/sourceannotations.h(68): warning C4467: usage of ATL attributes is deprecated (compiling source file ..\pol\module\datastore.cpp)
  496. 11>  UoConvertMain.cpp
  497. 7>  Unknown compiler version - please run the configure tests and report the results
  498. 11>C:\Program Files (x86)\Microsoft SDKs\Windows\v7.1A\include\dbghelp.h(1540): warning C4091: 'typedef ': ignored on left of '' when no variable is declared (compiling source file StdAfx.cpp)
  499. 7>C:\Program Files (x86)\Microsoft SDKs\Windows\v7.1A\include\dbghelp.h(1540): warning C4091: 'typedef ': ignored on left of '' when no variable is declared (compiling source file ..\pol\module\datastore.cpp)
  500. 11>C:\Program Files (x86)\Microsoft SDKs\Windows\v7.1A\include\dbghelp.h(3056): warning C4091: 'typedef ': ignored on left of '' when no variable is declared (compiling source file StdAfx.cpp)
  501. 7>C:\Program Files (x86)\Microsoft SDKs\Windows\v7.1A\include\dbghelp.h(3056): warning C4091: 'typedef ': ignored on left of '' when no variable is declared (compiling source file ..\pol\module\datastore.cpp)
  502. 11>  Unknown compiler version - please run the configure tests and report the results
  503. 7>  filemod.cpp
  504. 11>  Unknown compiler version - please run the configure tests and report the results
  505. 7>D:\Apps\Microsoft Visual Studio 2015\VC\include\CodeAnalysis/sourceannotations.h(68): warning C4467: usage of ATL attributes is deprecated (compiling source file ..\pol\module\filemod.cpp)
  506. 11>D:\Apps\Microsoft Visual Studio 2015\VC\include\CodeAnalysis/sourceannotations.h(68): warning C4467: usage of ATL attributes is deprecated (compiling source file UoConvertMain.cpp)
  507. 7>  mathmod.cpp
  508. 11>C:\Program Files (x86)\Microsoft SDKs\Windows\v7.1A\include\dbghelp.h(1540): warning C4091: 'typedef ': ignored on left of '' when no variable is declared (compiling source file UoConvertMain.cpp)
  509. 7>  Unknown compiler version - please run the configure tests and report the results
  510. 11>C:\Program Files (x86)\Microsoft SDKs\Windows\v7.1A\include\dbghelp.h(3056): warning C4091: 'typedef ': ignored on left of '' when no variable is declared (compiling source file UoConvertMain.cpp)
  511. 7>  utilmod.cpp
  512. 11>D:\Apps\Microsoft Visual Studio 2015\VC\include\CodeAnalysis/sourceannotations.h(68): warning C4467: usage of ATL attributes is deprecated (compiling source file ..\pol\polfile1.cpp)
  513. 7>D:\Apps\Microsoft Visual Studio 2015\VC\include\CodeAnalysis/sourceannotations.h(68): warning C4467: usage of ATL attributes is deprecated (compiling source file ..\pol\module\mathmod.cpp)
  514. 11>  Unknown compiler version - please run the configure tests and report the results
  515. 11>D:\Apps\Microsoft Visual Studio 2015\VC\include\CodeAnalysis/sourceannotations.h(68): warning C4467: usage of ATL attributes is deprecated (compiling source file StdAfx.cpp)
  516. 11>UoConvertMain.cpp(906): warning C4996: 'fopen': This function or variable may be unsafe. Consider using fopen_s instead. To disable deprecation, use _CRT_SECURE_NO_WARNINGS. See online help for details.
  517. 11>  C:\Program Files (x86)\Windows Kits\10\Include\10.0.10240.0\ucrt\stdio.h(205): note: see declaration of 'fopen'
  518. 11>UoConvertMain.cpp(945): warning C4996: 'fopen': This function or variable may be unsafe. Consider using fopen_s instead. To disable deprecation, use _CRT_SECURE_NO_WARNINGS. See online help for details.
  519. 11>  C:\Program Files (x86)\Windows Kits\10\Include\10.0.10240.0\ucrt\stdio.h(205): note: see declaration of 'fopen'
  520. 11>UoConvertMain.cpp(1011): warning C4996: 'fopen': This function or variable may be unsafe. Consider using fopen_s instead. To disable deprecation, use _CRT_SECURE_NO_WARNINGS. See online help for details.
  521. 11>  C:\Program Files (x86)\Windows Kits\10\Include\10.0.10240.0\ucrt\stdio.h(205): note: see declaration of 'fopen'
  522. 11>C:\Program Files (x86)\Microsoft SDKs\Windows\v7.1A\include\dbghelp.h(1540): warning C4091: 'typedef ': ignored on left of '' when no variable is declared (compiling source file ..\pol\polfile1.cpp)
  523. 11>C:\Program Files (x86)\Microsoft SDKs\Windows\v7.1A\include\dbghelp.h(3056): warning C4091: 'typedef ': ignored on left of '' when no variable is declared (compiling source file ..\pol\polfile1.cpp)
  524. 7>C:\Program Files (x86)\Microsoft SDKs\Windows\v7.1A\include\dbghelp.h(1540): warning C4091: 'typedef ': ignored on left of '' when no variable is declared (compiling source file ..\pol\module\filemod.cpp)
  525. 7>C:\Program Files (x86)\Microsoft SDKs\Windows\v7.1A\include\dbghelp.h(3056): warning C4091: 'typedef ': ignored on left of '' when no variable is declared (compiling source file ..\pol\module\filemod.cpp)
  526. 7>  Unknown compiler version - please run the configure tests and report the results
  527. 7>D:\Apps\Microsoft Visual Studio 2015\VC\include\CodeAnalysis/sourceannotations.h(68): warning C4467: usage of ATL attributes is deprecated (compiling source file ..\pol\module\utilmod.cpp)
  528. 8>C:\Program Files (x86)\Microsoft SDKs\Windows\v7.1A\include\dbghelp.h(1540): warning C4091: 'typedef ': ignored on left of '' when no variable is declared (compiling source file console.cpp)
  529. 8>C:\Program Files (x86)\Microsoft SDKs\Windows\v7.1A\include\dbghelp.h(3056): warning C4091: 'typedef ': ignored on left of '' when no variable is declared (compiling source file console.cpp)
  530. 8>  Unknown compiler version - please run the configure tests and report the results
  531. 10>LINK : fatal error LNK1104: cannot open file '.\Debug\win2kcompat.obj'
  532. 8>  core.cpp
  533. 7>C:\Program Files (x86)\Microsoft SDKs\Windows\v7.1A\include\dbghelp.h(1540): warning C4091: 'typedef ': ignored on left of '' when no variable is declared (compiling source file ..\pol\module\mathmod.cpp)
  534. 7>C:\Program Files (x86)\Microsoft SDKs\Windows\v7.1A\include\dbghelp.h(3056): warning C4091: 'typedef ': ignored on left of '' when no variable is declared (compiling source file ..\pol\module\mathmod.cpp)
  535. 7>  Unknown compiler version - please run the configure tests and report the results
  536. 8>  Unknown compiler version - please run the configure tests and report the results
  537. 7>  proplist.cpp
  538. 7>  Unknown compiler version - please run the configure tests and report the results
  539. 8>D:\Apps\Microsoft Visual Studio 2015\VC\include\CodeAnalysis/sourceannotations.h(68): warning C4467: usage of ATL attributes is deprecated (compiling source file core.cpp)
  540. 7>C:\Program Files (x86)\Microsoft SDKs\Windows\v7.1A\include\dbghelp.h(1540): warning C4091: 'typedef ': ignored on left of '' when no variable is declared (compiling source file ..\pol\module\utilmod.cpp)
  541. 7>C:\Program Files (x86)\Microsoft SDKs\Windows\v7.1A\include\dbghelp.h(3056): warning C4091: 'typedef ': ignored on left of '' when no variable is declared (compiling source file ..\pol\module\utilmod.cpp)
  542. 8>  Unknown compiler version - please run the configure tests and report the results
  543. 8>C:\Program Files (x86)\Microsoft SDKs\Windows\v7.1A\include\dbghelp.h(1540): warning C4091: 'typedef ': ignored on left of '' when no variable is declared (compiling source file containr.cpp)
  544. 8>C:\Program Files (x86)\Microsoft SDKs\Windows\v7.1A\include\dbghelp.h(3056): warning C4091: 'typedef ': ignored on left of '' when no variable is declared (compiling source file containr.cpp)
  545. 8>C:\Program Files (x86)\Microsoft SDKs\Windows\v7.1A\include\dbghelp.h(1540): warning C4091: 'typedef ': ignored on left of '' when no variable is declared (compiling source file core.cpp)
  546. 8>C:\Program Files (x86)\Microsoft SDKs\Windows\v7.1A\include\dbghelp.h(3056): warning C4091: 'typedef ': ignored on left of '' when no variable is declared (compiling source file core.cpp)
  547. 8>  create.cpp
  548. 11>LINK : fatal error LNK1104: cannot open file '.\Debug\win2kcompat.obj'
  549. 7>  xmlfilescrobj.cpp
  550. 7>  RunEclMain.cpp
  551. 7>D:\Apps\Microsoft Visual Studio 2015\VC\include\CodeAnalysis/sourceannotations.h(68): warning C4467: usage of ATL attributes is deprecated (compiling source file ..\pol\proplist.cpp)
  552. 7>C:\Program Files (x86)\Microsoft SDKs\Windows\v7.1A\include\dbghelp.h(1540): warning C4091: 'typedef ': ignored on left of '' when no variable is declared (compiling source file ..\pol\proplist.cpp)
  553. 7>C:\Program Files (x86)\Microsoft SDKs\Windows\v7.1A\include\dbghelp.h(3056): warning C4091: 'typedef ': ignored on left of '' when no variable is declared (compiling source file ..\pol\proplist.cpp)
  554. 7>  StdAfx.cpp
  555. 7>D:\Apps\Microsoft Visual Studio 2015\VC\include\CodeAnalysis/sourceannotations.h(68): warning C4467: usage of ATL attributes is deprecated (compiling source file ..\pol\xmlfilescrobj.cpp)
  556. 7>C:\Program Files (x86)\Microsoft SDKs\Windows\v7.1A\include\dbghelp.h(1540): warning C4091: 'typedef ': ignored on left of '' when no variable is declared (compiling source file StdAfx.cpp)
  557. 7>C:\Program Files (x86)\Microsoft SDKs\Windows\v7.1A\include\dbghelp.h(3056): warning C4091: 'typedef ': ignored on left of '' when no variable is declared (compiling source file StdAfx.cpp)
  558. 8>  Unknown compiler version - please run the configure tests and report the results
  559. 8>D:\Apps\Microsoft Visual Studio 2015\VC\include\CodeAnalysis/sourceannotations.h(68): warning C4467: usage of ATL attributes is deprecated (compiling source file create.cpp)
  560. 7>C:\Program Files (x86)\Microsoft SDKs\Windows\v7.1A\include\dbghelp.h(1540): warning C4091: 'typedef ': ignored on left of '' when no variable is declared (compiling source file ..\pol\xmlfilescrobj.cpp)
  561. 7>C:\Program Files (x86)\Microsoft SDKs\Windows\v7.1A\include\dbghelp.h(3056): warning C4091: 'typedef ': ignored on left of '' when no variable is declared (compiling source file ..\pol\xmlfilescrobj.cpp)
  562. 7>  Unknown compiler version - please run the configure tests and report the results
  563. 7>  Unknown compiler version - please run the configure tests and report the results
  564. 7>D:\Apps\Microsoft Visual Studio 2015\VC\include\CodeAnalysis/sourceannotations.h(68): warning C4467: usage of ATL attributes is deprecated (compiling source file RunEclMain.cpp)
  565. 7>  Unknown compiler version - please run the configure tests and report the results
  566. 7>C:\Program Files (x86)\Microsoft SDKs\Windows\v7.1A\include\dbghelp.h(1540): warning C4091: 'typedef ': ignored on left of '' when no variable is declared (compiling source file RunEclMain.cpp)
  567. 7>C:\Program Files (x86)\Microsoft SDKs\Windows\v7.1A\include\dbghelp.h(3056): warning C4091: 'typedef ': ignored on left of '' when no variable is declared (compiling source file RunEclMain.cpp)
  568. 7>D:\Apps\Microsoft Visual Studio 2015\VC\include\CodeAnalysis/sourceannotations.h(68): warning C4467: usage of ATL attributes is deprecated (compiling source file StdAfx.cpp)
  569. 8>C:\Program Files (x86)\Microsoft SDKs\Windows\v7.1A\include\dbghelp.h(1540): warning C4091: 'typedef ': ignored on left of '' when no variable is declared (compiling source file create.cpp)
  570. 8>C:\Program Files (x86)\Microsoft SDKs\Windows\v7.1A\include\dbghelp.h(3056): warning C4091: 'typedef ': ignored on left of '' when no variable is declared (compiling source file create.cpp)
  571. 8>  ctable.cpp
  572. 8>  dblclick.cpp
  573. 8>  Unknown compiler version - please run the configure tests and report the results
  574. 8>D:\Apps\Microsoft Visual Studio 2015\VC\include\CodeAnalysis/sourceannotations.h(68): warning C4467: usage of ATL attributes is deprecated (compiling source file dblclick.cpp)
  575. 8>C:\Program Files (x86)\Microsoft SDKs\Windows\v7.1A\include\dbghelp.h(1540): warning C4091: 'typedef ': ignored on left of '' when no variable is declared (compiling source file dblclick.cpp)
  576. 8>C:\Program Files (x86)\Microsoft SDKs\Windows\v7.1A\include\dbghelp.h(3056): warning C4091: 'typedef ': ignored on left of '' when no variable is declared (compiling source file dblclick.cpp)
  577. 8>  decay.cpp
  578. 8>  dice.cpp
  579. 7>LINK : fatal error LNK1104: cannot open file '.\Debug\win2kcompat.obj'
  580. 8>  Unknown compiler version - please run the configure tests and report the results
  581. 8>D:\Apps\Microsoft Visual Studio 2015\VC\include\CodeAnalysis/sourceannotations.h(68): warning C4467: usage of ATL attributes is deprecated (compiling source file dice.cpp)
  582. 8>D:\Apps\Microsoft Visual Studio 2015\VC\include\CodeAnalysis/sourceannotations.h(68): warning C4467: usage of ATL attributes is deprecated (compiling source file decay.cpp)
  583. 8>C:\Program Files (x86)\Microsoft SDKs\Windows\v7.1A\include\dbghelp.h(1540): warning C4091: 'typedef ': ignored on left of '' when no variable is declared (compiling source file dice.cpp)
  584. 8>C:\Program Files (x86)\Microsoft SDKs\Windows\v7.1A\include\dbghelp.h(3056): warning C4091: 'typedef ': ignored on left of '' when no variable is declared (compiling source file dice.cpp)
  585. 8>  Unknown compiler version - please run the configure tests and report the results
  586. 8>  door.cpp
  587. 8>D:\Apps\Microsoft Visual Studio 2015\VC\include\CodeAnalysis/sourceannotations.h(68): warning C4467: usage of ATL attributes is deprecated (compiling source file door.cpp)
  588. 8>C:\Program Files (x86)\Microsoft SDKs\Windows\v7.1A\include\dbghelp.h(1540): warning C4091: 'typedef ': ignored on left of '' when no variable is declared (compiling source file decay.cpp)
  589. 8>C:\Program Files (x86)\Microsoft SDKs\Windows\v7.1A\include\dbghelp.h(3056): warning C4091: 'typedef ': ignored on left of '' when no variable is declared (compiling source file decay.cpp)
  590. 8>  Unknown compiler version - please run the configure tests and report the results
  591. 8>  dropitem.cpp
  592. 8>D:\Apps\Microsoft Visual Studio 2015\VC\include\CodeAnalysis/sourceannotations.h(68): warning C4467: usage of ATL attributes is deprecated (compiling source file dropitem.cpp)
  593. 8>  Unknown compiler version - please run the configure tests and report the results
  594. 8>C:\Program Files (x86)\Microsoft SDKs\Windows\v7.1A\include\dbghelp.h(1540): warning C4091: 'typedef ': ignored on left of '' when no variable is declared (compiling source file door.cpp)
  595. 8>C:\Program Files (x86)\Microsoft SDKs\Windows\v7.1A\include\dbghelp.h(3056): warning C4091: 'typedef ': ignored on left of '' when no variable is declared (compiling source file door.cpp)
  596. 8>C:\Program Files (x86)\Microsoft SDKs\Windows\v7.1A\include\dbghelp.h(1540): warning C4091: 'typedef ': ignored on left of '' when no variable is declared (compiling source file dropitem.cpp)
  597. 8>C:\Program Files (x86)\Microsoft SDKs\Windows\v7.1A\include\dbghelp.h(3056): warning C4091: 'typedef ': ignored on left of '' when no variable is declared (compiling source file dropitem.cpp)
  598. 8>  eqpitem.cpp
  599. 8>D:\Apps\Microsoft Visual Studio 2015\VC\include\CodeAnalysis/sourceannotations.h(68): warning C4467: usage of ATL attributes is deprecated (compiling source file eqpitem.cpp)
  600. 8>  Unknown compiler version - please run the configure tests and report the results
  601. 8>C:\Program Files (x86)\Microsoft SDKs\Windows\v7.1A\include\dbghelp.h(1540): warning C4091: 'typedef ': ignored on left of '' when no variable is declared (compiling source file eqpitem.cpp)
  602. 8>C:\Program Files (x86)\Microsoft SDKs\Windows\v7.1A\include\dbghelp.h(3056): warning C4091: 'typedef ': ignored on left of '' when no variable is declared (compiling source file eqpitem.cpp)
  603. 8>  equipdsc.cpp
  604. 8>  exscrobj.cpp
  605. 8>D:\Apps\Microsoft Visual Studio 2015\VC\include\CodeAnalysis/sourceannotations.h(68): warning C4467: usage of ATL attributes is deprecated (compiling source file exscrobj.cpp)
  606. 8>D:\Apps\Microsoft Visual Studio 2015\VC\include\CodeAnalysis/sourceannotations.h(68): warning C4467: usage of ATL attributes is deprecated (compiling source file equipdsc.cpp)
  607. 8>  Unknown compiler version - please run the configure tests and report the results
  608. 8>  Unknown compiler version - please run the configure tests and report the results
  609. 8>C:\Program Files (x86)\Microsoft SDKs\Windows\v7.1A\include\dbghelp.h(1540): warning C4091: 'typedef ': ignored on left of '' when no variable is declared (compiling source file exscrobj.cpp)
  610. 8>C:\Program Files (x86)\Microsoft SDKs\Windows\v7.1A\include\dbghelp.h(3056): warning C4091: 'typedef ': ignored on left of '' when no variable is declared (compiling source file exscrobj.cpp)
  611. 8>  extobj.cpp
  612. 8>D:\Apps\Microsoft Visual Studio 2015\VC\include\CodeAnalysis/sourceannotations.h(68): warning C4467: usage of ATL attributes is deprecated (compiling source file extobj.cpp)
  613. 8>  Unknown compiler version - please run the configure tests and report the results
  614. 8>  fnsearch.cpp
  615. 8>  gameclck.cpp
  616. 8>D:\Apps\Microsoft Visual Studio 2015\VC\include\CodeAnalysis/sourceannotations.h(68): warning C4467: usage of ATL attributes is deprecated (compiling source file gameclck.cpp)
  617. 8>D:\Apps\Microsoft Visual Studio 2015\VC\include\CodeAnalysis/sourceannotations.h(68): warning C4467: usage of ATL attributes is deprecated (compiling source file fnsearch.cpp)
  618. 8>C:\Program Files (x86)\Microsoft SDKs\Windows\v7.1A\include\dbghelp.h(1540): warning C4091: 'typedef ': ignored on left of '' when no variable is declared (compiling source file fnsearch.cpp)
  619. 8>C:\Program Files (x86)\Microsoft SDKs\Windows\v7.1A\include\dbghelp.h(3056): warning C4091: 'typedef ': ignored on left of '' when no variable is declared (compiling source file fnsearch.cpp)
  620. 8>  Unknown compiler version - please run the configure tests and report the results
  621. 8>  Unknown compiler version - please run the configure tests and report the results
  622. 8>  getitem.cpp
  623. 8>  getmsg.cpp
  624. 8>C:\Program Files (x86)\Microsoft SDKs\Windows\v7.1A\include\dbghelp.h(1540): warning C4091: 'typedef ': ignored on left of '' when no variable is declared (compiling source file gameclck.cpp)
  625. 8>C:\Program Files (x86)\Microsoft SDKs\Windows\v7.1A\include\dbghelp.h(3056): warning C4091: 'typedef ': ignored on left of '' when no variable is declared (compiling source file gameclck.cpp)
  626. 8>D:\Apps\Microsoft Visual Studio 2015\VC\include\CodeAnalysis/sourceannotations.h(68): warning C4467: usage of ATL attributes is deprecated (compiling source file getmsg.cpp)
  627. 8>  Unknown compiler version - please run the configure tests and report the results
  628. 8>D:\Apps\Microsoft Visual Studio 2015\VC\include\CodeAnalysis/sourceannotations.h(68): warning C4467: usage of ATL attributes is deprecated (compiling source file getitem.cpp)
  629. 8>  Unknown compiler version - please run the configure tests and report the results
  630. 8>  memoryusage.cpp
  631. 8>  multidefs.cpp
  632. 8>  Unknown compiler version - please run the configure tests and report the results
  633. 8>C:\Program Files (x86)\Microsoft SDKs\Windows\v7.1A\include\dbghelp.h(1540): warning C4091: 'typedef ': ignored on left of '' when no variable is declared (compiling source file getmsg.cpp)
  634. 8>C:\Program Files (x86)\Microsoft SDKs\Windows\v7.1A\include\dbghelp.h(3056): warning C4091: 'typedef ': ignored on left of '' when no variable is declared (compiling source file getmsg.cpp)
  635. 8>C:\Program Files (x86)\Microsoft SDKs\Windows\v7.1A\include\dbghelp.h(1540): warning C4091: 'typedef ': ignored on left of '' when no variable is declared (compiling source file getitem.cpp)
  636. 8>C:\Program Files (x86)\Microsoft SDKs\Windows\v7.1A\include\dbghelp.h(3056): warning C4091: 'typedef ': ignored on left of '' when no variable is declared (compiling source file getitem.cpp)
  637. 8>  Unknown compiler version - please run the configure tests and report the results
  638. 8>D:\Apps\Microsoft Visual Studio 2015\VC\include\CodeAnalysis/sourceannotations.h(68): warning C4467: usage of ATL attributes is deprecated (compiling source file globals\memoryusage.cpp)
  639. 8>  network.cpp
  640. 8>C:\Program Files (x86)\Microsoft SDKs\Windows\v7.1A\include\dbghelp.h(1540): warning C4091: 'typedef ': ignored on left of '' when no variable is declared (compiling source file globals\memoryusage.cpp)
  641. 8>C:\Program Files (x86)\Microsoft SDKs\Windows\v7.1A\include\dbghelp.h(3056): warning C4091: 'typedef ': ignored on left of '' when no variable is declared (compiling source file globals\memoryusage.cpp)
  642. 8>C:\Program Files (x86)\Microsoft SDKs\Windows\v7.1A\include\dbghelp.h(1540): warning C4091: 'typedef ': ignored on left of '' when no variable is declared (compiling source file globals\network.cpp)
  643. 8>C:\Program Files (x86)\Microsoft SDKs\Windows\v7.1A\include\dbghelp.h(3056): warning C4091: 'typedef ': ignored on left of '' when no variable is declared (compiling source file globals\network.cpp)
  644. 8>  Unknown compiler version - please run the configure tests and report the results
  645. 8>D:\Apps\Microsoft Visual Studio 2015\VC\include\CodeAnalysis/sourceannotations.h(68): warning C4467: usage of ATL attributes is deprecated (compiling source file globals\network.cpp)
  646. 8>  object_storage.cpp
  647. 8>D:\Apps\Microsoft Visual Studio 2015\VC\include\CodeAnalysis/sourceannotations.h(68): warning C4467: usage of ATL attributes is deprecated (compiling source file globals\object_storage.cpp)
  648. 8>  script_internals.cpp
  649. 8>  Unknown compiler version - please run the configure tests and report the results
  650. 8>D:\Apps\Microsoft Visual Studio 2015\VC\include\CodeAnalysis/sourceannotations.h(68): warning C4467: usage of ATL attributes is deprecated (compiling source file globals\script_internals.cpp)
  651. 8>C:\Program Files (x86)\Microsoft SDKs\Windows\v7.1A\include\dbghelp.h(1540): warning C4091: 'typedef ': ignored on left of '' when no variable is declared (compiling source file globals\script_internals.cpp)
  652. 8>C:\Program Files (x86)\Microsoft SDKs\Windows\v7.1A\include\dbghelp.h(3056): warning C4091: 'typedef ': ignored on left of '' when no variable is declared (compiling source file globals\script_internals.cpp)
  653. 8>  Unknown compiler version - please run the configure tests and report the results
  654. 8>  settings.cpp
  655. 8>  Unknown compiler version - please run the configure tests and report the results
  656. 8>D:\Apps\Microsoft Visual Studio 2015\VC\include\CodeAnalysis/sourceannotations.h(68): warning C4467: usage of ATL attributes is deprecated (compiling source file globals\settings.cpp)
  657. 8>  state.cpp
  658. 8>  ucfg.cpp
  659. 8>  Unknown compiler version - please run the configure tests and report the results
  660. 8>  uvars.cpp
  661. 8>D:\Apps\Microsoft Visual Studio 2015\VC\include\CodeAnalysis/sourceannotations.h(68): warning C4467: usage of ATL attributes is deprecated (compiling source file globals\ucfg.cpp)
  662. 8>D:\Apps\Microsoft Visual Studio 2015\VC\include\CodeAnalysis/sourceannotations.h(68): warning C4467: usage of ATL attributes is deprecated (compiling source file globals\uvars.cpp)
  663. 8>  Unknown compiler version - please run the configure tests and report the results
  664. 8>  guardrgn.cpp
  665. 8>D:\Apps\Microsoft Visual Studio 2015\VC\include\CodeAnalysis/sourceannotations.h(68): warning C4467: usage of ATL attributes is deprecated (compiling source file guardrgn.cpp)
  666. 8>  Unknown compiler version - please run the configure tests and report the results
  667. 8>  Unknown compiler version - please run the configure tests and report the results
  668. 8>  guilds.cpp
  669. 8>D:\Apps\Microsoft Visual Studio 2015\VC\include\CodeAnalysis/sourceannotations.h(68): warning C4467: usage of ATL attributes is deprecated (compiling source file guilds.cpp)
  670. 8>  Unknown compiler version - please run the configure tests and report the results
  671. 8>C:\Program Files (x86)\Microsoft SDKs\Windows\v7.1A\include\dbghelp.h(1540): warning C4091: 'typedef ': ignored on left of '' when no variable is declared (compiling source file globals\uvars.cpp)
  672. 8>C:\Program Files (x86)\Microsoft SDKs\Windows\v7.1A\include\dbghelp.h(3056): warning C4091: 'typedef ': ignored on left of '' when no variable is declared (compiling source file globals\uvars.cpp)
  673. 8>  help.cpp
  674. 8>  Unknown compiler version - please run the configure tests and report the results
  675. 8>D:\Apps\Microsoft Visual Studio 2015\VC\include\CodeAnalysis/sourceannotations.h(68): warning C4467: usage of ATL attributes is deprecated (compiling source file help.cpp)
  676. 8>C:\Program Files (x86)\Microsoft SDKs\Windows\v7.1A\include\dbghelp.h(1540): warning C4091: 'typedef ': ignored on left of '' when no variable is declared (compiling source file guardrgn.cpp)
  677. 8>C:\Program Files (x86)\Microsoft SDKs\Windows\v7.1A\include\dbghelp.h(3056): warning C4091: 'typedef ': ignored on left of '' when no variable is declared (compiling source file guardrgn.cpp)
  678. 8>C:\Program Files (x86)\Microsoft SDKs\Windows\v7.1A\include\dbghelp.h(1540): warning C4091: 'typedef ': ignored on left of '' when no variable is declared (compiling source file guilds.cpp)
  679. 8>C:\Program Files (x86)\Microsoft SDKs\Windows\v7.1A\include\dbghelp.h(3056): warning C4091: 'typedef ': ignored on left of '' when no variable is declared (compiling source file guilds.cpp)
  680. 8>C:\Program Files (x86)\Microsoft SDKs\Windows\v7.1A\include\dbghelp.h(1540): warning C4091: 'typedef ': ignored on left of '' when no variable is declared (compiling source file help.cpp)
  681. 8>C:\Program Files (x86)\Microsoft SDKs\Windows\v7.1A\include\dbghelp.h(3056): warning C4091: 'typedef ': ignored on left of '' when no variable is declared (compiling source file help.cpp)
  682. 8>  irequest.cpp
  683. 8>  landtile.cpp
  684. 8>  Unknown compiler version - please run the configure tests and report the results
  685. 8>D:\Apps\Microsoft Visual Studio 2015\VC\include\CodeAnalysis/sourceannotations.h(68): warning C4467: usage of ATL attributes is deprecated (compiling source file landtile.cpp)
  686. 8>  Unknown compiler version - please run the configure tests and report the results
  687. 8>  listenpt.cpp
  688. 8>D:\Apps\Microsoft Visual Studio 2015\VC\include\CodeAnalysis/sourceannotations.h(68): warning C4467: usage of ATL attributes is deprecated (compiling source file listenpt.cpp)
  689. 8>D:\Apps\Microsoft Visual Studio 2015\VC\include\CodeAnalysis/sourceannotations.h(68): warning C4467: usage of ATL attributes is deprecated (compiling source file irequest.cpp)
  690. 8>  Unknown compiler version - please run the configure tests and report the results
  691. 8>C:\Program Files (x86)\Microsoft SDKs\Windows\v7.1A\include\dbghelp.h(1540): warning C4091: 'typedef ': ignored on left of '' when no variable is declared (compiling source file landtile.cpp)
  692. 8>C:\Program Files (x86)\Microsoft SDKs\Windows\v7.1A\include\dbghelp.h(3056): warning C4091: 'typedef ': ignored on left of '' when no variable is declared (compiling source file landtile.cpp)
  693. 8>  loaddata.cpp
  694. 8>D:\Apps\Microsoft Visual Studio 2015\VC\include\CodeAnalysis/sourceannotations.h(68): warning C4467: usage of ATL attributes is deprecated (compiling source file loaddata.cpp)
  695. 8>C:\Program Files (x86)\Microsoft SDKs\Windows\v7.1A\include\dbghelp.h(1540): warning C4091: 'typedef ': ignored on left of '' when no variable is declared (compiling source file irequest.cpp)
  696. 8>C:\Program Files (x86)\Microsoft SDKs\Windows\v7.1A\include\dbghelp.h(3056): warning C4091: 'typedef ': ignored on left of '' when no variable is declared (compiling source file irequest.cpp)
  697. 8>  Unknown compiler version - please run the configure tests and report the results
  698. 8>C:\Program Files (x86)\Microsoft SDKs\Windows\v7.1A\include\dbghelp.h(1540): warning C4091: 'typedef ': ignored on left of '' when no variable is declared (compiling source file listenpt.cpp)
  699. 8>C:\Program Files (x86)\Microsoft SDKs\Windows\v7.1A\include\dbghelp.h(3056): warning C4091: 'typedef ': ignored on left of '' when no variable is declared (compiling source file listenpt.cpp)
  700. 8>  loadunld.cpp
  701. 8>  Unknown compiler version - please run the configure tests and report the results
  702. 8>  lockable.cpp
  703. 8>D:\Apps\Microsoft Visual Studio 2015\VC\include\CodeAnalysis/sourceannotations.h(68): warning C4467: usage of ATL attributes is deprecated (compiling source file lockable.cpp)
  704. 8>D:\Apps\Microsoft Visual Studio 2015\VC\include\CodeAnalysis/sourceannotations.h(68): warning C4467: usage of ATL attributes is deprecated (compiling source file loadunld.cpp)
  705. 8>  Unknown compiler version - please run the configure tests and report the results
  706. 8>C:\Program Files (x86)\Microsoft SDKs\Windows\v7.1A\include\dbghelp.h(1540): warning C4091: 'typedef ': ignored on left of '' when no variable is declared (compiling source file loadunld.cpp)
  707. 8>C:\Program Files (x86)\Microsoft SDKs\Windows\v7.1A\include\dbghelp.h(3056): warning C4091: 'typedef ': ignored on left of '' when no variable is declared (compiling source file loadunld.cpp)
  708. 8>  login.cpp
  709. 8>D:\Apps\Microsoft Visual Studio 2015\VC\include\CodeAnalysis/sourceannotations.h(68): warning C4467: usage of ATL attributes is deprecated (compiling source file login.cpp)
  710. 8>  menu.cpp
  711. 8>D:\Apps\Microsoft Visual Studio 2015\VC\include\CodeAnalysis/sourceannotations.h(68): warning C4467: usage of ATL attributes is deprecated (compiling source file menu.cpp)
  712. 8>  Unknown compiler version - please run the configure tests and report the results
  713. 8>  Unknown compiler version - please run the configure tests and report the results
  714. 8>C:\Program Files (x86)\Microsoft SDKs\Windows\v7.1A\include\dbghelp.h(1540): warning C4091: 'typedef ': ignored on left of '' when no variable is declared (compiling source file login.cpp)
  715. 8>C:\Program Files (x86)\Microsoft SDKs\Windows\v7.1A\include\dbghelp.h(3056): warning C4091: 'typedef ': ignored on left of '' when no variable is declared (compiling source file login.cpp)
  716. 8>  menusel.cpp
  717. 8>D:\Apps\Microsoft Visual Studio 2015\VC\include\CodeAnalysis/sourceannotations.h(68): warning C4467: usage of ATL attributes is deprecated (compiling source file menusel.cpp)
  718. 8>C:\Program Files (x86)\Microsoft SDKs\Windows\v7.1A\include\dbghelp.h(1540): warning C4091: 'typedef ': ignored on left of '' when no variable is declared (compiling source file menu.cpp)
  719. 8>C:\Program Files (x86)\Microsoft SDKs\Windows\v7.1A\include\dbghelp.h(3056): warning C4091: 'typedef ': ignored on left of '' when no variable is declared (compiling source file menu.cpp)
  720. 8>  Unknown compiler version - please run the configure tests and report the results
  721. 8>  miscmsg.cpp
  722. 8>  Unknown compiler version - please run the configure tests and report the results
  723. 8>login.cpp(80): warning C4996: 'stricmp': The POSIX name for this item is deprecated. Instead, use the ISO C and C++ conformant name: _stricmp. See online help for details.
  724. 8>  C:\Program Files (x86)\Windows Kits\10\Include\10.0.10240.0\ucrt\string.h(568): note: see declaration of 'stricmp'
  725. 8>D:\Apps\Microsoft Visual Studio 2015\VC\include\CodeAnalysis/sourceannotations.h(68): warning C4467: usage of ATL attributes is deprecated (compiling source file miscmsg.cpp)
  726. 8>C:\Program Files (x86)\Microsoft SDKs\Windows\v7.1A\include\dbghelp.h(1540): warning C4091: 'typedef ': ignored on left of '' when no variable is declared (compiling source file menusel.cpp)
  727. 8>C:\Program Files (x86)\Microsoft SDKs\Windows\v7.1A\include\dbghelp.h(3056): warning C4091: 'typedef ': ignored on left of '' when no variable is declared (compiling source file menusel.cpp)
  728. 8>C:\Program Files (x86)\Microsoft SDKs\Windows\v7.1A\include\dbghelp.h(1540): warning C4091: 'typedef ': ignored on left of '' when no variable is declared (compiling source file miscmsg.cpp)
  729. 8>C:\Program Files (x86)\Microsoft SDKs\Windows\v7.1A\include\dbghelp.h(3056): warning C4091: 'typedef ': ignored on left of '' when no variable is declared (compiling source file miscmsg.cpp)
  730. 8>  miscrgn.cpp
  731. 8>  mkscrobj.cpp
  732. 8>D:\Apps\Microsoft Visual Studio 2015\VC\include\CodeAnalysis/sourceannotations.h(68): warning C4467: usage of ATL attributes is deprecated (compiling source file miscrgn.cpp)
  733. 8>  Unknown compiler version - please run the configure tests and report the results
  734. 8>  ufacing.cpp
  735. 8>D:\Apps\Microsoft Visual Studio 2015\VC\include\CodeAnalysis/sourceannotations.h(68): warning C4467: usage of ATL attributes is deprecated (compiling source file mkscrobj.cpp)
  736. 8>D:\Apps\Microsoft Visual Studio 2015\VC\include\CodeAnalysis/sourceannotations.h(68): warning C4467: usage of ATL attributes is deprecated (compiling source file mobile\ufacing.cpp)
  737. 8>  Unknown compiler version - please run the configure tests and report the results
  738. 8>C:\Program Files (x86)\Microsoft SDKs\Windows\v7.1A\include\dbghelp.h(1540): warning C4091: 'typedef ': ignored on left of '' when no variable is declared (compiling source file mkscrobj.cpp)
  739. 8>C:\Program Files (x86)\Microsoft SDKs\Windows\v7.1A\include\dbghelp.h(3056): warning C4091: 'typedef ': ignored on left of '' when no variable is declared (compiling source file mkscrobj.cpp)
  740. 8>  Unknown compiler version - please run the configure tests and report the results
  741. 8>C:\Program Files (x86)\Microsoft SDKs\Windows\v7.1A\include\dbghelp.h(1540): warning C4091: 'typedef ': ignored on left of '' when no variable is declared (compiling source file miscrgn.cpp)
  742. 8>C:\Program Files (x86)\Microsoft SDKs\Windows\v7.1A\include\dbghelp.h(3056): warning C4091: 'typedef ': ignored on left of '' when no variable is declared (compiling source file miscrgn.cpp)
  743. 8>  movecost.cpp
  744. 8>D:\Apps\Microsoft Visual Studio 2015\VC\include\CodeAnalysis/sourceannotations.h(68): warning C4467: usage of ATL attributes is deprecated (compiling source file movecost.cpp)
  745. 8>  movement.cpp
  746. 8>D:\Apps\Microsoft Visual Studio 2015\VC\include\CodeAnalysis/sourceannotations.h(68): warning C4467: usage of ATL attributes is deprecated (compiling source file movement.cpp)
  747. 8>  Unknown compiler version - please run the configure tests and report the results
  748. 8>  msgfiltr.cpp
  749. 8>  Unknown compiler version - please run the configure tests and report the results
  750. 8>C:\Program Files (x86)\Microsoft SDKs\Windows\v7.1A\include\dbghelp.h(1540): warning C4091: 'typedef ': ignored on left of '' when no variable is declared (compiling source file network\msgfiltr.cpp)
  751. 8>C:\Program Files (x86)\Microsoft SDKs\Windows\v7.1A\include\dbghelp.h(3056): warning C4091: 'typedef ': ignored on left of '' when no variable is declared (compiling source file network\msgfiltr.cpp)
  752. 8>  Unknown compiler version - please run the configure tests and report the results
  753. 8>  msghandl.cpp
  754. 8>D:\Apps\Microsoft Visual Studio 2015\VC\include\CodeAnalysis/sourceannotations.h(68): warning C4467: usage of ATL attributes is deprecated (compiling source file network\msghandl.cpp)
  755. 8>C:\Program Files (x86)\Microsoft SDKs\Windows\v7.1A\include\dbghelp.h(1540): warning C4091: 'typedef ': ignored on left of '' when no variable is declared (compiling source file movecost.cpp)
  756. 8>C:\Program Files (x86)\Microsoft SDKs\Windows\v7.1A\include\dbghelp.h(3056): warning C4091: 'typedef ': ignored on left of '' when no variable is declared (compiling source file movecost.cpp)
  757. 8>  musicrgn.cpp
  758. 8>D:\Apps\Microsoft Visual Studio 2015\VC\include\CodeAnalysis/sourceannotations.h(68): warning C4467: usage of ATL attributes is deprecated (compiling source file musicrgn.cpp)
  759. 8>  Unknown compiler version - please run the configure tests and report the results
  760. 8>C:\Program Files (x86)\Microsoft SDKs\Windows\v7.1A\include\dbghelp.h(1540): warning C4091: 'typedef ': ignored on left of '' when no variable is declared (compiling source file movement.cpp)
  761. 8>C:\Program Files (x86)\Microsoft SDKs\Windows\v7.1A\include\dbghelp.h(3056): warning C4091: 'typedef ': ignored on left of '' when no variable is declared (compiling source file movement.cpp)
  762. 8>  Unknown compiler version - please run the configure tests and report the results
  763. 8>C:\Program Files (x86)\Microsoft SDKs\Windows\v7.1A\include\dbghelp.h(1540): warning C4091: 'typedef ': ignored on left of '' when no variable is declared (compiling source file network\msghandl.cpp)
  764. 8>C:\Program Files (x86)\Microsoft SDKs\Windows\v7.1A\include\dbghelp.h(3056): warning C4091: 'typedef ': ignored on left of '' when no variable is declared (compiling source file network\msghandl.cpp)
  765. 8>C:\Program Files (x86)\Microsoft SDKs\Windows\v7.1A\include\dbghelp.h(1540): warning C4091: 'typedef ': ignored on left of '' when no variable is declared (compiling source file musicrgn.cpp)
  766. 8>C:\Program Files (x86)\Microsoft SDKs\Windows\v7.1A\include\dbghelp.h(3056): warning C4091: 'typedef ': ignored on left of '' when no variable is declared (compiling source file musicrgn.cpp)
  767. 8>  clienttransmit.cpp
  768. 8>  Unknown compiler version - please run the configure tests and report the results
  769. 8>D:\Apps\Microsoft Visual Studio 2015\VC\include\CodeAnalysis/sourceannotations.h(68): warning C4467: usage of ATL attributes is deprecated (compiling source file network\clienttransmit.cpp)
  770. 8>  packetdefs.cpp
  771. 8>C:\Program Files (x86)\Microsoft SDKs\Windows\v7.1A\include\dbghelp.h(1540): warning C4091: 'typedef ': ignored on left of '' when no variable is declared (compiling source file network\clienttransmit.cpp)
  772. 8>C:\Program Files (x86)\Microsoft SDKs\Windows\v7.1A\include\dbghelp.h(3056): warning C4091: 'typedef ': ignored on left of '' when no variable is declared (compiling source file network\clienttransmit.cpp)
  773. 8>  npc.cpp
  774. 8>D:\Apps\Microsoft Visual Studio 2015\VC\include\CodeAnalysis/sourceannotations.h(68): warning C4467: usage of ATL attributes is deprecated (compiling source file mobile\npc.cpp)
  775. 8>  npctemplates.cpp
  776. 8>  Unknown compiler version - please run the configure tests and report the results
  777. 8>D:\Apps\Microsoft Visual Studio 2015\VC\include\CodeAnalysis/sourceannotations.h(68): warning C4467: usage of ATL attributes is deprecated (compiling source file network\packetdefs.cpp)
  778. 8>D:\Apps\Microsoft Visual Studio 2015\VC\include\CodeAnalysis/sourceannotations.h(68): warning C4467: usage of ATL attributes is deprecated (compiling source file npctemplates.cpp)
  779. 8>  Unknown compiler version - please run the configure tests and report the results
  780. 8>C:\Program Files (x86)\Microsoft SDKs\Windows\v7.1A\include\dbghelp.h(1540): warning C4091: 'typedef ': ignored on left of '' when no variable is declared (compiling source file network\packetdefs.cpp)
  781. 8>C:\Program Files (x86)\Microsoft SDKs\Windows\v7.1A\include\dbghelp.h(3056): warning C4091: 'typedef ': ignored on left of '' when no variable is declared (compiling source file network\packetdefs.cpp)
  782. 8>  npctmpl.cpp
  783. 8>D:\Apps\Microsoft Visual Studio 2015\VC\include\CodeAnalysis/sourceannotations.h(68): warning C4467: usage of ATL attributes is deprecated (compiling source file npctmpl.cpp)
  784. 8>  Unknown compiler version - please run the configure tests and report the results
  785. 8>C:\Program Files (x86)\Microsoft SDKs\Windows\v7.1A\include\dbghelp.h(1540): warning C4091: 'typedef ': ignored on left of '' when no variable is declared (compiling source file npctemplates.cpp)
  786. 8>C:\Program Files (x86)\Microsoft SDKs\Windows\v7.1A\include\dbghelp.h(3056): warning C4091: 'typedef ': ignored on left of '' when no variable is declared (compiling source file npctemplates.cpp)
  787. 8>  Unknown compiler version - please run the configure tests and report the results
  788. 8>C:\Program Files (x86)\Microsoft SDKs\Windows\v7.1A\include\dbghelp.h(1540): warning C4091: 'typedef ': ignored on left of '' when no variable is declared (compiling source file mobile\npc.cpp)
  789. 8>C:\Program Files (x86)\Microsoft SDKs\Windows\v7.1A\include\dbghelp.h(3056): warning C4091: 'typedef ': ignored on left of '' when no variable is declared (compiling source file mobile\npc.cpp)
  790. 8>C:\Program Files (x86)\Microsoft SDKs\Windows\v7.1A\include\dbghelp.h(1540): warning C4091: 'typedef ': ignored on left of '' when no variable is declared (compiling source file npctmpl.cpp)
  791. 8>C:\Program Files (x86)\Microsoft SDKs\Windows\v7.1A\include\dbghelp.h(3056): warning C4091: 'typedef ': ignored on left of '' when no variable is declared (compiling source file npctmpl.cpp)
  792. 8>  objecthash.cpp
  793. 8>D:\Apps\Microsoft Visual Studio 2015\VC\include\CodeAnalysis/sourceannotations.h(68): warning C4467: usage of ATL attributes is deprecated (compiling source file objecthash.cpp)
  794. 8>  packetscrobj.cpp
  795. 8>  Unknown compiler version - please run the configure tests and report the results
  796. 8>D:\Apps\Microsoft Visual Studio 2015\VC\include\CodeAnalysis/sourceannotations.h(68): warning C4467: usage of ATL attributes is deprecated (compiling source file packetscrobj.cpp)
  797. 8>  Unknown compiler version - please run the configure tests and report the results
  798. 8>  party.cpp
  799. 8>D:\Apps\Microsoft Visual Studio 2015\VC\include\CodeAnalysis/sourceannotations.h(68): warning C4467: usage of ATL attributes is deprecated (compiling source file party.cpp)
  800. 8>  pol.cpp
  801. 8>C:\Program Files (x86)\Microsoft SDKs\Windows\v7.1A\include\dbghelp.h(1540): warning C4091: 'typedef ': ignored on left of '' when no variable is declared (compiling source file party.cpp)
  802. 8>C:\Program Files (x86)\Microsoft SDKs\Windows\v7.1A\include\dbghelp.h(3056): warning C4091: 'typedef ': ignored on left of '' when no variable is declared (compiling source file party.cpp)
  803. 8>C:\Program Files (x86)\Microsoft SDKs\Windows\v7.1A\include\dbghelp.h(1540): warning C4091: 'typedef ': ignored on left of '' when no variable is declared (compiling source file packetscrobj.cpp)
  804. 8>C:\Program Files (x86)\Microsoft SDKs\Windows\v7.1A\include\dbghelp.h(3056): warning C4091: 'typedef ': ignored on left of '' when no variable is declared (compiling source file packetscrobj.cpp)
  805. 8>C:\Program Files (x86)\Microsoft SDKs\Windows\v7.1A\include\dbghelp.h(1540): warning C4091: 'typedef ': ignored on left of '' when no variable is declared (compiling source file objecthash.cpp)
  806. 8>C:\Program Files (x86)\Microsoft SDKs\Windows\v7.1A\include\dbghelp.h(3056): warning C4091: 'typedef ': ignored on left of '' when no variable is declared (compiling source file objecthash.cpp)
  807. 8>  Unknown compiler version - please run the configure tests and report the results
  808. 8>  Unknown compiler version - please run the configure tests and report the results
  809. 8>D:\Apps\Microsoft Visual Studio 2015\VC\include\CodeAnalysis/sourceannotations.h(68): warning C4467: usage of ATL attributes is deprecated (compiling source file pol.cpp)
  810. 8>C:\Program Files (x86)\Microsoft SDKs\Windows\v7.1A\include\dbghelp.h(1540): warning C4091: 'typedef ': ignored on left of '' when no variable is declared (compiling source file pol.cpp)
  811. 8>C:\Program Files (x86)\Microsoft SDKs\Windows\v7.1A\include\dbghelp.h(3056): warning C4091: 'typedef ': ignored on left of '' when no variable is declared (compiling source file pol.cpp)
  812. 8>  polcfg.cpp
  813. 8>D:\Apps\Microsoft Visual Studio 2015\VC\include\CodeAnalysis/sourceannotations.h(68): warning C4467: usage of ATL attributes is deprecated (compiling source file polcfg.cpp)
  814. 8>  Unknown compiler version - please run the configure tests and report the results
  815. 8>  polclock.cpp
  816. 8>  Unknown compiler version - please run the configure tests and report the results
  817. 8>C:\Program Files (x86)\Microsoft SDKs\Windows\v7.1A\include\dbghelp.h(1540): warning C4091: 'typedef ': ignored on left of '' when no variable is declared (compiling source file polcfg.cpp)
  818. 8>C:\Program Files (x86)\Microsoft SDKs\Windows\v7.1A\include\dbghelp.h(3056): warning C4091: 'typedef ': ignored on left of '' when no variable is declared (compiling source file polcfg.cpp)
  819. 8>  poldbg.cpp
  820. 8>  Unknown compiler version - please run the configure tests and report the results
  821. 8>  polfile2.cpp
  822. 8>D:\Apps\Microsoft Visual Studio 2015\VC\include\CodeAnalysis/sourceannotations.h(68): warning C4467: usage of ATL attributes is deprecated (compiling source file poldbg.cpp)
  823. 8>C:\Program Files (x86)\Microsoft SDKs\Windows\v7.1A\include\dbghelp.h(1540): warning C4091: 'typedef ': ignored on left of '' when no variable is declared (compiling source file poldbg.cpp)
  824. 8>C:\Program Files (x86)\Microsoft SDKs\Windows\v7.1A\include\dbghelp.h(3056): warning C4091: 'typedef ': ignored on left of '' when no variable is declared (compiling source file poldbg.cpp)
  825. 8>D:\Apps\Microsoft Visual Studio 2015\VC\include\CodeAnalysis/sourceannotations.h(68): warning C4467: usage of ATL attributes is deprecated (compiling source file polfile2.cpp)
  826. 8>  Unknown compiler version - please run the configure tests and report the results
  827. 8>  PolMain.cpp
  828. 8>  polsem.cpp
  829. 8>  polservice.cpp
  830. 8>  polsig.cpp
  831. 8>D:\Apps\Microsoft Visual Studio 2015\VC\include\CodeAnalysis/sourceannotations.h(68): warning C4467: usage of ATL attributes is deprecated (compiling source file polsig.cpp)
  832. 8>C:\Program Files (x86)\Microsoft SDKs\Windows\v7.1A\include\dbghelp.h(1540): warning C4091: 'typedef ': ignored on left of '' when no variable is declared (compiling source file polservice.cpp)
  833. 8>C:\Program Files (x86)\Microsoft SDKs\Windows\v7.1A\include\dbghelp.h(3056): warning C4091: 'typedef ': ignored on left of '' when no variable is declared (compiling source file polservice.cpp)
  834. 8>C:\Program Files (x86)\Microsoft SDKs\Windows\v7.1A\include\dbghelp.h(1540): warning C4091: 'typedef ': ignored on left of '' when no variable is declared (compiling source file polsig.cpp)
  835. 8>C:\Program Files (x86)\Microsoft SDKs\Windows\v7.1A\include\dbghelp.h(3056): warning C4091: 'typedef ': ignored on left of '' when no variable is declared (compiling source file polsig.cpp)
  836. 8>  Unknown compiler version - please run the configure tests and report the results
  837. 8>  Unknown compiler version - please run the configure tests and report the results
  838. 8>D:\Apps\Microsoft Visual Studio 2015\VC\include\CodeAnalysis/sourceannotations.h(68): warning C4467: usage of ATL attributes is deprecated (compiling source file polsem.cpp)
  839. 8>C:\Program Files (x86)\Microsoft SDKs\Windows\v7.1A\include\dbghelp.h(1540): warning C4091: 'typedef ': ignored on left of '' when no variable is declared (compiling source file polsem.cpp)
  840. 8>C:\Program Files (x86)\Microsoft SDKs\Windows\v7.1A\include\dbghelp.h(3056): warning C4091: 'typedef ': ignored on left of '' when no variable is declared (compiling source file polsem.cpp)
  841. 8>  Unknown compiler version - please run the configure tests and report the results
  842. 8>  polstats.cpp
  843. 8>D:\Apps\Microsoft Visual Studio 2015\VC\include\CodeAnalysis/sourceannotations.h(68): warning C4467: usage of ATL attributes is deprecated (compiling source file polservice.cpp)
  844. 8>  poltest.cpp
  845. 8>  testdrop.cpp
  846. 8>  testenv.cpp
  847. 8>  testlos.cpp
  848. 8>  Unknown compiler version - please run the configure tests and report the results
  849. 8>D:\Apps\Microsoft Visual Studio 2015\VC\include\CodeAnalysis/sourceannotations.h(68): warning C4467: usage of ATL attributes is deprecated (compiling source file testing\testdrop.cpp)
  850. 8>D:\Apps\Microsoft Visual Studio 2015\VC\include\CodeAnalysis/sourceannotations.h(68): warning C4467: usage of ATL attributes is deprecated (compiling source file testing\testenv.cpp)
  851. 8>  Unknown compiler version - please run the configure tests and report the results
  852. 8>  Unknown compiler version - please run the configure tests and report the results
  853. 8>D:\Apps\Microsoft Visual Studio 2015\VC\include\CodeAnalysis/sourceannotations.h(68): warning C4467: usage of ATL attributes is deprecated (compiling source file testing\testlos.cpp)
  854. 8>  testmisc.cpp
  855. 8>C:\Program Files (x86)\Microsoft SDKs\Windows\v7.1A\include\dbghelp.h(1540): warning C4091: 'typedef ': ignored on left of '' when no variable is declared (compiling source file testing\testdrop.cpp)
  856. 8>C:\Program Files (x86)\Microsoft SDKs\Windows\v7.1A\include\dbghelp.h(3056): warning C4091: 'typedef ': ignored on left of '' when no variable is declared (compiling source file testing\testdrop.cpp)
  857. 8>C:\Program Files (x86)\Microsoft SDKs\Windows\v7.1A\include\dbghelp.h(1540): warning C4091: 'typedef ': ignored on left of '' when no variable is declared (compiling source file testing\testenv.cpp)
  858. 8>C:\Program Files (x86)\Microsoft SDKs\Windows\v7.1A\include\dbghelp.h(3056): warning C4091: 'typedef ': ignored on left of '' when no variable is declared (compiling source file testing\testenv.cpp)
  859. 8>  Unknown compiler version - please run the configure tests and report the results
  860. 8>D:\Apps\Microsoft Visual Studio 2015\VC\include\CodeAnalysis/sourceannotations.h(68): warning C4467: usage of ATL attributes is deprecated (compiling source file testing\testmisc.cpp)
  861. 8>C:\Program Files (x86)\Microsoft SDKs\Windows\v7.1A\include\dbghelp.h(1540): warning C4091: 'typedef ': ignored on left of '' when no variable is declared (compiling source file testing\testlos.cpp)
  862. 8>C:\Program Files (x86)\Microsoft SDKs\Windows\v7.1A\include\dbghelp.h(3056): warning C4091: 'typedef ': ignored on left of '' when no variable is declared (compiling source file testing\testlos.cpp)
  863. 8>C:\Program Files (x86)\Microsoft SDKs\Windows\v7.1A\include\dbghelp.h(1540): warning C4091: 'typedef ': ignored on left of '' when no variable is declared (compiling source file testing\testmisc.cpp)
  864. 8>C:\Program Files (x86)\Microsoft SDKs\Windows\v7.1A\include\dbghelp.h(3056): warning C4091: 'typedef ': ignored on left of '' when no variable is declared (compiling source file testing\testmisc.cpp)
  865. 8>  testskill.cpp
  866. 8>  Unknown compiler version - please run the configure tests and report the results
  867. 8>D:\Apps\Microsoft Visual Studio 2015\VC\include\CodeAnalysis/sourceannotations.h(68): warning C4467: usage of ATL attributes is deprecated (compiling source file testing\testskill.cpp)
  868. 8>  testwalk.cpp
  869. 8>  polwww.cpp
  870. 8>  proplist.cpp
  871. 8>  Unknown compiler version - please run the configure tests and report the results
  872. 8>D:\Apps\Microsoft Visual Studio 2015\VC\include\CodeAnalysis/sourceannotations.h(68): warning C4467: usage of ATL attributes is deprecated (compiling source file polwww.cpp)
  873. 8>  Unknown compiler version - please run the configure tests and report the results
  874. 8>D:\Apps\Microsoft Visual Studio 2015\VC\include\CodeAnalysis/sourceannotations.h(68): warning C4467: usage of ATL attributes is deprecated (compiling source file testing\testwalk.cpp)
  875. 8>  realms.cpp
  876. 8>  Unknown compiler version - please run the configure tests and report the results
  877. 8>D:\Apps\Microsoft Visual Studio 2015\VC\include\CodeAnalysis/sourceannotations.h(68): warning C4467: usage of ATL attributes is deprecated (compiling source file realms.cpp)
  878. 8>  Unknown compiler version - please run the configure tests and report the results
  879. 8>D:\Apps\Microsoft Visual Studio 2015\VC\include\CodeAnalysis/sourceannotations.h(68): warning C4467: usage of ATL attributes is deprecated (compiling source file proplist.cpp)
  880. 8>C:\Program Files (x86)\Microsoft SDKs\Windows\v7.1A\include\dbghelp.h(1540): warning C4091: 'typedef ': ignored on left of '' when no variable is declared (compiling source file polwww.cpp)
  881. 8>C:\Program Files (x86)\Microsoft SDKs\Windows\v7.1A\include\dbghelp.h(3056): warning C4091: 'typedef ': ignored on left of '' when no variable is declared (compiling source file polwww.cpp)
  882. 8>C:\Program Files (x86)\Microsoft SDKs\Windows\v7.1A\include\dbghelp.h(1540): warning C4091: 'typedef ': ignored on left of '' when no variable is declared (compiling source file proplist.cpp)
  883. 8>C:\Program Files (x86)\Microsoft SDKs\Windows\v7.1A\include\dbghelp.h(3056): warning C4091: 'typedef ': ignored on left of '' when no variable is declared (compiling source file proplist.cpp)
  884. 8>C:\Program Files (x86)\Microsoft SDKs\Windows\v7.1A\include\dbghelp.h(1540): warning C4091: 'typedef ': ignored on left of '' when no variable is declared (compiling source file testing\testwalk.cpp)
  885. 8>C:\Program Files (x86)\Microsoft SDKs\Windows\v7.1A\include\dbghelp.h(3056): warning C4091: 'typedef ': ignored on left of '' when no variable is declared (compiling source file testing\testwalk.cpp)
  886. 8>C:\Program Files (x86)\Microsoft SDKs\Windows\v7.1A\include\dbghelp.h(1540): warning C4091: 'typedef ': ignored on left of '' when no variable is declared (compiling source file realms.cpp)
  887. 8>C:\Program Files (x86)\Microsoft SDKs\Windows\v7.1A\include\dbghelp.h(3056): warning C4091: 'typedef ': ignored on left of '' when no variable is declared (compiling source file realms.cpp)
  888. 8>  realm.cpp
  889. 8>  realmfunc.cpp
  890. 8>  realmlos.cpp
  891. 8>D:\Apps\Microsoft Visual Studio 2015\VC\include\CodeAnalysis/sourceannotations.h(68): warning C4467: usage of ATL attributes is deprecated (compiling source file realms\realm.cpp)
  892. 8>  Unknown compiler version - please run the configure tests and report the results
  893. 8>D:\Apps\Microsoft Visual Studio 2015\VC\include\CodeAnalysis/sourceannotations.h(68): warning C4467: usage of ATL attributes is deprecated (compiling source file realms\realmfunc.cpp)
  894. 8>  reftypes.cpp
  895. 8>D:\Apps\Microsoft Visual Studio 2015\VC\include\CodeAnalysis/sourceannotations.h(68): warning C4467: usage of ATL attributes is deprecated (compiling source file reftypes.cpp)
  896. 8>  Unknown compiler version - please run the configure tests and report the results
  897. 8>  Unknown compiler version - please run the configure tests and report the results
  898. 8>D:\Apps\Microsoft Visual Studio 2015\VC\include\CodeAnalysis/sourceannotations.h(68): warning C4467: usage of ATL attributes is deprecated (compiling source file realms\realmlos.cpp)
  899. 8>  Unknown compiler version - please run the configure tests and report the results
  900. 8>C:\Program Files (x86)\Microsoft SDKs\Windows\v7.1A\include\dbghelp.h(1540): warning C4091: 'typedef ': ignored on left of '' when no variable is declared (compiling source file realms\realmfunc.cpp)
  901. 8>C:\Program Files (x86)\Microsoft SDKs\Windows\v7.1A\include\dbghelp.h(3056): warning C4091: 'typedef ': ignored on left of '' when no variable is declared (compiling source file realms\realmfunc.cpp)
  902. 8>C:\Program Files (x86)\Microsoft SDKs\Windows\v7.1A\include\dbghelp.h(1540): warning C4091: 'typedef ': ignored on left of '' when no variable is declared (compiling source file reftypes.cpp)
  903. 8>C:\Program Files (x86)\Microsoft SDKs\Windows\v7.1A\include\dbghelp.h(3056): warning C4091: 'typedef ': ignored on left of '' when no variable is declared (compiling source file reftypes.cpp)
  904. 8>  region.cpp
  905. 8>  repsys.cpp
  906. 8>D:\Apps\Microsoft Visual Studio 2015\VC\include\CodeAnalysis/sourceannotations.h(68): warning C4467: usage of ATL attributes is deprecated (compiling source file region.cpp)
  907. 8>  Unknown compiler version - please run the configure tests and report the results
  908. 8>  resource.cpp
  909. 8>  Unknown compiler version - please run the configure tests and report the results
  910. 8>D:\Apps\Microsoft Visual Studio 2015\VC\include\CodeAnalysis/sourceannotations.h(68): warning C4467: usage of ATL attributes is deprecated (compiling source file repsys.cpp)
  911. 8>  savedata.cpp
  912. 8>  Unknown compiler version - please run the configure tests and report the results
  913. 8>  Unknown compiler version - please run the configure tests and report the results
  914. 8>C:\Program Files (x86)\Microsoft SDKs\Windows\v7.1A\include\dbghelp.h(1540): warning C4091: 'typedef ': ignored on left of '' when no variable is declared (compiling source file repsys.cpp)
  915. 8>C:\Program Files (x86)\Microsoft SDKs\Windows\v7.1A\include\dbghelp.h(3056): warning C4091: 'typedef ': ignored on left of '' when no variable is declared (compiling source file repsys.cpp)
  916. 8>D:\Apps\Microsoft Visual Studio 2015\VC\include\CodeAnalysis/sourceannotations.h(68): warning C4467: usage of ATL attributes is deprecated (compiling source file savedata.cpp)
  917. 8>D:\Apps\Microsoft Visual Studio 2015\VC\include\CodeAnalysis/sourceannotations.h(68): warning C4467: usage of ATL attributes is deprecated (compiling source file resource.cpp)
  918. 8>C:\Program Files (x86)\Microsoft SDKs\Windows\v7.1A\include\dbghelp.h(1540): warning C4091: 'typedef ': ignored on left of '' when no variable is declared (compiling source file region.cpp)
  919. 8>C:\Program Files (x86)\Microsoft SDKs\Windows\v7.1A\include\dbghelp.h(3056): warning C4091: 'typedef ': ignored on left of '' when no variable is declared (compiling source file region.cpp)
  920. 8>C:\Program Files (x86)\Microsoft SDKs\Windows\v7.1A\include\dbghelp.h(1540): warning C4091: 'typedef ': ignored on left of '' when no variable is declared (compiling source file resource.cpp)
  921. 8>C:\Program Files (x86)\Microsoft SDKs\Windows\v7.1A\include\dbghelp.h(3056): warning C4091: 'typedef ': ignored on left of '' when no variable is declared (compiling source file resource.cpp)
  922. 8>C:\Program Files (x86)\Microsoft SDKs\Windows\v7.1A\include\dbghelp.h(1540): warning C4091: 'typedef ': ignored on left of '' when no variable is declared (compiling source file savedata.cpp)
  923. 8>C:\Program Files (x86)\Microsoft SDKs\Windows\v7.1A\include\dbghelp.h(3056): warning C4091: 'typedef ': ignored on left of '' when no variable is declared (compiling source file savedata.cpp)
  924. 8>  schedule.cpp
  925. 8>D:\Apps\Microsoft Visual Studio 2015\VC\include\CodeAnalysis/sourceannotations.h(68): warning C4467: usage of ATL attributes is deprecated (compiling source file schedule.cpp)
  926. 8>  Unknown compiler version - please run the configure tests and report the results
  927. 8>  scrdef.cpp
  928. 8>  Unknown compiler version - please run the configure tests and report the results
  929. 8>  scrsched.cpp
  930. 8>  scrstore.cpp
  931. 8>D:\Apps\Microsoft Visual Studio 2015\VC\include\CodeAnalysis/sourceannotations.h(68): warning C4467: usage of ATL attributes is deprecated (compiling source file scrstore.cpp)
  932. 8>D:\Apps\Microsoft Visual Studio 2015\VC\include\CodeAnalysis/sourceannotations.h(68): warning C4467: usage of ATL attributes is deprecated (compiling source file scrsched.cpp)
  933. 8>C:\Program Files (x86)\Microsoft SDKs\Windows\v7.1A\include\dbghelp.h(1540): warning C4091: 'typedef ': ignored on left of '' when no variable is declared (compiling source file schedule.cpp)
  934. 8>C:\Program Files (x86)\Microsoft SDKs\Windows\v7.1A\include\dbghelp.h(3056): warning C4091: 'typedef ': ignored on left of '' when no variable is declared (compiling source file schedule.cpp)
  935. 8>  Unknown compiler version - please run the configure tests and report the results
  936. 8>C:\Program Files (x86)\Microsoft SDKs\Windows\v7.1A\include\dbghelp.h(1540): warning C4091: 'typedef ': ignored on left of '' when no variable is declared (compiling source file scrstore.cpp)
  937. 8>C:\Program Files (x86)\Microsoft SDKs\Windows\v7.1A\include\dbghelp.h(3056): warning C4091: 'typedef ': ignored on left of '' when no variable is declared (compiling source file scrstore.cpp)
  938. 8>  Unknown compiler version - please run the configure tests and report the results
  939. 8>D:\Apps\Microsoft Visual Studio 2015\VC\include\CodeAnalysis/sourceannotations.h(68): warning C4467: usage of ATL attributes is deprecated (compiling source file scrdef.cpp)
  940. 8>C:\Program Files (x86)\Microsoft SDKs\Windows\v7.1A\include\dbghelp.h(1540): warning C4091: 'typedef ': ignored on left of '' when no variable is declared (compiling source file scrdef.cpp)
  941. 8>C:\Program Files (x86)\Microsoft SDKs\Windows\v7.1A\include\dbghelp.h(3056): warning C4091: 'typedef ': ignored on left of '' when no variable is declared (compiling source file scrdef.cpp)
  942. 8>C:\Program Files (x86)\Microsoft SDKs\Windows\v7.1A\include\dbghelp.h(1540): warning C4091: 'typedef ': ignored on left of '' when no variable is declared (compiling source file scrsched.cpp)
  943. 8>C:\Program Files (x86)\Microsoft SDKs\Windows\v7.1A\include\dbghelp.h(3056): warning C4091: 'typedef ': ignored on left of '' when no variable is declared (compiling source file scrsched.cpp)
  944. 8>  skilladv.cpp
  945. 8>  sngclick.cpp
  946. 8>D:\Apps\Microsoft Visual Studio 2015\VC\include\CodeAnalysis/sourceannotations.h(68): warning C4467: usage of ATL attributes is deprecated (compiling source file sngclick.cpp)
  947. 8>  sockio.cpp
  948. 8>C:\Program Files (x86)\Microsoft SDKs\Windows\v7.1A\include\dbghelp.h(1540): warning C4091: 'typedef ': ignored on left of '' when no variable is declared (compiling source file sockio.cpp)
  949. 8>C:\Program Files (x86)\Microsoft SDKs\Windows\v7.1A\include\dbghelp.h(3056): warning C4091: 'typedef ': ignored on left of '' when no variable is declared (compiling source file sockio.cpp)
  950. 8>  Unknown compiler version - please run the configure tests and report the results
  951. 8>C:\Program Files (x86)\Microsoft SDKs\Windows\v7.1A\include\dbghelp.h(1540): warning C4091: 'typedef ': ignored on left of '' when no variable is declared (compiling source file sngclick.cpp)
  952. 8>C:\Program Files (x86)\Microsoft SDKs\Windows\v7.1A\include\dbghelp.h(3056): warning C4091: 'typedef ': ignored on left of '' when no variable is declared (compiling source file sngclick.cpp)
  953. 8>  speech.cpp
  954. 8>  Unknown compiler version - please run the configure tests and report the results
  955. 8>  Unknown compiler version - please run the configure tests and report the results
  956. 8>D:\Apps\Microsoft Visual Studio 2015\VC\include\CodeAnalysis/sourceannotations.h(68): warning C4467: usage of ATL attributes is deprecated (compiling source file sockio.cpp)
  957. 8>  spelbook.cpp
  958. 8>D:\Apps\Microsoft Visual Studio 2015\VC\include\CodeAnalysis/sourceannotations.h(68): warning C4467: usage of ATL attributes is deprecated (compiling source file spelbook.cpp)
  959. 8>  Unknown compiler version - please run the configure tests and report the results
  960. 8>  spells.cpp
  961. 8>D:\Apps\Microsoft Visual Studio 2015\VC\include\CodeAnalysis/sourceannotations.h(68): warning C4467: usage of ATL attributes is deprecated (compiling source file speech.cpp)
  962. 8>D:\Apps\Microsoft Visual Studio 2015\VC\include\CodeAnalysis/sourceannotations.h(68): warning C4467: usage of ATL attributes is deprecated (compiling source file spells.cpp)
  963. 8>C:\Program Files (x86)\Microsoft SDKs\Windows\v7.1A\include\dbghelp.h(1540): warning C4091: 'typedef ': ignored on left of '' when no variable is declared (compiling source file speech.cpp)
  964. 8>C:\Program Files (x86)\Microsoft SDKs\Windows\v7.1A\include\dbghelp.h(3056): warning C4091: 'typedef ': ignored on left of '' when no variable is declared (compiling source file speech.cpp)
  965. 8>  Unknown compiler version - please run the configure tests and report the results
  966. 8>C:\Program Files (x86)\Microsoft SDKs\Windows\v7.1A\include\dbghelp.h(1540): warning C4091: 'typedef ': ignored on left of '' when no variable is declared (compiling source file spelbook.cpp)
  967. 8>C:\Program Files (x86)\Microsoft SDKs\Windows\v7.1A\include\dbghelp.h(3056): warning C4091: 'typedef ': ignored on left of '' when no variable is declared (compiling source file spelbook.cpp)
  968. 8>C:\Program Files (x86)\Microsoft SDKs\Windows\v7.1A\include\dbghelp.h(1540): warning C4091: 'typedef ': ignored on left of '' when no variable is declared (compiling source file spells.cpp)
  969. 8>C:\Program Files (x86)\Microsoft SDKs\Windows\v7.1A\include\dbghelp.h(3056): warning C4091: 'typedef ': ignored on left of '' when no variable is declared (compiling source file spells.cpp)
  970. 8>  sqlscrobj.cpp
  971. 8>D:\Apps\Microsoft Visual Studio 2015\VC\include\CodeAnalysis/sourceannotations.h(68): warning C4467: usage of ATL attributes is deprecated (compiling source file sqlscrobj.cpp)
  972. 8>C:\Program Files (x86)\Microsoft SDKs\Windows\v7.1A\include\dbghelp.h(1540): warning C4091: 'typedef ': ignored on left of '' when no variable is declared (compiling source file sqlscrobj.cpp)
  973. 8>C:\Program Files (x86)\Microsoft SDKs\Windows\v7.1A\include\dbghelp.h(3056): warning C4091: 'typedef ': ignored on left of '' when no variable is declared (compiling source file sqlscrobj.cpp)
  974. 8>  Unknown compiler version - please run the configure tests and report the results
  975. 8>  ssopt.cpp
  976. 8>  stackcfg.cpp
  977. 8>  Unknown compiler version - please run the configure tests and report the results
  978. 8>  Unknown compiler version - please run the configure tests and report the results
  979. 8>D:\Apps\Microsoft Visual Studio 2015\VC\include\CodeAnalysis/sourceannotations.h(68): warning C4467: usage of ATL attributes is deprecated (compiling source file stackcfg.cpp)
  980. 8>C:\Program Files (x86)\Microsoft SDKs\Windows\v7.1A\include\dbghelp.h(1540): warning C4091: 'typedef ': ignored on left of '' when no variable is declared (compiling source file stackcfg.cpp)
  981. 8>C:\Program Files (x86)\Microsoft SDKs\Windows\v7.1A\include\dbghelp.h(3056): warning C4091: 'typedef ': ignored on left of '' when no variable is declared (compiling source file stackcfg.cpp)
  982. 8>  startloc.cpp
  983. 8>D:\Apps\Microsoft Visual Studio 2015\VC\include\CodeAnalysis/sourceannotations.h(68): warning C4467: usage of ATL attributes is deprecated (compiling source file ssopt.cpp)
  984. 8>  statmsg.cpp
  985. 8>D:\Apps\Microsoft Visual Studio 2015\VC\include\CodeAnalysis/sourceannotations.h(68): warning C4467: usage of ATL attributes is deprecated (compiling source file statmsg.cpp)
  986. 8>  Unknown compiler version - please run the configure tests and report the results
  987. 8>  StdAfx.cpp
  988. 8>  Unknown compiler version - please run the configure tests and report the results
  989. 8>C:\Program Files (x86)\Microsoft SDKs\Windows\v7.1A\include\dbghelp.h(1540): warning C4091: 'typedef ': ignored on left of '' when no variable is declared (compiling source file StdAfx.cpp)
  990. 8>C:\Program Files (x86)\Microsoft SDKs\Windows\v7.1A\include\dbghelp.h(3056): warning C4091: 'typedef ': ignored on left of '' when no variable is declared (compiling source file StdAfx.cpp)
  991. 8>  storage.cpp
  992. 8>  syshook.cpp
  993. 8>D:\Apps\Microsoft Visual Studio 2015\VC\include\CodeAnalysis/sourceannotations.h(68): warning C4467: usage of ATL attributes is deprecated (compiling source file syshook.cpp)
  994. 8>D:\Apps\Microsoft Visual Studio 2015\VC\include\CodeAnalysis/sourceannotations.h(68): warning C4467: usage of ATL attributes is deprecated (compiling source file storage.cpp)
  995. 8>C:\Program Files (x86)\Microsoft SDKs\Windows\v7.1A\include\dbghelp.h(1540): warning C4091: 'typedef ': ignored on left of '' when no variable is declared (compiling source file statmsg.cpp)
  996. 8>C:\Program Files (x86)\Microsoft SDKs\Windows\v7.1A\include\dbghelp.h(3056): warning C4091: 'typedef ': ignored on left of '' when no variable is declared (compiling source file statmsg.cpp)
  997. 8>C:\Program Files (x86)\Microsoft SDKs\Windows\v7.1A\include\dbghelp.h(1540): warning C4091: 'typedef ': ignored on left of '' when no variable is declared (compiling source file syshook.cpp)
  998. 8>C:\Program Files (x86)\Microsoft SDKs\Windows\v7.1A\include\dbghelp.h(3056): warning C4091: 'typedef ': ignored on left of '' when no variable is declared (compiling source file syshook.cpp)
  999. 8>  Unknown compiler version - please run the configure tests and report the results
  1000. 8>D:\Apps\Microsoft Visual Studio 2015\VC\include\CodeAnalysis/sourceannotations.h(68): warning C4467: usage of ATL attributes is deprecated (compiling source file StdAfx.cpp)
  1001. 8>  Unknown compiler version - please run the configure tests and report the results
  1002. 8>C:\Program Files (x86)\Microsoft SDKs\Windows\v7.1A\include\dbghelp.h(1540): warning C4091: 'typedef ': ignored on left of '' when no variable is declared (compiling source file storage.cpp)
  1003. 8>C:\Program Files (x86)\Microsoft SDKs\Windows\v7.1A\include\dbghelp.h(3056): warning C4091: 'typedef ': ignored on left of '' when no variable is declared (compiling source file storage.cpp)
  1004. 8>  syshookscript.cpp
  1005. 8>  target.cpp
  1006. 8>D:\Apps\Microsoft Visual Studio 2015\VC\include\CodeAnalysis/sourceannotations.h(68): warning C4467: usage of ATL attributes is deprecated (compiling source file target.cpp)
  1007. 8>  Unknown compiler version - please run the configure tests and report the results
  1008. 8>  Unknown compiler version - please run the configure tests and report the results
  1009. 8>D:\Apps\Microsoft Visual Studio 2015\VC\include\CodeAnalysis/sourceannotations.h(68): warning C4467: usage of ATL attributes is deprecated (compiling source file syshookscript.cpp)
  1010. 8>C:\Program Files (x86)\Microsoft SDKs\Windows\v7.1A\include\dbghelp.h(1540): warning C4091: 'typedef ': ignored on left of '' when no variable is declared (compiling source file syshookscript.cpp)
  1011. 8>C:\Program Files (x86)\Microsoft SDKs\Windows\v7.1A\include\dbghelp.h(3056): warning C4091: 'typedef ': ignored on left of '' when no variable is declared (compiling source file syshookscript.cpp)
  1012. 8>  tasks.cpp
  1013. 8>D:\Apps\Microsoft Visual Studio 2015\VC\include\CodeAnalysis/sourceannotations.h(68): warning C4467: usage of ATL attributes is deprecated (compiling source file tasks.cpp)
  1014. 8>C:\Program Files (x86)\Microsoft SDKs\Windows\v7.1A\include\dbghelp.h(1540): warning C4091: 'typedef ': ignored on left of '' when no variable is declared (compiling source file target.cpp)
  1015. 8>C:\Program Files (x86)\Microsoft SDKs\Windows\v7.1A\include\dbghelp.h(3056): warning C4091: 'typedef ': ignored on left of '' when no variable is declared (compiling source file target.cpp)
  1016. 8>  Unknown compiler version - please run the configure tests and report the results
  1017. 8>  textcmd.cpp
  1018. 8>  Unknown compiler version - please run the configure tests and report the results
  1019. 8>C:\Program Files (x86)\Microsoft SDKs\Windows\v7.1A\include\dbghelp.h(1540): warning C4091: 'typedef ': ignored on left of '' when no variable is declared (compiling source file tasks.cpp)
  1020. 8>C:\Program Files (x86)\Microsoft SDKs\Windows\v7.1A\include\dbghelp.h(3056): warning C4091: 'typedef ': ignored on left of '' when no variable is declared (compiling source file tasks.cpp)
  1021. 8>  tildecmd.cpp
  1022. 8>D:\Apps\Microsoft Visual Studio 2015\VC\include\CodeAnalysis/sourceannotations.h(68): warning C4467: usage of ATL attributes is deprecated (compiling source file textcmd.cpp)
  1023. 8>D:\Apps\Microsoft Visual Studio 2015\VC\include\CodeAnalysis/sourceannotations.h(68): warning C4467: usage of ATL attributes is deprecated (compiling source file tildecmd.cpp)
  1024. 8>  Unknown compiler version - please run the configure tests and report the results
  1025. 8>C:\Program Files (x86)\Microsoft SDKs\Windows\v7.1A\include\dbghelp.h(1540): warning C4091: 'typedef ': ignored on left of '' when no variable is declared (compiling source file textcmd.cpp)
  1026. 8>C:\Program Files (x86)\Microsoft SDKs\Windows\v7.1A\include\dbghelp.h(3056): warning C4091: 'typedef ': ignored on left of '' when no variable is declared (compiling source file textcmd.cpp)
  1027. 8>  tiles.cpp
  1028. 8>C:\Program Files (x86)\Microsoft SDKs\Windows\v7.1A\include\dbghelp.h(1540): warning C4091: 'typedef ': ignored on left of '' when no variable is declared (compiling source file tildecmd.cpp)
  1029. 8>C:\Program Files (x86)\Microsoft SDKs\Windows\v7.1A\include\dbghelp.h(3056): warning C4091: 'typedef ': ignored on left of '' when no variable is declared (compiling source file tildecmd.cpp)
  1030. 8>  Unknown compiler version - please run the configure tests and report the results
  1031. 8>D:\Apps\Microsoft Visual Studio 2015\VC\include\CodeAnalysis/sourceannotations.h(68): warning C4467: usage of ATL attributes is deprecated (compiling source file tiles.cpp)
  1032. 8>  tiplstwn.cpp
  1033. 8>  tips.cpp
  1034. 8>C:\Program Files (x86)\Microsoft SDKs\Windows\v7.1A\include\dbghelp.h(1540): warning C4091: 'typedef ': ignored on left of '' when no variable is declared (compiling source file tiplstwn.cpp)
  1035. 8>C:\Program Files (x86)\Microsoft SDKs\Windows\v7.1A\include\dbghelp.h(3056): warning C4091: 'typedef ': ignored on left of '' when no variable is declared (compiling source file tiplstwn.cpp)
  1036. 8>D:\Apps\Microsoft Visual Studio 2015\VC\include\CodeAnalysis/sourceannotations.h(68): warning C4467: usage of ATL attributes is deprecated (compiling source file tiplstwn.cpp)
  1037. 8>  tmpvars.cpp
  1038. 8>  tooltips.cpp
  1039. 8>D:\Apps\Microsoft Visual Studio 2015\VC\include\CodeAnalysis/sourceannotations.h(68): warning C4467: usage of ATL attributes is deprecated (compiling source file tooltips.cpp)
  1040. 8>  Unknown compiler version - please run the configure tests and report the results
  1041. 8>  Unknown compiler version - please run the configure tests and report the results
  1042. 8>D:\Apps\Microsoft Visual Studio 2015\VC\include\CodeAnalysis/sourceannotations.h(68): warning C4467: usage of ATL attributes is deprecated (compiling source file tips.cpp)
  1043. 8>  Unknown compiler version - please run the configure tests and report the results
  1044. 8>C:\Program Files (x86)\Microsoft SDKs\Windows\v7.1A\include\dbghelp.h(1540): warning C4091: 'typedef ': ignored on left of '' when no variable is declared (compiling source file tips.cpp)
  1045. 8>C:\Program Files (x86)\Microsoft SDKs\Windows\v7.1A\include\dbghelp.h(3056): warning C4091: 'typedef ': ignored on left of '' when no variable is declared (compiling source file tips.cpp)
  1046. 8>  ufunc.cpp
  1047. 8>  Unknown compiler version - please run the configure tests and report the results
  1048. 8>D:\Apps\Microsoft Visual Studio 2015\VC\include\CodeAnalysis/sourceannotations.h(68): warning C4467: usage of ATL attributes is deprecated (compiling source file ufunc.cpp)
  1049. 8>C:\Program Files (x86)\Microsoft SDKs\Windows\v7.1A\include\dbghelp.h(1540): warning C4091: 'typedef ': ignored on left of '' when no variable is declared (compiling source file ufunc.cpp)
  1050. 8>C:\Program Files (x86)\Microsoft SDKs\Windows\v7.1A\include\dbghelp.h(3056): warning C4091: 'typedef ': ignored on left of '' when no variable is declared (compiling source file ufunc.cpp)
  1051. 8>C:\Program Files (x86)\Microsoft SDKs\Windows\v7.1A\include\dbghelp.h(1540): warning C4091: 'typedef ': ignored on left of '' when no variable is declared (compiling source file tooltips.cpp)
  1052. 8>C:\Program Files (x86)\Microsoft SDKs\Windows\v7.1A\include\dbghelp.h(3056): warning C4091: 'typedef ': ignored on left of '' when no variable is declared (compiling source file tooltips.cpp)
  1053. 8>  ufunc2.cpp
  1054. 8>  Unknown compiler version - please run the configure tests and report the results
  1055. 8>D:\Apps\Microsoft Visual Studio 2015\VC\include\CodeAnalysis/sourceannotations.h(68): warning C4467: usage of ATL attributes is deprecated (compiling source file ufunc2.cpp)
  1056. 8>C:\Program Files (x86)\Microsoft SDKs\Windows\v7.1A\include\dbghelp.h(1540): warning C4091: 'typedef ': ignored on left of '' when no variable is declared (compiling source file ufunc2.cpp)
  1057. 8>C:\Program Files (x86)\Microsoft SDKs\Windows\v7.1A\include\dbghelp.h(3056): warning C4091: 'typedef ': ignored on left of '' when no variable is declared (compiling source file ufunc2.cpp)
  1058. 8>  uimport.cpp
  1059. 8>  Unknown compiler version - please run the configure tests and report the results
  1060. 8>  umap.cpp
  1061. 8>D:\Apps\Microsoft Visual Studio 2015\VC\include\CodeAnalysis/sourceannotations.h(68): warning C4467: usage of ATL attributes is deprecated (compiling source file umap.cpp)
  1062. 8>D:\Apps\Microsoft Visual Studio 2015\VC\include\CodeAnalysis/sourceannotations.h(68): warning C4467: usage of ATL attributes is deprecated (compiling source file uimport.cpp)
  1063. 8>  Unknown compiler version - please run the configure tests and report the results
  1064. 8>C:\Program Files (x86)\Microsoft SDKs\Windows\v7.1A\include\dbghelp.h(1540): warning C4091: 'typedef ': ignored on left of '' when no variable is declared (compiling source file uimport.cpp)
  1065. 8>C:\Program Files (x86)\Microsoft SDKs\Windows\v7.1A\include\dbghelp.h(3056): warning C4091: 'typedef ': ignored on left of '' when no variable is declared (compiling source file uimport.cpp)
  1066. 8>  unicode.cpp
  1067. 8>C:\Program Files (x86)\Microsoft SDKs\Windows\v7.1A\include\dbghelp.h(1540): warning C4091: 'typedef ': ignored on left of '' when no variable is declared (compiling source file umap.cpp)
  1068. 8>C:\Program Files (x86)\Microsoft SDKs\Windows\v7.1A\include\dbghelp.h(3056): warning C4091: 'typedef ': ignored on left of '' when no variable is declared (compiling source file umap.cpp)
  1069. 8>D:\Apps\Microsoft Visual Studio 2015\VC\include\CodeAnalysis/sourceannotations.h(68): warning C4467: usage of ATL attributes is deprecated (compiling source file unicode.cpp)
  1070. 8>  uobjcnt.cpp
  1071. 8>  uobject.cpp
  1072. 8>D:\Apps\Microsoft Visual Studio 2015\VC\include\CodeAnalysis/sourceannotations.h(68): warning C4467: usage of ATL attributes is deprecated (compiling source file uobject.cpp)
  1073. 8>  Unknown compiler version - please run the configure tests and report the results
  1074. 8>  uoclient.cpp
  1075. 8>  Unknown compiler version - please run the configure tests and report the results
  1076. 8>D:\Apps\Microsoft Visual Studio 2015\VC\include\CodeAnalysis/sourceannotations.h(68): warning C4467: usage of ATL attributes is deprecated (compiling source file uoclient.cpp)
  1077. 8>  uoexec.cpp
  1078. 8>D:\Apps\Microsoft Visual Studio 2015\VC\include\CodeAnalysis/sourceannotations.h(68): warning C4467: usage of ATL attributes is deprecated (compiling source file uoexec.cpp)
  1079. 8>C:\Program Files (x86)\Microsoft SDKs\Windows\v7.1A\include\dbghelp.h(1540): warning C4091: 'typedef ': ignored on left of '' when no variable is declared (compiling source file uoclient.cpp)
  1080. 8>C:\Program Files (x86)\Microsoft SDKs\Windows\v7.1A\include\dbghelp.h(3056): warning C4091: 'typedef ': ignored on left of '' when no variable is declared (compiling source file uoclient.cpp)
  1081. 8>C:\Program Files (x86)\Microsoft SDKs\Windows\v7.1A\include\dbghelp.h(1540): warning C4091: 'typedef ': ignored on left of '' when no variable is declared (compiling source file uobject.cpp)
  1082. 8>C:\Program Files (x86)\Microsoft SDKs\Windows\v7.1A\include\dbghelp.h(3056): warning C4091: 'typedef ': ignored on left of '' when no variable is declared (compiling source file uobject.cpp)
  1083. 8>C:\Program Files (x86)\Microsoft SDKs\Windows\v7.1A\include\dbghelp.h(1540): warning C4091: 'typedef ': ignored on left of '' when no variable is declared (compiling source file uoexec.cpp)
  1084. 8>C:\Program Files (x86)\Microsoft SDKs\Windows\v7.1A\include\dbghelp.h(3056): warning C4091: 'typedef ': ignored on left of '' when no variable is declared (compiling source file uoexec.cpp)
  1085. 8>  uoexhelp.cpp
  1086. 8>  Unknown compiler version - please run the configure tests and report the results
  1087. 8>D:\Apps\Microsoft Visual Studio 2015\VC\include\CodeAnalysis/sourceannotations.h(68): warning C4467: usage of ATL attributes is deprecated (compiling source file uoexhelp.cpp)
  1088. 8>  uolisten.cpp
  1089. 8>  Unknown compiler version - please run the configure tests and report the results
  1090. 8>D:\Apps\Microsoft Visual Studio 2015\VC\include\CodeAnalysis/sourceannotations.h(68): warning C4467: usage of ATL attributes is deprecated (compiling source file uolisten.cpp)
  1091. 8>  Unknown compiler version - please run the configure tests and report the results
  1092. 8>C:\Program Files (x86)\Microsoft SDKs\Windows\v7.1A\include\dbghelp.h(1540): warning C4091: 'typedef ': ignored on left of '' when no variable is declared (compiling source file uolisten.cpp)
  1093. 8>C:\Program Files (x86)\Microsoft SDKs\Windows\v7.1A\include\dbghelp.h(3056): warning C4091: 'typedef ': ignored on left of '' when no variable is declared (compiling source file uolisten.cpp)
  1094. 8>  uoscrobj.cpp
  1095. 8>C:\Program Files (x86)\Microsoft SDKs\Windows\v7.1A\include\dbghelp.h(1540): warning C4091: 'typedef ': ignored on left of '' when no variable is declared (compiling source file uoexhelp.cpp)
  1096. 8>C:\Program Files (x86)\Microsoft SDKs\Windows\v7.1A\include\dbghelp.h(3056): warning C4091: 'typedef ': ignored on left of '' when no variable is declared (compiling source file uoexhelp.cpp)
  1097. 8>D:\Apps\Microsoft Visual Studio 2015\VC\include\CodeAnalysis/sourceannotations.h(68): warning C4467: usage of ATL attributes is deprecated (compiling source file uoscrobj.cpp)
  1098. 8>C:\Program Files (x86)\Microsoft SDKs\Windows\v7.1A\include\dbghelp.h(1540): warning C4091: 'typedef ': ignored on left of '' when no variable is declared (compiling source file uoscrobj.cpp)
  1099. 8>C:\Program Files (x86)\Microsoft SDKs\Windows\v7.1A\include\dbghelp.h(3056): warning C4091: 'typedef ': ignored on left of '' when no variable is declared (compiling source file uoscrobj.cpp)
  1100. 8>  Unknown compiler version - please run the configure tests and report the results
  1101. 8>  uoskills.cpp
  1102. 8>  useskill.cpp
  1103. 8>  Unknown compiler version - please run the configure tests and report the results
  1104. 8>  Unknown compiler version - please run the configure tests and report the results
  1105. 8>D:\Apps\Microsoft Visual Studio 2015\VC\include\CodeAnalysis/sourceannotations.h(68): warning C4467: usage of ATL attributes is deprecated (compiling source file uoskills.cpp)
  1106. 8>D:\Apps\Microsoft Visual Studio 2015\VC\include\CodeAnalysis/sourceannotations.h(68): warning C4467: usage of ATL attributes is deprecated (compiling source file useskill.cpp)
  1107. 8>C:\Program Files (x86)\Microsoft SDKs\Windows\v7.1A\include\dbghelp.h(1540): warning C4091: 'typedef ': ignored on left of '' when no variable is declared (compiling source file uoskills.cpp)
  1108. 8>C:\Program Files (x86)\Microsoft SDKs\Windows\v7.1A\include\dbghelp.h(3056): warning C4091: 'typedef ': ignored on left of '' when no variable is declared (compiling source file uoskills.cpp)
  1109. 8>C:\Program Files (x86)\Microsoft SDKs\Windows\v7.1A\include\dbghelp.h(1540): warning C4091: 'typedef ': ignored on left of '' when no variable is declared (compiling source file useskill.cpp)
  1110. 8>C:\Program Files (x86)\Microsoft SDKs\Windows\v7.1A\include\dbghelp.h(3056): warning C4091: 'typedef ': ignored on left of '' when no variable is declared (compiling source file useskill.cpp)
  1111. 8>  uworld.cpp
  1112. 8>D:\Apps\Microsoft Visual Studio 2015\VC\include\CodeAnalysis/sourceannotations.h(68): warning C4467: usage of ATL attributes is deprecated (compiling source file uworld.cpp)
  1113. 8>  Unknown compiler version - please run the configure tests and report the results
  1114. 8>  vital.cpp
  1115. 8>D:\Apps\Microsoft Visual Studio 2015\VC\include\CodeAnalysis/sourceannotations.h(68): warning C4467: usage of ATL attributes is deprecated (compiling source file vital.cpp)
  1116. 8>C:\Program Files (x86)\Microsoft SDKs\Windows\v7.1A\include\dbghelp.h(1540): warning C4091: 'typedef ': ignored on left of '' when no variable is declared (compiling source file vital.cpp)
  1117. 8>C:\Program Files (x86)\Microsoft SDKs\Windows\v7.1A\include\dbghelp.h(3056): warning C4091: 'typedef ': ignored on left of '' when no variable is declared (compiling source file vital.cpp)
  1118. 8>C:\Program Files (x86)\Microsoft SDKs\Windows\v7.1A\include\dbghelp.h(1540): warning C4091: 'typedef ': ignored on left of '' when no variable is declared (compiling source file uworld.cpp)
  1119. 8>C:\Program Files (x86)\Microsoft SDKs\Windows\v7.1A\include\dbghelp.h(3056): warning C4091: 'typedef ': ignored on left of '' when no variable is declared (compiling source file uworld.cpp)
  1120. 8>  wornitems.cpp
  1121. 8>D:\Apps\Microsoft Visual Studio 2015\VC\include\CodeAnalysis/sourceannotations.h(68): warning C4467: usage of ATL attributes is deprecated (compiling source file mobile\wornitems.cpp)
  1122. 8>  Unknown compiler version - please run the configure tests and report the results
  1123. 8>  xmlfilescrobj.cpp
  1124. 8>  Unknown compiler version - please run the configure tests and report the results
  1125. 8>D:\Apps\Microsoft Visual Studio 2015\VC\include\CodeAnalysis/sourceannotations.h(68): warning C4467: usage of ATL attributes is deprecated (compiling source file xmlfilescrobj.cpp)
  1126. 8>C:\Program Files (x86)\Microsoft SDKs\Windows\v7.1A\include\dbghelp.h(1540): warning C4091: 'typedef ': ignored on left of '' when no variable is declared (compiling source file xmlfilescrobj.cpp)
  1127. 8>C:\Program Files (x86)\Microsoft SDKs\Windows\v7.1A\include\dbghelp.h(3056): warning C4091: 'typedef ': ignored on left of '' when no variable is declared (compiling source file xmlfilescrobj.cpp)
  1128. 8>  Unknown compiler version - please run the configure tests and report the results
  1129. 8>C:\Program Files (x86)\Microsoft SDKs\Windows\v7.1A\include\dbghelp.h(1540): warning C4091: 'typedef ': ignored on left of '' when no variable is declared (compiling source file mobile\wornitems.cpp)
  1130. 8>C:\Program Files (x86)\Microsoft SDKs\Windows\v7.1A\include\dbghelp.h(3056): warning C4091: 'typedef ': ignored on left of '' when no variable is declared (compiling source file mobile\wornitems.cpp)
  1131. 8>  zone.cpp
  1132. 8>  blowfish.cpp
  1133. 8>C:\Program Files (x86)\Microsoft SDKs\Windows\v7.1A\include\dbghelp.h(1540): warning C4091: 'typedef ': ignored on left of '' when no variable is declared (compiling source file crypt\blowfish.cpp)
  1134. 8>C:\Program Files (x86)\Microsoft SDKs\Windows\v7.1A\include\dbghelp.h(3056): warning C4091: 'typedef ': ignored on left of '' when no variable is declared (compiling source file crypt\blowfish.cpp)
  1135. 8>D:\Apps\Microsoft Visual Studio 2015\VC\include\CodeAnalysis/sourceannotations.h(68): warning C4467: usage of ATL attributes is deprecated (compiling source file crypt\blowfish.cpp)
  1136. 8>  crypt.cpp
  1137. 8>C:\Program Files (x86)\Microsoft SDKs\Windows\v7.1A\include\dbghelp.h(1540): warning C4091: 'typedef ': ignored on left of '' when no variable is declared (compiling source file crypt\crypt.cpp)
  1138. 8>C:\Program Files (x86)\Microsoft SDKs\Windows\v7.1A\include\dbghelp.h(3056): warning C4091: 'typedef ': ignored on left of '' when no variable is declared (compiling source file crypt\crypt.cpp)
  1139. 8>D:\Apps\Microsoft Visual Studio 2015\VC\include\CodeAnalysis/sourceannotations.h(68): warning C4467: usage of ATL attributes is deprecated (compiling source file crypt\crypt.cpp)
  1140. 8>  cryptbase.cpp
  1141. 8>  cryptengine.cpp
  1142. 8>C:\Program Files (x86)\Microsoft SDKs\Windows\v7.1A\include\dbghelp.h(1540): warning C4091: 'typedef ': ignored on left of '' when no variable is declared (compiling source file crypt\cryptbase.cpp)
  1143. 8>C:\Program Files (x86)\Microsoft SDKs\Windows\v7.1A\include\dbghelp.h(3056): warning C4091: 'typedef ': ignored on left of '' when no variable is declared (compiling source file crypt\cryptbase.cpp)
  1144. 8>D:\Apps\Microsoft Visual Studio 2015\VC\include\CodeAnalysis/sourceannotations.h(68): warning C4467: usage of ATL attributes is deprecated (compiling source file crypt\cryptbase.cpp)
  1145. 8>C:\Program Files (x86)\Microsoft SDKs\Windows\v7.1A\include\dbghelp.h(1540): warning C4091: 'typedef ': ignored on left of '' when no variable is declared (compiling source file crypt\cryptengine.cpp)
  1146. 8>C:\Program Files (x86)\Microsoft SDKs\Windows\v7.1A\include\dbghelp.h(3056): warning C4091: 'typedef ': ignored on left of '' when no variable is declared (compiling source file crypt\cryptengine.cpp)
  1147. 8>D:\Apps\Microsoft Visual Studio 2015\VC\include\CodeAnalysis/sourceannotations.h(68): warning C4467: usage of ATL attributes is deprecated (compiling source file crypt\cryptengine.cpp)
  1148. 8>  cryptkey.cpp
  1149. 8>  logincrypt.cpp
  1150. 8>C:\Program Files (x86)\Microsoft SDKs\Windows\v7.1A\include\dbghelp.h(1540): warning C4091: 'typedef ': ignored on left of '' when no variable is declared (compiling source file crypt\logincrypt.cpp)
  1151. 8>C:\Program Files (x86)\Microsoft SDKs\Windows\v7.1A\include\dbghelp.h(3056): warning C4091: 'typedef ': ignored on left of '' when no variable is declared (compiling source file crypt\logincrypt.cpp)
  1152. 8>D:\Apps\Microsoft Visual Studio 2015\VC\include\CodeAnalysis/sourceannotations.h(68): warning C4467: usage of ATL attributes is deprecated (compiling source file crypt\logincrypt.cpp)
  1153. 8>  Unknown compiler version - please run the configure tests and report the results
  1154. 8>  md5.cpp
  1155. 8>C:\Program Files (x86)\Microsoft SDKs\Windows\v7.1A\include\dbghelp.h(1540): warning C4091: 'typedef ': ignored on left of '' when no variable is declared (compiling source file crypt\md5.cpp)
  1156. 8>C:\Program Files (x86)\Microsoft SDKs\Windows\v7.1A\include\dbghelp.h(3056): warning C4091: 'typedef ': ignored on left of '' when no variable is declared (compiling source file crypt\md5.cpp)
  1157. 8>D:\Apps\Microsoft Visual Studio 2015\VC\include\CodeAnalysis/sourceannotations.h(68): warning C4467: usage of ATL attributes is deprecated (compiling source file crypt\md5.cpp)
  1158. 8>  Unknown compiler version - please run the configure tests and report the results
  1159. 8>  twofish.cpp
  1160. 8>D:\Apps\Microsoft Visual Studio 2015\VC\include\CodeAnalysis/sourceannotations.h(68): warning C4467: usage of ATL attributes is deprecated (compiling source file crypt\cryptkey.cpp)
  1161. 8>C:\Program Files (x86)\Microsoft SDKs\Windows\v7.1A\include\dbghelp.h(1540): warning C4091: 'typedef ': ignored on left of '' when no variable is declared (compiling source file crypt\twofish.cpp)
  1162. 8>C:\Program Files (x86)\Microsoft SDKs\Windows\v7.1A\include\dbghelp.h(3056): warning C4091: 'typedef ': ignored on left of '' when no variable is declared (compiling source file crypt\twofish.cpp)
  1163. 8>D:\Apps\Microsoft Visual Studio 2015\VC\include\CodeAnalysis/sourceannotations.h(68): warning C4467: usage of ATL attributes is deprecated (compiling source file crypt\twofish.cpp)
  1164. 8>  account.cpp
  1165. 8>  Unknown compiler version - please run the configure tests and report the results
  1166. 8>  accounts.cpp
  1167. 8>  Unknown compiler version - please run the configure tests and report the results
  1168. 8>  acscrobj.cpp
  1169. 8>D:\Apps\Microsoft Visual Studio 2015\VC\include\CodeAnalysis/sourceannotations.h(68): warning C4467: usage of ATL attributes is deprecated (compiling source file accounts\acscrobj.cpp)
  1170. 8>  attack.cpp
  1171. 8>D:\Apps\Microsoft Visual Studio 2015\VC\include\CodeAnalysis/sourceannotations.h(68): warning C4467: usage of ATL attributes is deprecated (compiling source file mobile\attack.cpp)
  1172. 8>  Unknown compiler version - please run the configure tests and report the results
  1173. 8>  Unknown compiler version - please run the configure tests and report the results
  1174. 8>D:\Apps\Microsoft Visual Studio 2015\VC\include\CodeAnalysis/sourceannotations.h(68): warning C4467: usage of ATL attributes is deprecated (compiling source file accounts\account.cpp)
  1175. 8>D:\Apps\Microsoft Visual Studio 2015\VC\include\CodeAnalysis/sourceannotations.h(68): warning C4467: usage of ATL attributes is deprecated (compiling source file accounts\accounts.cpp)
  1176. 8>C:\Program Files (x86)\Microsoft SDKs\Windows\v7.1A\include\dbghelp.h(1540): warning C4091: 'typedef ': ignored on left of '' when no variable is declared (compiling source file accounts\account.cpp)
  1177. 8>C:\Program Files (x86)\Microsoft SDKs\Windows\v7.1A\include\dbghelp.h(3056): warning C4091: 'typedef ': ignored on left of '' when no variable is declared (compiling source file accounts\account.cpp)
  1178. 8>C:\Program Files (x86)\Microsoft SDKs\Windows\v7.1A\include\dbghelp.h(1540): warning C4091: 'typedef ': ignored on left of '' when no variable is declared (compiling source file accounts\acscrobj.cpp)
  1179. 8>C:\Program Files (x86)\Microsoft SDKs\Windows\v7.1A\include\dbghelp.h(3056): warning C4091: 'typedef ': ignored on left of '' when no variable is declared (compiling source file accounts\acscrobj.cpp)
  1180. 8>C:\Program Files (x86)\Microsoft SDKs\Windows\v7.1A\include\dbghelp.h(1540): warning C4091: 'typedef ': ignored on left of '' when no variable is declared (compiling source file accounts\accounts.cpp)
  1181. 8>C:\Program Files (x86)\Microsoft SDKs\Windows\v7.1A\include\dbghelp.h(3056): warning C4091: 'typedef ': ignored on left of '' when no variable is declared (compiling source file accounts\accounts.cpp)
  1182. 8>C:\Program Files (x86)\Microsoft SDKs\Windows\v7.1A\include\dbghelp.h(1540): warning C4091: 'typedef ': ignored on left of '' when no variable is declared (compiling source file mobile\attack.cpp)
  1183. 8>C:\Program Files (x86)\Microsoft SDKs\Windows\v7.1A\include\dbghelp.h(3056): warning C4091: 'typedef ': ignored on left of '' when no variable is declared (compiling source file mobile\attack.cpp)
  1184. 8>  attribute.cpp
  1185. 8>  Unknown compiler version - please run the configure tests and report the results
  1186. 8>  boundbox.cpp
  1187. 8>  charactr.cpp
  1188. 8>D:\Apps\Microsoft Visual Studio 2015\VC\include\CodeAnalysis/sourceannotations.h(68): warning C4467: usage of ATL attributes is deprecated (compiling source file mobile\charactr.cpp)
  1189. 8>  chrcast.cpp
  1190. 8>D:\Apps\Microsoft Visual Studio 2015\VC\include\CodeAnalysis/sourceannotations.h(68): warning C4467: usage of ATL attributes is deprecated (compiling source file mobile\chrcast.cpp)
  1191. 8>D:\Apps\Microsoft Visual Studio 2015\VC\include\CodeAnalysis/sourceannotations.h(68): warning C4467: usage of ATL attributes is deprecated (compiling source file mobile\attribute.cpp)
  1192. 8>C:\Program Files (x86)\Microsoft SDKs\Windows\v7.1A\include\dbghelp.h(1540): warning C4091: 'typedef ': ignored on left of '' when no variable is declared (compiling source file mobile\attribute.cpp)
  1193. 8>C:\Program Files (x86)\Microsoft SDKs\Windows\v7.1A\include\dbghelp.h(3056): warning C4091: 'typedef ': ignored on left of '' when no variable is declared (compiling source file mobile\attribute.cpp)
  1194. 8>  Unknown compiler version - please run the configure tests and report the results
  1195. 8>  Unknown compiler version - please run the configure tests and report the results
  1196. 8>  chrituse.cpp
  1197. 8>D:\Apps\Microsoft Visual Studio 2015\VC\include\CodeAnalysis/sourceannotations.h(68): warning C4467: usage of ATL attributes is deprecated (compiling source file mobile\chrituse.cpp)
  1198. 8>  Unknown compiler version - please run the configure tests and report the results
  1199. 8>  chrskuse.cpp
  1200. 8>D:\Apps\Microsoft Visual Studio 2015\VC\include\CodeAnalysis/sourceannotations.h(68): warning C4467: usage of ATL attributes is deprecated (compiling source file mobile\chrskuse.cpp)
  1201. 8>C:\Program Files (x86)\Microsoft SDKs\Windows\v7.1A\include\dbghelp.h(1540): warning C4091: 'typedef ': ignored on left of '' when no variable is declared (compiling source file mobile\chrcast.cpp)
  1202. 8>C:\Program Files (x86)\Microsoft SDKs\Windows\v7.1A\include\dbghelp.h(3056): warning C4091: 'typedef ': ignored on left of '' when no variable is declared (compiling source file mobile\chrcast.cpp)
  1203. 8>C:\Program Files (x86)\Microsoft SDKs\Windows\v7.1A\include\dbghelp.h(1540): warning C4091: 'typedef ': ignored on left of '' when no variable is declared (compiling source file mobile\charactr.cpp)
  1204. 8>C:\Program Files (x86)\Microsoft SDKs\Windows\v7.1A\include\dbghelp.h(3056): warning C4091: 'typedef ': ignored on left of '' when no variable is declared (compiling source file mobile\charactr.cpp)
  1205. 8>  Unknown compiler version - please run the configure tests and report the results
  1206. 8>C:\Program Files (x86)\Microsoft SDKs\Windows\v7.1A\include\dbghelp.h(1540): warning C4091: 'typedef ': ignored on left of '' when no variable is declared (compiling source file mobile\chrituse.cpp)
  1207. 8>C:\Program Files (x86)\Microsoft SDKs\Windows\v7.1A\include\dbghelp.h(3056): warning C4091: 'typedef ': ignored on left of '' when no variable is declared (compiling source file mobile\chrituse.cpp)
  1208. 8>C:\Program Files (x86)\Microsoft SDKs\Windows\v7.1A\include\dbghelp.h(1540): warning C4091: 'typedef ': ignored on left of '' when no variable is declared (compiling source file mobile\chrskuse.cpp)
  1209. 8>C:\Program Files (x86)\Microsoft SDKs\Windows\v7.1A\include\dbghelp.h(3056): warning C4091: 'typedef ': ignored on left of '' when no variable is declared (compiling source file mobile\chrskuse.cpp)
  1210. 8>  combat.cpp
  1211. 8>  corpse.cpp
  1212. 8>D:\Apps\Microsoft Visual Studio 2015\VC\include\CodeAnalysis/sourceannotations.h(68): warning C4467: usage of ATL attributes is deprecated (compiling source file mobile\corpse.cpp)
  1213. 8>  Unknown compiler version - please run the configure tests and report the results
  1214. 8>  boat.cpp
  1215. 8>  Unknown compiler version - please run the configure tests and report the results
  1216. 8>D:\Apps\Microsoft Visual Studio 2015\VC\include\CodeAnalysis/sourceannotations.h(68): warning C4467: usage of ATL attributes is deprecated (compiling source file multi\boat.cpp)
  1217. 8>  boatcomp.cpp
  1218. 8>  Unknown compiler version - please run the configure tests and report the results
  1219. 8>D:\Apps\Microsoft Visual Studio 2015\VC\include\CodeAnalysis/sourceannotations.h(68): warning C4467: usage of ATL attributes is deprecated (compiling source file multi\boatcomp.cpp)
  1220. 8>C:\Program Files (x86)\Microsoft SDKs\Windows\v7.1A\include\dbghelp.h(1540): warning C4091: 'typedef ': ignored on left of '' when no variable is declared (compiling source file mobile\corpse.cpp)
  1221. 8>C:\Program Files (x86)\Microsoft SDKs\Windows\v7.1A\include\dbghelp.h(3056): warning C4091: 'typedef ': ignored on left of '' when no variable is declared (compiling source file mobile\corpse.cpp)
  1222. 8>  customhousehelp.cpp
  1223. 8>  Unknown compiler version - please run the configure tests and report the results
  1224. 8>  customhouses.cpp
  1225. 8>C:\Program Files (x86)\Microsoft SDKs\Windows\v7.1A\include\dbghelp.h(1540): warning C4091: 'typedef ': ignored on left of '' when no variable is declared (compiling source file multi\boat.cpp)
  1226. 8>C:\Program Files (x86)\Microsoft SDKs\Windows\v7.1A\include\dbghelp.h(3056): warning C4091: 'typedef ': ignored on left of '' when no variable is declared (compiling source file multi\boat.cpp)
  1227. 8>D:\Apps\Microsoft Visual Studio 2015\VC\include\CodeAnalysis/sourceannotations.h(68): warning C4467: usage of ATL attributes is deprecated (compiling source file multi\customhouses.cpp)
  1228. 8>C:\Program Files (x86)\Microsoft SDKs\Windows\v7.1A\include\dbghelp.h(1540): warning C4091: 'typedef ': ignored on left of '' when no variable is declared (compiling source file multi\customhouses.cpp)
  1229. 8>C:\Program Files (x86)\Microsoft SDKs\Windows\v7.1A\include\dbghelp.h(3056): warning C4091: 'typedef ': ignored on left of '' when no variable is declared (compiling source file multi\customhouses.cpp)
  1230. 8>  Unknown compiler version - please run the configure tests and report the results
  1231. 8>  house.cpp
  1232. 8>  Unknown compiler version - please run the configure tests and report the results
  1233. 8>  multicfg.cpp
  1234. 8>D:\Apps\Microsoft Visual Studio 2015\VC\include\CodeAnalysis/sourceannotations.h(68): warning C4467: usage of ATL attributes is deprecated (compiling source file multi\multicfg.cpp)
  1235. 8>D:\Apps\Microsoft Visual Studio 2015\VC\include\CodeAnalysis/sourceannotations.h(68): warning C4467: usage of ATL attributes is deprecated (compiling source file multi\house.cpp)
  1236. 8>  Unknown compiler version - please run the configure tests and report the results
  1237. 8>  multicr.cpp
  1238. 8>C:\Program Files (x86)\Microsoft SDKs\Windows\v7.1A\include\dbghelp.h(1540): warning C4091: 'typedef ': ignored on left of '' when no variable is declared (compiling source file multi\house.cpp)
  1239. 8>C:\Program Files (x86)\Microsoft SDKs\Windows\v7.1A\include\dbghelp.h(3056): warning C4091: 'typedef ': ignored on left of '' when no variable is declared (compiling source file multi\house.cpp)
  1240. 8>  Unknown compiler version - please run the configure tests and report the results
  1241. 8>D:\Apps\Microsoft Visual Studio 2015\VC\include\CodeAnalysis/sourceannotations.h(68): warning C4467: usage of ATL attributes is deprecated (compiling source file multi\multicr.cpp)
  1242. 8>  multidef.cpp
  1243. 8>  Unknown compiler version - please run the configure tests and report the results
  1244. 8>D:\Apps\Microsoft Visual Studio 2015\VC\include\CodeAnalysis/sourceannotations.h(68): warning C4467: usage of ATL attributes is deprecated (compiling source file multi\multidef.cpp)
  1245. 8>C:\Program Files (x86)\Microsoft SDKs\Windows\v7.1A\include\dbghelp.h(1540): warning C4091: 'typedef ': ignored on left of '' when no variable is declared (compiling source file multi\multicr.cpp)
  1246. 8>C:\Program Files (x86)\Microsoft SDKs\Windows\v7.1A\include\dbghelp.h(3056): warning C4091: 'typedef ': ignored on left of '' when no variable is declared (compiling source file multi\multicr.cpp)
  1247. 8>  multidef2.cpp
  1248. 8>C:\Program Files (x86)\Microsoft SDKs\Windows\v7.1A\include\dbghelp.h(1540): warning C4091: 'typedef ': ignored on left of '' when no variable is declared (compiling source file multi\multidef.cpp)
  1249. 8>C:\Program Files (x86)\Microsoft SDKs\Windows\v7.1A\include\dbghelp.h(3056): warning C4091: 'typedef ': ignored on left of '' when no variable is declared (compiling source file multi\multidef.cpp)
  1250. 8>  Unknown compiler version - please run the configure tests and report the results
  1251. 8>D:\Apps\Microsoft Visual Studio 2015\VC\include\CodeAnalysis/sourceannotations.h(68): warning C4467: usage of ATL attributes is deprecated (compiling source file multi\multidef2.cpp)
  1252. 8>  multis.cpp
  1253. 8>  Unknown compiler version - please run the configure tests and report the results
  1254. 8>D:\Apps\Microsoft Visual Studio 2015\VC\include\CodeAnalysis/sourceannotations.h(68): warning C4467: usage of ATL attributes is deprecated (compiling source file multi\multis.cpp)
  1255. 8>  auxclient.cpp
  1256. 8>  bannedips.cpp
  1257. 8>D:\Apps\Microsoft Visual Studio 2015\VC\include\CodeAnalysis/sourceannotations.h(68): warning C4467: usage of ATL attributes is deprecated (compiling source file network\auxclient.cpp)
  1258. 8>D:\Apps\Microsoft Visual Studio 2015\VC\include\CodeAnalysis/sourceannotations.h(68): warning C4467: usage of ATL attributes is deprecated (compiling source file network\bannedips.cpp)
  1259. 8>  cgdata.cpp
  1260. 8>C:\Program Files (x86)\Microsoft SDKs\Windows\v7.1A\include\dbghelp.h(1540): warning C4091: 'typedef ': ignored on left of '' when no variable is declared (compiling source file network\auxclient.cpp)
  1261. 8>D:\Apps\Microsoft Visual Studio 2015\VC\include\CodeAnalysis/sourceannotations.h(68): warning C4467: usage of ATL attributes is deprecated (compiling source file network\cgdata.cpp)
  1262. 8>C:\Program Files (x86)\Microsoft SDKs\Windows\v7.1A\include\dbghelp.h(3056): warning C4091: 'typedef ': ignored on left of '' when no variable is declared (compiling source file network\auxclient.cpp)
  1263. 8>  Unknown compiler version - please run the configure tests and report the results
  1264. 8>  Unknown compiler version - please run the configure tests and report the results
  1265. 8>C:\Program Files (x86)\Microsoft SDKs\Windows\v7.1A\include\dbghelp.h(1540): warning C4091: 'typedef ': ignored on left of '' when no variable is declared (compiling source file network\bannedips.cpp)
  1266. 8>C:\Program Files (x86)\Microsoft SDKs\Windows\v7.1A\include\dbghelp.h(3056): warning C4091: 'typedef ': ignored on left of '' when no variable is declared (compiling source file network\bannedips.cpp)
  1267. 8>  Unknown compiler version - please run the configure tests and report the results
  1268. 8>  client.cpp
  1269. 8>D:\Apps\Microsoft Visual Studio 2015\VC\include\CodeAnalysis/sourceannotations.h(68): warning C4467: usage of ATL attributes is deprecated (compiling source file network\client.cpp)
  1270. 8>  Unknown compiler version - please run the configure tests and report the results
  1271. 8>C:\Program Files (x86)\Microsoft SDKs\Windows\v7.1A\include\dbghelp.h(1540): warning C4091: 'typedef ': ignored on left of '' when no variable is declared (compiling source file network\client.cpp)
  1272. 8>C:\Program Files (x86)\Microsoft SDKs\Windows\v7.1A\include\dbghelp.h(3056): warning C4091: 'typedef ': ignored on left of '' when no variable is declared (compiling source file network\client.cpp)
  1273. 8>  clientio.cpp
  1274. 8>D:\Apps\Microsoft Visual Studio 2015\VC\include\CodeAnalysis/sourceannotations.h(68): warning C4467: usage of ATL attributes is deprecated (compiling source file network\clientio.cpp)
  1275. 8>C:\Program Files (x86)\Microsoft SDKs\Windows\v7.1A\include\dbghelp.h(1540): warning C4091: 'typedef ': ignored on left of '' when no variable is declared (compiling source file network\cgdata.cpp)
  1276. 8>C:\Program Files (x86)\Microsoft SDKs\Windows\v7.1A\include\dbghelp.h(3056): warning C4091: 'typedef ': ignored on left of '' when no variable is declared (compiling source file network\cgdata.cpp)
  1277. 8>  Unknown compiler version - please run the configure tests and report the results
  1278. 8>C:\Program Files (x86)\Microsoft SDKs\Windows\v7.1A\include\dbghelp.h(1540): warning C4091: 'typedef ': ignored on left of '' when no variable is declared (compiling source file network\clientio.cpp)
  1279. 8>C:\Program Files (x86)\Microsoft SDKs\Windows\v7.1A\include\dbghelp.h(3056): warning C4091: 'typedef ': ignored on left of '' when no variable is declared (compiling source file network\clientio.cpp)
  1280. 8>  clientthread.cpp
  1281. 8>D:\Apps\Microsoft Visual Studio 2015\VC\include\CodeAnalysis/sourceannotations.h(68): warning C4467: usage of ATL attributes is deprecated (compiling source file network\clientthread.cpp)
  1282. 8>  Unknown compiler version - please run the configure tests and report the results
  1283. 8>C:\Program Files (x86)\Microsoft SDKs\Windows\v7.1A\include\dbghelp.h(1540): warning C4091: 'typedef ': ignored on left of '' when no variable is declared (compiling source file network\clientthread.cpp)
  1284. 8>C:\Program Files (x86)\Microsoft SDKs\Windows\v7.1A\include\dbghelp.h(3056): warning C4091: 'typedef ': ignored on left of '' when no variable is declared (compiling source file network\clientthread.cpp)
  1285. 8>  cliface.cpp
  1286. 8>D:\Apps\Microsoft Visual Studio 2015\VC\include\CodeAnalysis/sourceannotations.h(68): warning C4467: usage of ATL attributes is deprecated (compiling source file network\cliface.cpp)
  1287. 8>  iostats.cpp
  1288. 8>  packethooks.cpp
  1289. 8>  Unknown compiler version - please run the configure tests and report the results
  1290. 8>D:\Apps\Microsoft Visual Studio 2015\VC\include\CodeAnalysis/sourceannotations.h(68): warning C4467: usage of ATL attributes is deprecated (compiling source file network\packethooks.cpp)
  1291. 8>C:\Program Files (x86)\Microsoft SDKs\Windows\v7.1A\include\dbghelp.h(1540): warning C4091: 'typedef ': ignored on left of '' when no variable is declared (compiling source file network\cliface.cpp)
  1292. 8>C:\Program Files (x86)\Microsoft SDKs\Windows\v7.1A\include\dbghelp.h(3056): warning C4091: 'typedef ': ignored on left of '' when no variable is declared (compiling source file network\cliface.cpp)
  1293. 8>  Unknown compiler version - please run the configure tests and report the results
  1294. 8>C:\Program Files (x86)\Microsoft SDKs\Windows\v7.1A\include\dbghelp.h(1540): warning C4091: 'typedef ': ignored on left of '' when no variable is declared (compiling source file network\packethooks.cpp)
  1295. 8>C:\Program Files (x86)\Microsoft SDKs\Windows\v7.1A\include\dbghelp.h(3056): warning C4091: 'typedef ': ignored on left of '' when no variable is declared (compiling source file network\packethooks.cpp)
  1296. 8>  packets.cpp
  1297. 8>  Unknown compiler version - please run the configure tests and report the results
  1298. 8>D:\Apps\Microsoft Visual Studio 2015\VC\include\CodeAnalysis/sourceannotations.h(68): warning C4467: usage of ATL attributes is deprecated (compiling source file network\packets.cpp)
  1299. 8>C:\Program Files (x86)\Microsoft SDKs\Windows\v7.1A\include\dbghelp.h(1540): warning C4091: 'typedef ': ignored on left of '' when no variable is declared (compiling source file network\packets.cpp)
  1300. 8>C:\Program Files (x86)\Microsoft SDKs\Windows\v7.1A\include\dbghelp.h(3056): warning C4091: 'typedef ': ignored on left of '' when no variable is declared (compiling source file network\packets.cpp)
  1301. 8>  attributemod.cpp
  1302. 8>  basiciomod.cpp
  1303. 8>D:\Apps\Microsoft Visual Studio 2015\VC\include\CodeAnalysis/sourceannotations.h(68): warning C4467: usage of ATL attributes is deprecated (compiling source file module\attributemod.cpp)
  1304. 8>  basicmod.cpp
  1305. 8>  boatmod.cpp
  1306. 8>D:\Apps\Microsoft Visual Studio 2015\VC\include\CodeAnalysis/sourceannotations.h(68): warning C4467: usage of ATL attributes is deprecated (compiling source file module\basiciomod.cpp)
  1307. 8>  Unknown compiler version - please run the configure tests and report the results
  1308. 8>D:\Apps\Microsoft Visual Studio 2015\VC\include\CodeAnalysis/sourceannotations.h(68): warning C4467: usage of ATL attributes is deprecated (compiling source file module\basicmod.cpp)
  1309. 8>D:\Apps\Microsoft Visual Studio 2015\VC\include\CodeAnalysis/sourceannotations.h(68): warning C4467: usage of ATL attributes is deprecated (compiling source file module\boatmod.cpp)
  1310. 8>  Unknown compiler version - please run the configure tests and report the results
  1311. 8>  Unknown compiler version - please run the configure tests and report the results
  1312. 8>  Unknown compiler version - please run the configure tests and report the results
  1313. 8>C:\Program Files (x86)\Microsoft SDKs\Windows\v7.1A\include\dbghelp.h(1540): warning C4091: 'typedef ': ignored on left of '' when no variable is declared (compiling source file module\attributemod.cpp)
  1314. 8>C:\Program Files (x86)\Microsoft SDKs\Windows\v7.1A\include\dbghelp.h(3056): warning C4091: 'typedef ': ignored on left of '' when no variable is declared (compiling source file module\attributemod.cpp)
  1315. 8>C:\Program Files (x86)\Microsoft SDKs\Windows\v7.1A\include\dbghelp.h(1540): warning C4091: 'typedef ': ignored on left of '' when no variable is declared (compiling source file module\basiciomod.cpp)
  1316. 8>C:\Program Files (x86)\Microsoft SDKs\Windows\v7.1A\include\dbghelp.h(3056): warning C4091: 'typedef ': ignored on left of '' when no variable is declared (compiling source file module\basiciomod.cpp)
  1317. 8>C:\Program Files (x86)\Microsoft SDKs\Windows\v7.1A\include\dbghelp.h(1540): warning C4091: 'typedef ': ignored on left of '' when no variable is declared (compiling source file module\basicmod.cpp)
  1318. 8>C:\Program Files (x86)\Microsoft SDKs\Windows\v7.1A\include\dbghelp.h(3056): warning C4091: 'typedef ': ignored on left of '' when no variable is declared (compiling source file module\basicmod.cpp)
  1319. 8>C:\Program Files (x86)\Microsoft SDKs\Windows\v7.1A\include\dbghelp.h(1540): warning C4091: 'typedef ': ignored on left of '' when no variable is declared (compiling source file module\boatmod.cpp)
  1320. 8>C:\Program Files (x86)\Microsoft SDKs\Windows\v7.1A\include\dbghelp.h(3056): warning C4091: 'typedef ': ignored on left of '' when no variable is declared (compiling source file module\boatmod.cpp)
  1321. 8>module\basicmod.cpp(500): warning C4244: 'argument': conversion from 'std::streamoff' to 'unsigned int', possible loss of data
  1322. 8>  cfgmod.cpp
  1323. 8>D:\Apps\Microsoft Visual Studio 2015\VC\include\CodeAnalysis/sourceannotations.h(68): warning C4467: usage of ATL attributes is deprecated (compiling source file module\cfgmod.cpp)
  1324. 8>  Unknown compiler version - please run the configure tests and report the results
  1325. 8>  clmod.cpp
  1326. 8>  datastore.cpp
  1327. 8>D:\Apps\Microsoft Visual Studio 2015\VC\include\CodeAnalysis/sourceannotations.h(68): warning C4467: usage of ATL attributes is deprecated (compiling source file module\clmod.cpp)
  1328. 8>  filemod.cpp
  1329. 8>D:\Apps\Microsoft Visual Studio 2015\VC\include\CodeAnalysis/sourceannotations.h(68): warning C4467: usage of ATL attributes is deprecated (compiling source file module\datastore.cpp)
  1330. 8>  Unknown compiler version - please run the configure tests and report the results
  1331. 8>  Unknown compiler version - please run the configure tests and report the results
  1332. 8>D:\Apps\Microsoft Visual Studio 2015\VC\include\CodeAnalysis/sourceannotations.h(68): warning C4467: usage of ATL attributes is deprecated (compiling source file module\filemod.cpp)
  1333. 8>C:\Program Files (x86)\Microsoft SDKs\Windows\v7.1A\include\dbghelp.h(1540): warning C4091: 'typedef ': ignored on left of '' when no variable is declared (compiling source file module\cfgmod.cpp)
  1334. 8>C:\Program Files (x86)\Microsoft SDKs\Windows\v7.1A\include\dbghelp.h(3056): warning C4091: 'typedef ': ignored on left of '' when no variable is declared (compiling source file module\cfgmod.cpp)
  1335. 8>  Unknown compiler version - please run the configure tests and report the results
  1336. 8>C:\Program Files (x86)\Microsoft SDKs\Windows\v7.1A\include\dbghelp.h(1540): warning C4091: 'typedef ': ignored on left of '' when no variable is declared (compiling source file module\clmod.cpp)
  1337. 8>C:\Program Files (x86)\Microsoft SDKs\Windows\v7.1A\include\dbghelp.h(3056): warning C4091: 'typedef ': ignored on left of '' when no variable is declared (compiling source file module\clmod.cpp)
  1338. 8>C:\Program Files (x86)\Microsoft SDKs\Windows\v7.1A\include\dbghelp.h(1540): warning C4091: 'typedef ': ignored on left of '' when no variable is declared (compiling source file module\datastore.cpp)
  1339. 8>C:\Program Files (x86)\Microsoft SDKs\Windows\v7.1A\include\dbghelp.h(3056): warning C4091: 'typedef ': ignored on left of '' when no variable is declared (compiling source file module\datastore.cpp)
  1340. 8>  guildmod.cpp
  1341. 8>C:\Program Files (x86)\Microsoft SDKs\Windows\v7.1A\include\dbghelp.h(1540): warning C4091: 'typedef ': ignored on left of '' when no variable is declared (compiling source file module\filemod.cpp)
  1342. 8>C:\Program Files (x86)\Microsoft SDKs\Windows\v7.1A\include\dbghelp.h(3056): warning C4091: 'typedef ': ignored on left of '' when no variable is declared (compiling source file module\filemod.cpp)
  1343. 8>D:\Apps\Microsoft Visual Studio 2015\VC\include\CodeAnalysis/sourceannotations.h(68): warning C4467: usage of ATL attributes is deprecated (compiling source file module\guildmod.cpp)
  1344. 8>  Unknown compiler version - please run the configure tests and report the results
  1345. 8>  httpmod.cpp
  1346. 8>  mathmod.cpp
  1347. 8>D:\Apps\Microsoft Visual Studio 2015\VC\include\CodeAnalysis/sourceannotations.h(68): warning C4467: usage of ATL attributes is deprecated (compiling source file module\httpmod.cpp)
  1348. 8>C:\Program Files (x86)\Microsoft SDKs\Windows\v7.1A\include\dbghelp.h(1540): warning C4091: 'typedef ': ignored on left of '' when no variable is declared (compiling source file module\guildmod.cpp)
  1349. 8>C:\Program Files (x86)\Microsoft SDKs\Windows\v7.1A\include\dbghelp.h(3056): warning C4091: 'typedef ': ignored on left of '' when no variable is declared (compiling source file module\guildmod.cpp)
  1350. 8>D:\Apps\Microsoft Visual Studio 2015\VC\include\CodeAnalysis/sourceannotations.h(68): warning C4467: usage of ATL attributes is deprecated (compiling source file module\mathmod.cpp)
  1351. 8>  Unknown compiler version - please run the configure tests and report the results
  1352. 8>  Unknown compiler version - please run the configure tests and report the results
  1353. 8>C:\Program Files (x86)\Microsoft SDKs\Windows\v7.1A\include\dbghelp.h(1540): warning C4091: 'typedef ': ignored on left of '' when no variable is declared (compiling source file module\httpmod.cpp)
  1354. 8>C:\Program Files (x86)\Microsoft SDKs\Windows\v7.1A\include\dbghelp.h(3056): warning C4091: 'typedef ': ignored on left of '' when no variable is declared (compiling source file module\httpmod.cpp)
  1355. 8>C:\Program Files (x86)\Microsoft SDKs\Windows\v7.1A\include\dbghelp.h(1540): warning C4091: 'typedef ': ignored on left of '' when no variable is declared (compiling source file module\mathmod.cpp)
  1356. 8>C:\Program Files (x86)\Microsoft SDKs\Windows\v7.1A\include\dbghelp.h(3056): warning C4091: 'typedef ': ignored on left of '' when no variable is declared (compiling source file module\mathmod.cpp)
  1357. 8>  npcmod.cpp
  1358. 8>D:\Apps\Microsoft Visual Studio 2015\VC\include\CodeAnalysis/sourceannotations.h(68): warning C4467: usage of ATL attributes is deprecated (compiling source file module\npcmod.cpp)
  1359. 8>  osmod.cpp
  1360. 8>  Unknown compiler version - please run the configure tests and report the results
  1361. 8>D:\Apps\Microsoft Visual Studio 2015\VC\include\CodeAnalysis/sourceannotations.h(68): warning C4467: usage of ATL attributes is deprecated (compiling source file module\osmod.cpp)
  1362. 8>  Unknown compiler version - please run the configure tests and report the results
  1363. 8>C:\Program Files (x86)\Microsoft SDKs\Windows\v7.1A\include\dbghelp.h(1540): warning C4091: 'typedef ': ignored on left of '' when no variable is declared (compiling source file module\npcmod.cpp)
  1364. 8>C:\Program Files (x86)\Microsoft SDKs\Windows\v7.1A\include\dbghelp.h(3056): warning C4091: 'typedef ': ignored on left of '' when no variable is declared (compiling source file module\npcmod.cpp)
  1365. 8>  partymod.cpp
  1366. 8>D:\Apps\Microsoft Visual Studio 2015\VC\include\CodeAnalysis/sourceannotations.h(68): warning C4467: usage of ATL attributes is deprecated (compiling source file module\partymod.cpp)
  1367. 8>C:\Program Files (x86)\Microsoft SDKs\Windows\v7.1A\include\dbghelp.h(1540): warning C4091: 'typedef ': ignored on left of '' when no variable is declared (compiling source file module\osmod.cpp)
  1368. 8>C:\Program Files (x86)\Microsoft SDKs\Windows\v7.1A\include\dbghelp.h(3056): warning C4091: 'typedef ': ignored on left of '' when no variable is declared (compiling source file module\osmod.cpp)
  1369. 8>  Unknown compiler version - please run the configure tests and report the results
  1370. 8>  polsystemmod.cpp
  1371. 8>D:\Apps\Microsoft Visual Studio 2015\VC\include\CodeAnalysis/sourceannotations.h(68): warning C4467: usage of ATL attributes is deprecated (compiling source file module\polsystemmod.cpp)
  1372. 8>  Unknown compiler version - please run the configure tests and report the results
  1373. 8>C:\Program Files (x86)\Microsoft SDKs\Windows\v7.1A\include\dbghelp.h(1540): warning C4091: 'typedef ': ignored on left of '' when no variable is declared (compiling source file module\partymod.cpp)
  1374. 8>C:\Program Files (x86)\Microsoft SDKs\Windows\v7.1A\include\dbghelp.h(3056): warning C4091: 'typedef ': ignored on left of '' when no variable is declared (compiling source file module\partymod.cpp)
  1375. 8>C:\Program Files (x86)\Microsoft SDKs\Windows\v7.1A\include\dbghelp.h(1540): warning C4091: 'typedef ': ignored on left of '' when no variable is declared (compiling source file module\polsystemmod.cpp)
  1376. 8>C:\Program Files (x86)\Microsoft SDKs\Windows\v7.1A\include\dbghelp.h(3056): warning C4091: 'typedef ': ignored on left of '' when no variable is declared (compiling source file module\polsystemmod.cpp)
  1377. 8>  sqlmod.cpp
  1378. 8>  storagemod.cpp
  1379. 8>D:\Apps\Microsoft Visual Studio 2015\VC\include\CodeAnalysis/sourceannotations.h(68): warning C4467: usage of ATL attributes is deprecated (compiling source file module\sqlmod.cpp)
  1380. 8>D:\Apps\Microsoft Visual Studio 2015\VC\include\CodeAnalysis/sourceannotations.h(68): warning C4467: usage of ATL attributes is deprecated (compiling source file module\storagemod.cpp)
  1381. 8>  Unknown compiler version - please run the configure tests and report the results
  1382. 8>  Unknown compiler version - please run the configure tests and report the results
  1383. 8>  unimod.cpp
  1384. 8>C:\Program Files (x86)\Microsoft SDKs\Windows\v7.1A\include\dbghelp.h(1540): warning C4091: 'typedef ': ignored on left of '' when no variable is declared (compiling source file module\sqlmod.cpp)
  1385. 8>C:\Program Files (x86)\Microsoft SDKs\Windows\v7.1A\include\dbghelp.h(3056): warning C4091: 'typedef ': ignored on left of '' when no variable is declared (compiling source file module\sqlmod.cpp)
  1386. 8>C:\Program Files (x86)\Microsoft SDKs\Windows\v7.1A\include\dbghelp.h(1540): warning C4091: 'typedef ': ignored on left of '' when no variable is declared (compiling source file module\storagemod.cpp)
  1387. 8>C:\Program Files (x86)\Microsoft SDKs\Windows\v7.1A\include\dbghelp.h(3056): warning C4091: 'typedef ': ignored on left of '' when no variable is declared (compiling source file module\storagemod.cpp)
  1388. 8>D:\Apps\Microsoft Visual Studio 2015\VC\include\CodeAnalysis/sourceannotations.h(68): warning C4467: usage of ATL attributes is deprecated (compiling source file module\unimod.cpp)
  1389. 8>  uomod.cpp
  1390. 8>  Unknown compiler version - please run the configure tests and report the results
  1391. 8>D:\Apps\Microsoft Visual Studio 2015\VC\include\CodeAnalysis/sourceannotations.h(68): warning C4467: usage of ATL attributes is deprecated (compiling source file module\uomod.cpp)
  1392. 8>  Unknown compiler version - please run the configure tests and report the results
  1393. 8>C:\Program Files (x86)\Microsoft SDKs\Windows\v7.1A\include\dbghelp.h(1540): warning C4091: 'typedef ': ignored on left of '' when no variable is declared (compiling source file module\unimod.cpp)
  1394. 8>C:\Program Files (x86)\Microsoft SDKs\Windows\v7.1A\include\dbghelp.h(3056): warning C4091: 'typedef ': ignored on left of '' when no variable is declared (compiling source file module\unimod.cpp)
  1395. 8>C:\Program Files (x86)\Microsoft SDKs\Windows\v7.1A\include\dbghelp.h(1540): warning C4091: 'typedef ': ignored on left of '' when no variable is declared (compiling source file module\uomod.cpp)
  1396. 8>C:\Program Files (x86)\Microsoft SDKs\Windows\v7.1A\include\dbghelp.h(3056): warning C4091: 'typedef ': ignored on left of '' when no variable is declared (compiling source file module\uomod.cpp)
  1397. 8>  uomod2.cpp
  1398. 8>  uomod3.cpp
  1399. 8>D:\Apps\Microsoft Visual Studio 2015\VC\include\CodeAnalysis/sourceannotations.h(68): warning C4467: usage of ATL attributes is deprecated (compiling source file module\uomod2.cpp)
  1400. 8>  Unknown compiler version - please run the configure tests and report the results
  1401. 8>D:\Apps\Microsoft Visual Studio 2015\VC\include\CodeAnalysis/sourceannotations.h(68): warning C4467: usage of ATL attributes is deprecated (compiling source file module\uomod3.cpp)
  1402. 8>  Unknown compiler version - please run the configure tests and report the results
  1403. 8>C:\Program Files (x86)\Microsoft SDKs\Windows\v7.1A\include\dbghelp.h(1540): warning C4091: 'typedef ': ignored on left of '' when no variable is declared (compiling source file module\uomod2.cpp)
  1404. 8>C:\Program Files (x86)\Microsoft SDKs\Windows\v7.1A\include\dbghelp.h(3056): warning C4091: 'typedef ': ignored on left of '' when no variable is declared (compiling source file module\uomod2.cpp)
  1405. 8>C:\Program Files (x86)\Microsoft SDKs\Windows\v7.1A\include\dbghelp.h(1540): warning C4091: 'typedef ': ignored on left of '' when no variable is declared (compiling source file module\uomod3.cpp)
  1406. 8>C:\Program Files (x86)\Microsoft SDKs\Windows\v7.1A\include\dbghelp.h(3056): warning C4091: 'typedef ': ignored on left of '' when no variable is declared (compiling source file module\uomod3.cpp)
  1407. 8>  uomod4.cpp
  1408. 8>D:\Apps\Microsoft Visual Studio 2015\VC\include\CodeAnalysis/sourceannotations.h(68): warning C4467: usage of ATL attributes is deprecated (compiling source file module\uomod4.cpp)
  1409. 8>  Unknown compiler version - please run the configure tests and report the results
  1410. 8>  utilmod.cpp
  1411. 8>D:\Apps\Microsoft Visual Studio 2015\VC\include\CodeAnalysis/sourceannotations.h(68): warning C4467: usage of ATL attributes is deprecated (compiling source file module\utilmod.cpp)
  1412. 8>C:\Program Files (x86)\Microsoft SDKs\Windows\v7.1A\include\dbghelp.h(1540): warning C4091: 'typedef ': ignored on left of '' when no variable is declared (compiling source file module\uomod4.cpp)
  1413. 8>C:\Program Files (x86)\Microsoft SDKs\Windows\v7.1A\include\dbghelp.h(3056): warning C4091: 'typedef ': ignored on left of '' when no variable is declared (compiling source file module\uomod4.cpp)
  1414. 8>  Unknown compiler version - please run the configure tests and report the results
  1415. 8>  vitalmod.cpp
  1416. 8>D:\Apps\Microsoft Visual Studio 2015\VC\include\CodeAnalysis/sourceannotations.h(68): warning C4467: usage of ATL attributes is deprecated (compiling source file module\vitalmod.cpp)
  1417. 8>  Unknown compiler version - please run the configure tests and report the results
  1418. 8>C:\Program Files (x86)\Microsoft SDKs\Windows\v7.1A\include\dbghelp.h(1540): warning C4091: 'typedef ': ignored on left of '' when no variable is declared (compiling source file module\utilmod.cpp)
  1419. 8>C:\Program Files (x86)\Microsoft SDKs\Windows\v7.1A\include\dbghelp.h(3056): warning C4091: 'typedef ': ignored on left of '' when no variable is declared (compiling source file module\utilmod.cpp)
  1420. 8>C:\Program Files (x86)\Microsoft SDKs\Windows\v7.1A\include\dbghelp.h(1540): warning C4091: 'typedef ': ignored on left of '' when no variable is declared (compiling source file module\vitalmod.cpp)
  1421. 8>C:\Program Files (x86)\Microsoft SDKs\Windows\v7.1A\include\dbghelp.h(3056): warning C4091: 'typedef ': ignored on left of '' when no variable is declared (compiling source file module\vitalmod.cpp)
  1422. 8>  armor.cpp
  1423. 8>  Unknown compiler version - please run the configure tests and report the results
  1424. 8>  equipmnt.cpp
  1425. 8>D:\Apps\Microsoft Visual Studio 2015\VC\include\CodeAnalysis/sourceannotations.h(68): warning C4467: usage of ATL attributes is deprecated (compiling source file item\equipmnt.cpp)
  1426. 8>  Unknown compiler version - please run the configure tests and report the results
  1427. 8>D:\Apps\Microsoft Visual Studio 2015\VC\include\CodeAnalysis/sourceannotations.h(68): warning C4467: usage of ATL attributes is deprecated (compiling source file item\armor.cpp)
  1428. 8>  item.cpp
  1429. 8>D:\Apps\Microsoft Visual Studio 2015\VC\include\CodeAnalysis/sourceannotations.h(68): warning C4467: usage of ATL attributes is deprecated (compiling source file item\item.cpp)
  1430. 8>  Unknown compiler version - please run the configure tests and report the results
  1431. 8>C:\Program Files (x86)\Microsoft SDKs\Windows\v7.1A\include\dbghelp.h(1540): warning C4091: 'typedef ': ignored on left of '' when no variable is declared (compiling source file item\armor.cpp)
  1432. 8>C:\Program Files (x86)\Microsoft SDKs\Windows\v7.1A\include\dbghelp.h(3056): warning C4091: 'typedef ': ignored on left of '' when no variable is declared (compiling source file item\armor.cpp)
  1433. 8>C:\Program Files (x86)\Microsoft SDKs\Windows\v7.1A\include\dbghelp.h(1540): warning C4091: 'typedef ': ignored on left of '' when no variable is declared (compiling source file item\equipmnt.cpp)
  1434. 8>C:\Program Files (x86)\Microsoft SDKs\Windows\v7.1A\include\dbghelp.h(3056): warning C4091: 'typedef ': ignored on left of '' when no variable is declared (compiling source file item\equipmnt.cpp)
  1435. 8>  item00.cpp
  1436. 8>D:\Apps\Microsoft Visual Studio 2015\VC\include\CodeAnalysis/sourceannotations.h(68): warning C4467: usage of ATL attributes is deprecated (compiling source file item\item00.cpp)
  1437. 8>C:\Program Files (x86)\Microsoft SDKs\Windows\v7.1A\include\dbghelp.h(1540): warning C4091: 'typedef ': ignored on left of '' when no variable is declared (compiling source file item\item.cpp)
  1438. 8>C:\Program Files (x86)\Microsoft SDKs\Windows\v7.1A\include\dbghelp.h(3056): warning C4091: 'typedef ': ignored on left of '' when no variable is declared (compiling source file item\item.cpp)
  1439. 8>  Unknown compiler version - please run the configure tests and report the results
  1440. 8>  itemcr.cpp
  1441. 8>D:\Apps\Microsoft Visual Studio 2015\VC\include\CodeAnalysis/sourceannotations.h(68): warning C4467: usage of ATL attributes is deprecated (compiling source file item\itemcr.cpp)
  1442. 8>  Unknown compiler version - please run the configure tests and report the results
  1443. 8>  itemdesc.cpp
  1444. 8>  weapon.cpp
  1445. 8>D:\Apps\Microsoft Visual Studio 2015\VC\include\CodeAnalysis/sourceannotations.h(68): warning C4467: usage of ATL attributes is deprecated (compiling source file item\weapon.cpp)
  1446. 8>D:\Apps\Microsoft Visual Studio 2015\VC\include\CodeAnalysis/sourceannotations.h(68): warning C4467: usage of ATL attributes is deprecated (compiling source file item\itemdesc.cpp)
  1447. 8>C:\Program Files (x86)\Microsoft SDKs\Windows\v7.1A\include\dbghelp.h(1540): warning C4091: 'typedef ': ignored on left of '' when no variable is declared (compiling source file item\itemcr.cpp)
  1448. 8>C:\Program Files (x86)\Microsoft SDKs\Windows\v7.1A\include\dbghelp.h(3056): warning C4091: 'typedef ': ignored on left of '' when no variable is declared (compiling source file item\itemcr.cpp)
  1449. 8>  Unknown compiler version - please run the configure tests and report the results
  1450. 8>  Unknown compiler version - please run the configure tests and report the results
  1451. 8>C:\Program Files (x86)\Microsoft SDKs\Windows\v7.1A\include\dbghelp.h(1540): warning C4091: 'typedef ': ignored on left of '' when no variable is declared (compiling source file item\itemdesc.cpp)
  1452. 8>C:\Program Files (x86)\Microsoft SDKs\Windows\v7.1A\include\dbghelp.h(3056): warning C4091: 'typedef ': ignored on left of '' when no variable is declared (compiling source file item\itemdesc.cpp)
  1453. 8>C:\Program Files (x86)\Microsoft SDKs\Windows\v7.1A\include\dbghelp.h(1540): warning C4091: 'typedef ': ignored on left of '' when no variable is declared (compiling source file item\weapon.cpp)
  1454. 8>C:\Program Files (x86)\Microsoft SDKs\Windows\v7.1A\include\dbghelp.h(3056): warning C4091: 'typedef ': ignored on left of '' when no variable is declared (compiling source file item\weapon.cpp)
  1455. 8>  adler32.c
  1456. 8>  compress.c
  1457. 8>  crc32.c
  1458. 8>  deflate.c
  1459. 8>  trees.c
  1460. 8>  zutil.c
  1461. 8>LINK : fatal error LNK1104: cannot open file '.\Debug\win2kcompat.obj'
  1462. 12>------ Skipped Rebuild All: Project: dist, Configuration: Debug Win32 ------
  1463. 12>Project not selected to build for this solution configuration
  1464. ========== Rebuild All: 4 succeeded, 6 failed, 2 skipped ==========
RAW Paste Data
We use cookies for various purposes including analytics. By continuing to use Pastebin, you agree to our use of cookies as described in the Cookies Policy. OK, I Understand
 
Top