SHARE
TWEET

Untitled

a guest Apr 23rd, 2019 85 Never
Not a member of Pastebin yet? Sign Up, it unlocks many cool features!
  1. --------->
  2. output of emerge --info
  3. --------->
  4. Portage 2.3.62 (python 3.6.5-final-0, default/linux/amd64/17.0/desktop, gcc-8.2.0, glibc-2.28-r6, 4.19.27-gentoo-r1_2019-03-12 x86_64)
  5. =================================================================
  6. System uname: Linux-4.19.27-gentoo-r1_2019-03-12-x86_64-AMD_Athlon-tm-_64_X2_Dual_Core_Processor_6000+-with-gentoo-2.6
  7. KiB Mem:     2938052 total,   1749584 free
  8. KiB Swap:   16777212 total,  16570436 free
  9. Timestamp of repository gentoo: Mon, 22 Apr 2019 18:30:01 +0000
  10. Head commit of repository gentoo: 43ec94a2e8bfd95d2562b970b8cbfaa5e175ba50
  11. Head commit of repository brother-overlay: 15e7feba59713be9cc0547ca20f6ff7872a2837e
  12.  
  13. sh bash 4.4_p23-r1
  14. ld GNU ld (Gentoo 2.30 p5) 2.30.0
  15. app-shells/bash:          4.4_p23-r1::gentoo
  16. dev-java/java-config:     2.2.0-r4::gentoo
  17. dev-lang/perl:            5.26.2::gentoo
  18. dev-lang/python:          2.7.15::gentoo, 3.6.5::gentoo
  19. dev-util/cmake:           3.9.6::gentoo
  20. dev-util/pkgconfig:       0.29.2::gentoo
  21. sys-apps/baselayout:      2.6-r1::gentoo
  22. sys-apps/openrc:          0.38.3-r1::gentoo
  23. sys-apps/sandbox:         2.13::gentoo
  24. sys-devel/autoconf:       2.13-r1::gentoo, 2.69-r4::gentoo
  25. sys-devel/automake:       1.16.1-r1::gentoo
  26. sys-devel/binutils:       2.30-r4::gentoo, 2.31.1-r4::gentoo
  27. sys-devel/gcc:            8.2.0-r6::gentoo
  28. sys-devel/gcc-config:     2.0::gentoo
  29. sys-devel/libtool:        2.4.6-r3::gentoo
  30. sys-devel/make:           4.2.1-r4::gentoo
  31. sys-kernel/linux-headers: 4.14-r1::gentoo (virtual/os-headers)
  32. sys-libs/glibc:           2.28-r6::gentoo
  33. Repositories:
  34.  
  35. gentoo
  36.     location: /usr/portage
  37.     sync-type: rsync
  38.     sync-uri: rsync://rsync.gentoo.org/gentoo-portage
  39.     priority: -1000
  40.     sync-rsync-verify-max-age: 24
  41.     sync-rsync-extra-opts:
  42.     sync-rsync-verify-metamanifest: yes
  43.     sync-rsync-verify-jobs: 1
  44.  
  45. brother-overlay
  46.     location: /usr/local/overlay/brother-overlay
  47.     sync-type: git
  48.     sync-uri: https://github.com/stefan-langenmaier/brother-overlay.git
  49.     masters: gentoo
  50.  
  51. ACCEPT_KEYWORDS="amd64"
  52. ACCEPT_LICENSE="* -@EULA Vivaldi"
  53. CBUILD="x86_64-pc-linux-gnu"
  54. CFLAGS="-march=native -O2 -pipe"
  55. CHOST="x86_64-pc-linux-gnu"
  56. CONFIG_PROTECT="/etc /usr/share/config /usr/share/gnupg/qualified.txt /var/bind"
  57. CONFIG_PROTECT_MASK="/etc/ca-certificates.conf /etc/dconf /etc/env.d /etc/fonts/fonts.conf /etc/gconf /etc/gentoo-release /etc/php/apache2-php7.2/ext-active/ /etc/php/cgi-php7.2/ext-active/ /etc/php/cli-php7.2/ext-active/ /etc/revdep-rebuild /etc/sandbox.d /etc/terminfo /etc/texmf/language.dat.d /etc/texmf/language.def.d /etc/texmf/updmap.d /etc/texmf/web2c"
  58. CXXFLAGS="-march=native -O2 -pipe"
  59. DISTDIR="/usr/portage/distfiles"
  60. ENV_UNSET="DBUS_SESSION_BUS_ADDRESS DISPLAY GOBIN PERL5LIB PERL5OPT PERLPREFIX PERL_CORE PERL_MB_OPT PERL_MM_OPT XAUTHORITY XDG_CACHE_HOME XDG_CONFIG_HOME XDG_DATA_HOME XDG_RUNTIME_DIR"
  61. FCFLAGS="-O2 -pipe"
  62. FEATURES="assume-digests binpkg-docompress binpkg-dostrip binpkg-logs config-protect-if-modified distlocks ebuild-locks fixlafiles ipc-sandbox merge-sync multilib-strict network-sandbox news parallel-fetch pid-sandbox preserve-libs protect-owned sandbox sfperms split-log strict unknown-features-warn unmerge-logs unmerge-orphans userfetch userpriv usersandbox usersync xattr"
  63. FFLAGS="-O2 -pipe"
  64. GENTOO_MIRRORS="ftp://ftp.ussg.iu.edu/pub/linux/gentoo http://lug.mtu.edu/gentoo/ ftp://lug.mtu.edu/gentoo/ ftp://mirrors.rit.edu/gentoo/ ftp://mirror.iawnet.sandia.gov/pub/gentoo/"
  65. LANG="en_US.UTF-8"
  66. LDFLAGS="-Wl,-O1 -Wl,--as-needed"
  67. MAKEOPTS="-j2"
  68. PKGDIR="/usr/portage/packages"
  69. PORTAGE_CONFIGROOT="/"
  70. PORTAGE_RSYNC_OPTS="--recursive --links --safe-links --perms --times --omit-dir-times --compress --force --whole-file --delete --stats --human-readable --timeout=180 --exclude=/distfiles --exclude=/local --exclude=/packages --exclude=/.git"
  71. PORTAGE_TMPDIR="/var/tmp"
  72. USE="X a52 aac acl acpi alsa amd64 bash-completion berkdb bluetooth branding bzip2 cairo cdda cdr cli consolekit crypt cscope cups cxx dbus dri dts dvd dvdr emboss encode exif fam flac fortran gdbm gif glamor gpm gtk hddtemp iconv ipv6 jpeg lcms ldap libgda libnotify libtirpc lm-sensors mad mng mp3 mp4 mpeg multilib ncurses nls nptl objc ogg opengl openmp pam pango pcre pdf perl php png policykit postscript ppds python qt5 raw readline ruby samba sdl seccomp sockets sound spell sqlite ssl startup-notification svg symlink syslog tcpd tiff tokenizer truetype udev udisks unicode upower usb vorbis wxwidgets x264 xattr xcb xml xv xvid zlib" ABI_X86="64" ALSA_CARDS="ali5451 als4000 atiixp atiixp-modem bt87x ca0106 cmipci emu10k1x ens1370 ens1371 es1938 es1968 fm801 hda-intel intel8x0 intel8x0m maestro3 trident usb-audio via82xx via82xx-modem ymfpci" APACHE2_MODULES="authn_core authz_core socache_shmcb unixd actions alias auth_basic authn_alias authn_anon authn_dbm authn_default authn_file authz_dbm authz_default authz_groupfile authz_host authz_owner authz_user autoindex cache cgi cgid dav dav_fs dav_lock deflate dir disk_cache env expires ext_filter file_cache filter headers include info log_config logio mem_cache mime mime_magic negotiation rewrite setenvif speling status unique_id userdir usertrack vhost_alias" CALLIGRA_FEATURES="karbon sheets words" COLLECTD_PLUGINS="df interface irq load memory rrdtool swap syslog" CPU_FLAGS_X86="3dnow 3dnowext mmx mmxext sse sse2 sse3" ELIBC="glibc" GPSD_PROTOCOLS="ashtech aivdm earthmate evermore fv18 garmin garmintxt gpsclock isync itrax mtk3301 nmea ntrip navcom oceanserver oldstyle oncore rtcm104v2 rtcm104v3 sirf skytraq superstar2 timing tsip tripmate tnt ublox ubx" INPUT_DEVICES="libinput keyboard mouse" KERNEL="linux" LCD_DEVICES="bayrad cfontz cfontz633 glk hd44780 lb216 lcdm001 mtxorb ncurses text" LIBREOFFICE_EXTENSIONS="presenter-console presenter-minimizer" NETBEANS_MODULES="apisupport cnd groovy gsf harness ide identity j2ee java mobility nb php profiler soa visualweb webcommon websvccommon xml" OFFICE_IMPLEMENTATION="libreoffice" PHP_TARGETS="php5-6 php7-1" POSTGRES_TARGETS="postgres9_5 postgres10" PYTHON_SINGLE_TARGET="python3_6" PYTHON_TARGETS="python2_7 python3_6" RUBY_TARGETS="ruby24" USERLAND="GNU" VIDEO_CARDS="radeon" XFCE_PLUGINS="brightness clock trash" XTABLES_ADDONS="quota2 psd pknock lscan length2 ipv4options ipset ipp2p iface geoip fuzzy condition tee tarpit sysrq steal rawnat logmark ipmark dhcpmac delude chaos account"
  73. Unset:  CC, CPPFLAGS, CTARGET, CXX, EMERGE_DEFAULT_OPTS, INSTALL_MASK, LC_ALL, LINGUAS, PORTAGE_BINHOST, PORTAGE_BUNZIP2_COMMAND, PORTAGE_COMPRESS, PORTAGE_COMPRESS_FLAGS, PORTAGE_RSYNC_EXTRA_OPTS
  74.  
  75.  
  76. --------->
  77. output of emerge -pqv =dev-java/xerces-2.11.0-r2
  78. --------->
  79. [ebuild  N    ] dev-java/xerces-2.11.0-r2  USE="-doc -examples -source"
  80.  
  81. --------->
  82. file /var/tmp/portage/dev-java/xerces-2.11.0-r2/temp/build.log:
  83. --------->
  84.  * Package:    dev-java/xerces-2.11.0-r2
  85.  * Repository: gentoo
  86.  * Maintainer: java@gentoo.org
  87.  * USE:        abi_x86_64 amd64 elibc_glibc kernel_linux userland_GNU
  88.  * FEATURES:   network-sandbox preserve-libs sandbox userpriv usersandbox
  89.  * Using: oracle-jdk-bin-1.8
  90. >>> Unpacking source...
  91. >>> Unpacking Xerces-J-src.2.11.0.tar.gz to /var/tmp/portage/dev-java/xerces-2.11.0-r2/work
  92. >>> Source unpacked in /var/tmp/portage/dev-java/xerces-2.11.0-r2/work
  93. >>> Preparing source in /var/tmp/portage/dev-java/xerces-2.11.0-r2/work/xerces-2_11_0 ...
  94.  * Applying xerces-2.11.0-build.xml.patch ...
  95.  [ ok ]
  96. >>> Source prepared.
  97. >>> Configuring source in /var/tmp/portage/dev-java/xerces-2.11.0-r2/work/xerces-2_11_0 ...
  98. Rewriting attributes
  99. Rewriting ./build.xml
  100. >>> Source configured.
  101. >>> Compiling source in /var/tmp/portage/dev-java/xerces-2.11.0-r2/work/xerces-2_11_0 ...
  102.  * Using following ANT_TASKS:  xjavac-1
  103. Buildfile: /var/tmp/portage/dev-java/xerces-2.11.0-r2/work/xerces-2_11_0/build.xml
  104.  
  105. init:
  106.      [echo] ---------------- Xerces-J 2.11.0 [1999-2010] ---------------
  107.  
  108. prepare:
  109.     [mkdir] Created dir: /var/tmp/portage/dev-java/xerces-2.11.0-r2/work/xerces-2_11_0/build
  110.  
  111. prepare-common:
  112.     [mkdir] Created dir: /var/tmp/portage/dev-java/xerces-2.11.0-r2/work/xerces-2_11_0/build/src
  113.     [mkdir] Created dir: /var/tmp/portage/dev-java/xerces-2.11.0-r2/work/xerces-2_11_0/build/classes
  114.     [mkdir] Created dir: /var/tmp/portage/dev-java/xerces-2.11.0-r2/work/xerces-2_11_0/build/classes/META-INF
  115.     [mkdir] Created dir: /var/tmp/portage/dev-java/xerces-2.11.0-r2/work/xerces-2_11_0/build/classes/META-INF/services
  116.      [copy] Copying 1 file to /var/tmp/portage/dev-java/xerces-2.11.0-r2/work/xerces-2_11_0/build/classes/META-INF/services
  117.      [copy] Copying 1 file to /var/tmp/portage/dev-java/xerces-2.11.0-r2/work/xerces-2_11_0/build/classes/META-INF/services
  118.      [copy] Copying 1 file to /var/tmp/portage/dev-java/xerces-2.11.0-r2/work/xerces-2_11_0/build/classes/META-INF/services
  119.      [copy] Copying 1 file to /var/tmp/portage/dev-java/xerces-2.11.0-r2/work/xerces-2_11_0/build/classes/META-INF/services
  120.      [copy] Copying 1 file to /var/tmp/portage/dev-java/xerces-2.11.0-r2/work/xerces-2_11_0/build/classes/META-INF/services
  121.      [copy] Copying 1 file to /var/tmp/portage/dev-java/xerces-2.11.0-r2/work/xerces-2_11_0/build/classes/META-INF/services
  122.  
  123. prepare-src:
  124.      [copy] Copying 1 file to /var/tmp/portage/dev-java/xerces-2.11.0-r2/work/xerces-2_11_0/build/classes/META-INF/services
  125.      [copy] Copying 733 files to /var/tmp/portage/dev-java/xerces-2.11.0-r2/work/xerces-2_11_0/build/src
  126.      [copy] Copying 1 file to /var/tmp/portage/dev-java/xerces-2.11.0-r2/work/xerces-2_11_0/build/src/org/apache/xerces/impl/msg
  127.      [copy] Copying 1 file to /var/tmp/portage/dev-java/xerces-2.11.0-r2/work/xerces-2_11_0/build/src/org/apache/xerces/impl/msg
  128.      [copy] Copying 1 file to /var/tmp/portage/dev-java/xerces-2.11.0-r2/work/xerces-2_11_0/build/src/org/apache/xerces/impl/msg
  129.      [copy] Copying 1 file to /var/tmp/portage/dev-java/xerces-2.11.0-r2/work/xerces-2_11_0/build/src/org/apache/xerces/impl/msg
  130.      [copy] Copying 1 file to /var/tmp/portage/dev-java/xerces-2.11.0-r2/work/xerces-2_11_0/build/src/org/apache/xerces/impl/msg
  131.      [copy] Copying 1 file to /var/tmp/portage/dev-java/xerces-2.11.0-r2/work/xerces-2_11_0/build/src/org/apache/xerces/impl/msg
  132.      [copy] Copying 1 file to /var/tmp/portage/dev-java/xerces-2.11.0-r2/work/xerces-2_11_0/build/src/org/apache/xerces/impl/msg
  133.      [copy] Copying 1 file to /var/tmp/portage/dev-java/xerces-2.11.0-r2/work/xerces-2_11_0/build/src/org/apache/xerces/impl/msg
  134.      [copy] Copying 1 file to /var/tmp/portage/dev-java/xerces-2.11.0-r2/work/xerces-2_11_0/build/src/org/apache/xerces/impl/msg
  135.      [copy] Copying 1 file to /var/tmp/portage/dev-java/xerces-2.11.0-r2/work/xerces-2_11_0/build/src/org/apache/xerces/impl/xpath/regex
  136.  
  137. compile:
  138.      [copy] Copying 23 files to /var/tmp/portage/dev-java/xerces-2.11.0-r2/work/xerces-2_11_0/build/classes
  139.    [xjavac] Compiling 707 source files to /var/tmp/portage/dev-java/xerces-2.11.0-r2/work/xerces-2_11_0/build/classes
  140.    [xjavac] /var/tmp/portage/dev-java/xerces-2.11.0-r2/work/xerces-2_11_0/build/src/org/apache/html/dom/HTMLFrameElementImpl.java:28: error: HTMLFrameElementImpl is not abstract and does not override abstract method getContentDocument() in HTMLFrameElement
  141.    [xjavac] public class HTMLFrameElementImpl
  142.    [xjavac]        ^
  143.    [xjavac] /var/tmp/portage/dev-java/xerces-2.11.0-r2/work/xerces-2_11_0/build/src/org/apache/html/dom/HTMLIFrameElementImpl.java:28: error: HTMLIFrameElementImpl is not abstract and does not override abstract method getContentDocument() in HTMLIFrameElement
  144.    [xjavac] public class HTMLIFrameElementImpl
  145.    [xjavac]        ^
  146.    [xjavac] /var/tmp/portage/dev-java/xerces-2.11.0-r2/work/xerces-2_11_0/build/src/org/apache/html/dom/HTMLObjectElementImpl.java:28: error: HTMLObjectElementImpl is not abstract and does not override abstract method getContentDocument() in HTMLObjectElement
  147.    [xjavac] public class HTMLObjectElementImpl
  148.    [xjavac]        ^
  149.    [xjavac] Note: Some input files use or override a deprecated API.
  150.    [xjavac] Note: Recompile with -Xlint:deprecation for details.
  151.    [xjavac] Note: Some input files use unchecked or unsafe operations.
  152.    [xjavac] Note: Recompile with -Xlint:unchecked for details.
  153.    [xjavac] 3 errors
  154.  
  155. BUILD FAILED
  156. /var/tmp/portage/dev-java/xerces-2.11.0-r2/work/xerces-2_11_0/build.xml:203: Compile failed; see the compiler error output for details.
  157.  
  158. Total time: 13 seconds
  159.  * ERROR: dev-java/xerces-2.11.0-r2::gentoo failed (compile phase):
  160.  *   eant failed
  161.  *
  162.  * Call stack:
  163.  *     ebuild.sh, line  124:  Called src_compile
  164.  *   environment, line 3910:  Called java-pkg-2_src_compile
  165.  *   environment, line 1787:  Called eant 'jar' '-f' 'build.xml' '-Dadditional.param='
  166.  *   environment, line  615:  Called die
  167.  * The specific snippet of code:
  168.  *       ant ${antflags} "${@}" || die "eant failed"
  169.  *
  170.  * If you need support, post the output of `emerge --info '=dev-java/xerces-2.11.0-r2::gentoo'`,
  171.  * the complete build log and the output of `emerge -pqv '=dev-java/xerces-2.11.0-r2::gentoo'`.
  172. !!! When you file a bug report, please include the following information:
  173. GENTOO_VM=oracle-jdk-bin-1.8  CLASSPATH="" JAVA_HOME="/opt/oracle-jdk-bin-1.8.0.202"
  174. JAVACFLAGS="-source 1.6 -target 1.6" COMPILER="javac"
  175. and of course, the output of emerge --info =xerces-2.11.0
  176.  * The complete build log is located at '/var/log/portage/build/dev-java/xerces-2.11.0-r2:20190423-142152.log'.
  177.  * For convenience, a symlink to the build log is located at '/var/tmp/portage/dev-java/xerces-2.11.0-r2/temp/build.log'.
  178.  * The ebuild environment file is located at '/var/tmp/portage/dev-java/xerces-2.11.0-r2/temp/environment'.
  179.  * Working directory: '/var/tmp/portage/dev-java/xerces-2.11.0-r2/work/xerces-2_11_0'
  180.  * S: '/var/tmp/portage/dev-java/xerces-2.11.0-r2/work/xerces-2_11_0'
RAW Paste Data
We use cookies for various purposes including analytics. By continuing to use Pastebin, you agree to our use of cookies as described in the Cookies Policy. OK, I Understand
 
Top