Advertisement
egasimus

Untitled

Jan 13th, 2015
194
Never
Not a member of Pastebin yet? Sign Up, it unlocks many cool features!
  1. make[1]: Entering directory '/home/epimetheus/code/kunst/Carla/source/jackbridge'
  2. Compiling JackBridgeExport.cpp
  3. Creating jackbridge.win32e.a
  4. make[1]: Leaving directory '/home/epimetheus/code/kunst/Carla/source/jackbridge'
  5. make[1]: Entering directory '/home/epimetheus/code/kunst/Carla/source/modules/juce_audio_basics'
  6. Compiling juce_audio_basics.cpp (32bit)
  7. Creating juce_audio_basics.win32.a
  8. make[1]: Leaving directory '/home/epimetheus/code/kunst/Carla/source/modules/juce_audio_basics'
  9. make[1]: Entering directory '/home/epimetheus/code/kunst/Carla/source/modules/juce_audio_processors'
  10. Compiling juce_audio_processors.cpp (32bit)
  11. In file included from ../juce_gui_basics/../juce_graphics/../juce_core/system/juce_StandardHeader.h:53:0,
  12. from ../juce_gui_basics/../juce_graphics/../juce_core/juce_core.h:143,
  13. from ../juce_gui_basics/../juce_graphics/juce_graphics.h:28,
  14. from ../juce_gui_basics/juce_gui_basics.h:28,
  15. from juce_audio_processors.h:28,
  16. from juce_audio_processors.cpp:39:
  17. processors/juce_AudioProcessorEditor.cpp: In destructor ‘virtual juce::AudioProcessorEditor::~AudioProcessorEditor()’:
  18. processors/juce_AudioProcessorEditor.cpp:39:24: error: ‘class juce::AudioProcessor’ has no member named ‘getActiveEditor’
  19. jassert (processor.getActiveEditor() != this);
  20. ^
  21. ../juce_gui_basics/../juce_graphics/../juce_core/system/juce_PlatformDefs.h:108:46: note: in definition of macro ‘MACRO_WITH_FORCED_SEMICOLON’
  22. #define MACRO_WITH_FORCED_SEMICOLON(x) do { x } while (false)
  23. ^
  24. processors/juce_AudioProcessorEditor.cpp:39:5: note: in expansion of macro ‘jassert’
  25. jassert (processor.getActiveEditor() != this);
  26. ^
  27. Makefile:100: recipe for target '../../../build/juce_audio_processors/Release/juce_audio_processors.cpp.win32.o' failed
  28. make[1]: *** [../../../build/juce_audio_processors/Release/juce_audio_processors.cpp.win32.o] Error 1
  29. make[1]: Leaving directory '/home/epimetheus/code/kunst/Carla/source/modules/juce_audio_processors'
  30. Makefile:227: recipe for target '/home/epimetheus/code/kunst/Carla/build/modules/Release/juce_audio_processors.win32.a' failed
  31. make: *** [/home/epimetheus/code/kunst/Carla/build/modules/Release/juce_audio_processors.win32.a] Error 2
Advertisement
RAW Paste Data Copied
Advertisement