Guest User

CppunitTest_vcl_filters_test crash with Clang

a guest
Apr 12th, 2017
138
Never
Not a member of Pastebin yet? Sign Up, it unlocks many cool features!
  1. $ make CppunitTest_vcl_filters_test
  2. make -j 4 -rs -f /core/Makefile.gbuild CppunitTest_vcl_filters_test
  3. [CUT] vcl_filters_test
  4. Aborted (core dumped)
  5. warn:sal.bootstrap:27513:1:sal/rtl/bootstrap.cxx:379: couldn't open file: file:///core/workdir/LinkTarget/Executable/cppunittesterrc
  6. Testing file:///core/vcl/qa/cppunit/graphicfilter/data/wmf/pass/CVE-2005-2123-1.wmf:
  7. Tested file:///core/vcl/qa/cppunit/graphicfilter/data/wmf/pass/CVE-2005-2123-1.wmf: Pass (1ms)
  8. Testing file:///core/vcl/qa/cppunit/graphicfilter/data/wmf/pass/CVE-2006-4071-1.wmf:
  9. Tested file:///core/vcl/qa/cppunit/graphicfilter/data/wmf/pass/CVE-2006-4071-1.wmf: Pass (0ms)
  10. Testing file:///core/vcl/qa/cppunit/graphicfilter/data/wmf/pass/CVE-2007-1090-1.wmf:
  11. Tested file:///core/vcl/qa/cppunit/graphicfilter/data/wmf/pass/CVE-2007-1090-1.wmf: Pass (0ms)
  12. Testing file:///core/vcl/qa/cppunit/graphicfilter/data/wmf/pass/exttextout-1.wmf:
  13. warn:vcl.wmf:27513:1:vcl/source/filter/wmf/winwmf.cxx:552: exttextout record claimed more data than the stream can provide
  14. Tested file:///core/vcl/qa/cppunit/graphicfilter/data/wmf/pass/exttextout-1.wmf: Pass (304ms)
  15. Testing file:///core/vcl/qa/cppunit/graphicfilter/data/wmf/pass/noheader.wmf:
  16. Tested file:///core/vcl/qa/cppunit/graphicfilter/data/wmf/pass/noheader.wmf: Pass (14ms)
  17. Testing file:///core/vcl/qa/cppunit/graphicfilter/data/wmf/fail/CVE-2005-2123-1.wmf-0.009-676:
  18. warn:vcl.wmf:27513:1:vcl/source/filter/wmf/winwmf.cxx:360: polygon record has more points than we can handle
  19. Tested file:///core/vcl/qa/cppunit/graphicfilter/data/wmf/fail/CVE-2005-2123-1.wmf-0.009-676: Fail (0ms)
  20. Testing file:///core/vcl/qa/cppunit/graphicfilter/data/wmf/fail/CVE-2005-2124-1.wmf:
  21. Tested file:///core/vcl/qa/cppunit/graphicfilter/data/wmf/fail/CVE-2005-2124-1.wmf: Fail (1ms)
  22. Testing file:///core/vcl/qa/cppunit/graphicfilter/data/wmf/fail/CVE-2005-4560-1.wmf:
  23. Tested file:///core/vcl/qa/cppunit/graphicfilter/data/wmf/fail/CVE-2005-4560-1.wmf: Fail (0ms)
  24. Testing file:///core/vcl/qa/cppunit/graphicfilter/data/wmf/fail/CVE-2006-0143-1.wmf:
  25. Tested file:///core/vcl/qa/cppunit/graphicfilter/data/wmf/fail/CVE-2006-0143-1.wmf: Fail (0ms)
  26. Testing file:///core/vcl/qa/cppunit/graphicfilter/data/wmf/fail/CVE-2006-0143-2.wmf:
  27. Tested file:///core/vcl/qa/cppunit/graphicfilter/data/wmf/fail/CVE-2006-0143-2.wmf: Fail (0ms)
  28. Testing file:///core/vcl/qa/cppunit/graphicfilter/data/wmf/fail/CVE-2007-1238-1.wmf:
  29. Tested file:///core/vcl/qa/cppunit/graphicfilter/data/wmf/fail/CVE-2007-1238-1.wmf: Fail (0ms)
  30. Testing file:///core/vcl/qa/cppunit/graphicfilter/data/wmf/fail/CVE-2007-1245-1.wmf:
  31. Tested file:///core/vcl/qa/cppunit/graphicfilter/data/wmf/fail/CVE-2007-1245-1.wmf: Fail (1ms)
  32. Testing file:///core/vcl/qa/cppunit/graphicfilter/data/wmf/fail/CVE-2015-0848-1.wmf:
  33. warn:vcl:27513:1:vcl/source/gdi/bmpacc.cxx:53: Forbidden Access to empty bitmap!
  34. Tested file:///core/vcl/qa/cppunit/graphicfilter/data/wmf/fail/CVE-2015-0848-1.wmf: Fail (16ms)
  35. Testing file:///core/vcl/qa/cppunit/graphicfilter/data/wmf/fail/RC4-hang-1.wmf:
  36. Tested file:///core/vcl/qa/cppunit/graphicfilter/data/wmf/fail/RC4-hang-1.wmf: Fail (1ms)
  37. Testing file:///core/vcl/qa/cppunit/graphicfilter/data/wmf/fail/RC4-hang-2.wmf:
  38. warn:vcl.emf:27513:1:vcl/source/filter/wmf/enhwmf.cxx:1872: EMF EMF Header object records number of bytes as 268435940, however the file size is actually 375 bytes. Possible file corruption?
  39. Tested file:///core/vcl/qa/cppunit/graphicfilter/data/wmf/fail/RC4-hang-2.wmf: Fail (0ms)
  40. Testing file:///core/vcl/qa/cppunit/graphicfilter/data/wmf/fail/RC4-hang-3.wmf:
  41. warn:vcl.emf:27513:1:vcl/source/filter/wmf/enhwmf.cxx:1858: EMF This really should be 0x00010000, though not absolutely essential...
  42. Tested file:///core/vcl/qa/cppunit/graphicfilter/data/wmf/fail/RC4-hang-3.wmf: Fail (0ms)
  43. Testing file:///core/vcl/qa/cppunit/graphicfilter/data/wmf/fail/RC4-hang-4.wmf:
  44. Tested file:///core/vcl/qa/cppunit/graphicfilter/data/wmf/fail/RC4-hang-4.wmf: Fail (1ms)
  45. Testing file:///core/vcl/qa/cppunit/graphicfilter/data/wmf/fail/bitcount-1.wmf:
  46. Tested file:///core/vcl/qa/cppunit/graphicfilter/data/wmf/fail/bitcount-1.wmf: Fail (0ms)
  47. Testing file:///core/vcl/qa/cppunit/graphicfilter/data/wmf/fail/facename-1.wmf:
  48. Tested file:///core/vcl/qa/cppunit/graphicfilter/data/wmf/fail/facename-1.wmf: Fail (0ms)
  49. Testing file:///core/vcl/qa/cppunit/graphicfilter/data/wmf/fail/seek-1.wmf:
  50. Tested file:///core/vcl/qa/cppunit/graphicfilter/data/wmf/fail/seek-1.wmf: Fail (1ms)
  51. Testing file:///core/vcl/qa/cppunit/graphicfilter/data/emf/pass/CVE-2008-1087-1.emf:
  52. warn:vcl.emf:27513:1:vcl/source/filter/wmf/enhwmf.cxx:1858: EMF This really should be 0x00010000, though not absolutely essential...
  53. Tested file:///core/vcl/qa/cppunit/graphicfilter/data/emf/pass/CVE-2008-1087-1.emf: Pass (1ms)
  54. Testing file:///core/vcl/qa/cppunit/graphicfilter/data/emf/pass/CVE-2008-2245-1.emf:
  55. warn:vcl.emf:27513:1:vcl/source/filter/wmf/enhwmf.cxx:1858: EMF This really should be 0x00010000, though not absolutely essential...
  56. Tested file:///core/vcl/qa/cppunit/graphicfilter/data/emf/pass/CVE-2008-2245-1.emf: Pass (0ms)
  57. Testing file:///core/vcl/qa/cppunit/graphicfilter/data/emf/pass/CVE-2016-0168-1.emf:
  58. Tested file:///core/vcl/qa/cppunit/graphicfilter/data/emf/pass/CVE-2016-0168-1.emf: Pass (9ms)
  59. Testing file:///core/vcl/qa/cppunit/graphicfilter/data/emf/pass/CVE-2016-0168-2.emf:
  60. Tested file:///core/vcl/qa/cppunit/graphicfilter/data/emf/pass/CVE-2016-0168-2.emf: Pass (1ms)
  61. Testing file:///core/vcl/qa/cppunit/graphicfilter/data/emf/pass/CVE-2016-0169-1.emf:
  62. Tested file:///core/vcl/qa/cppunit/graphicfilter/data/emf/pass/CVE-2016-0169-1.emf: Pass (1ms)
  63. Testing file:///core/vcl/qa/cppunit/graphicfilter/data/emf/pass/CVE-2016-0169-2.emf:
  64. Tested file:///core/vcl/qa/cppunit/graphicfilter/data/emf/pass/CVE-2016-0169-2.emf: Pass (1ms)
  65. Testing file:///core/vcl/qa/cppunit/graphicfilter/data/emf/pass/CVE-2016-0169-3.emf:
  66. Tested file:///core/vcl/qa/cppunit/graphicfilter/data/emf/pass/CVE-2016-0169-3.emf: Pass (1ms)
  67. Testing file:///core/vcl/qa/cppunit/graphicfilter/data/emf/pass/CVE-2016-0170-1.emf:
  68. Tested file:///core/vcl/qa/cppunit/graphicfilter/data/emf/pass/CVE-2016-0170-1.emf: Pass (1ms)
  69. Testing file:///core/vcl/qa/cppunit/graphicfilter/data/emf/pass/CVE-2016-3301-1.emf:
  70. Tested file:///core/vcl/qa/cppunit/graphicfilter/data/emf/pass/CVE-2016-3301-1.emf: Pass (0ms)
  71. Testing file:///core/vcl/qa/cppunit/graphicfilter/data/emf/pass/CVE-2016-3303-1.emf:
  72. Tested file:///core/vcl/qa/cppunit/graphicfilter/data/emf/pass/CVE-2016-3303-1.emf: Pass (1ms)
  73. Testing file:///core/vcl/qa/cppunit/graphicfilter/data/emf/pass/CVE-2016-3304-1.emf:
  74. Tested file:///core/vcl/qa/cppunit/graphicfilter/data/emf/pass/CVE-2016-3304-1.emf: Pass (33ms)
  75. Testing file:///core/vcl/qa/cppunit/graphicfilter/data/emf/pass/crash-1.emf:
  76. warn:vcl.emf:27513:1:vcl/source/filter/wmf/enhwmf.cxx:1872: EMF EMF Header object records number of bytes as 192964, however the file size is actually 7068 bytes. Possible file corruption?
  77. warn:vcl.emf:27513:1:vcl/source/filter/wmf/enhwmf.cxx:1567: SJ: ETO_PDY || ETO_GLYPH_INDEX in EMF
  78. Tested file:///core/vcl/qa/cppunit/graphicfilter/data/emf/pass/crash-1.emf: Pass (1ms)
  79. Testing file:///core/vcl/qa/cppunit/graphicfilter/data/emf/pass/crash-2.emf:
  80. Tested file:///core/vcl/qa/cppunit/graphicfilter/data/emf/pass/crash-2.emf: Pass (46ms)
  81. Testing file:///core/vcl/qa/cppunit/graphicfilter/data/emf/pass/fdo38580-3.emf:
  82. warn:vcl.emf:27513:1:vcl/source/filter/wmf/enhwmf.cxx:1872: EMF EMF Header object records number of bytes as 192964, however the file size is actually 7068 bytes. Possible file corruption?
  83. Tested file:///core/vcl/qa/cppunit/graphicfilter/data/emf/pass/fdo38580-3.emf: Pass (1ms)
  84. Testing file:///core/vcl/qa/cppunit/graphicfilter/data/emf/fail/CVE-2004-0209-1.emf:
  85. Tested file:///core/vcl/qa/cppunit/graphicfilter/data/emf/fail/CVE-2004-0209-1.emf: Fail (0ms)
  86. Testing file:///core/vcl/qa/cppunit/graphicfilter/data/emf/fail/CVE-2008-1083-1.emf:
  87. warn:vcl.emf:27513:1:vcl/source/filter/wmf/enhwmf.cxx:1858: EMF This really should be 0x00010000, though not absolutely essential...
  88. Tested file:///core/vcl/qa/cppunit/graphicfilter/data/emf/fail/CVE-2008-1083-1.emf: Fail (0ms)
  89. Testing file:///core/vcl/qa/cppunit/graphicfilter/data/emf/fail/CVE-2009-1217-1.emf:
  90. Tested file:///core/vcl/qa/cppunit/graphicfilter/data/emf/fail/CVE-2009-1217-1.emf: Fail (0ms)
  91. Testing file:///core/vcl/qa/cppunit/graphicfilter/data/emf/fail/crash-2.emf:
  92. warn:vcl.emf:27513:1:vcl/source/filter/wmf/enhwmf.cxx:1872: EMF EMF Header object records number of bytes as 192964, however the file size is actually 3848 bytes. Possible file corruption?
  93. warn:vcl.emf:27513:1:vcl/source/filter/wmf/enhwmf.cxx:508: polygon record has more polygons than we can handle
  94. Tested file:///core/vcl/qa/cppunit/graphicfilter/data/emf/fail/crash-2.emf: Fail (1ms)
  95. Testing file:///core/vcl/qa/cppunit/graphicfilter/data/emf/fail/crash-3.emf:
  96. warn:vcl.emf:27513:1:vcl/source/filter/wmf/enhwmf.cxx:1872: EMF EMF Header object records number of bytes as 484, however the file size is actually 456 bytes. Possible file corruption?
  97. Tested file:///core/vcl/qa/cppunit/graphicfilter/data/emf/fail/crash-3.emf: Fail (0ms)
  98. Testing file:///core/vcl/qa/cppunit/graphicfilter/data/emf/fail/fdo71307-2.emf:
  99. warn:vcl.emf:27513:1:vcl/source/filter/wmf/enhwmf.cxx:508: polygon record has more polygons than we can handle
  100. Tested file:///core/vcl/qa/cppunit/graphicfilter/data/emf/fail/fdo71307-2.emf: Fail (2ms)
  101. Testing file:///core/vcl/qa/cppunit/graphicfilter/data/emf/fail/hang-1.emf:
  102. warn:vcl.emf:27513:1:vcl/source/filter/wmf/enhwmf.cxx:1872: EMF EMF Header object records number of bytes as 192964, however the file size is actually 2225 bytes. Possible file corruption?
  103. Tested file:///core/vcl/qa/cppunit/graphicfilter/data/emf/fail/hang-1.emf: Fail (1ms)
  104. Testing file:///core/vcl/qa/cppunit/graphicfilter/data/emf/fail/hang-2.emf:
  105. warn:vcl.emf:27513:1:vcl/source/filter/wmf/enhwmf.cxx:1872: EMF EMF Header object records number of bytes as 192964, however the file size is actually 7057 bytes. Possible file corruption?
  106. warn:vcl.emf:27513:1:vcl/source/filter/wmf/enhwmf.cxx:1882: EMF EMF Header object shows record counter as <= 0! This shouldn't be possible... indicator of possible file corruption?
  107. Tested file:///core/vcl/qa/cppunit/graphicfilter/data/emf/fail/hang-2.emf: Fail (0ms)
  108. Testing file:///core/vcl/qa/cppunit/graphicfilter/data/emf/fail/slow-moveclip-1.emf:
  109. warn:vcl.emf:27513:1:vcl/source/filter/wmf/enhwmf.cxx:1858: EMF This really should be 0x00010000, though not absolutely essential...
  110. warn:vcl.emf:27513:1:vcl/source/filter/wmf/enhwmf.cxx:1872: EMF EMF Header object records number of bytes as 137168, however the file size is actually 8700 bytes. Possible file corruption?
  111. warn:vcl.emf:27513:1:vcl/source/filter/wmf/enhwmf.cxx:519: short read on polygon, truncating
  112. Tested file:///core/vcl/qa/cppunit/graphicfilter/data/emf/fail/slow-moveclip-1.emf: Fail (3ms)
  113. Testing file:///core/vcl/qa/cppunit/graphicfilter/data/sgv/pass/SaveAsPicture.sgv:
  114. Tested file:///core/vcl/qa/cppunit/graphicfilter/data/sgv/pass/SaveAsPicture.sgv: Pass (48ms)
  115. Testing file:///core/vcl/qa/cppunit/graphicfilter/data/sgv/pass/faxpfeil.sgv:
  116. Tested file:///core/vcl/qa/cppunit/graphicfilter/data/sgv/pass/faxpfeil.sgv: Pass (0ms)
  117. Testing file:///core/vcl/qa/cppunit/graphicfilter/data/png/pass/CVE-2016-0951-1.png:
  118. Tested file:///core/vcl/qa/cppunit/graphicfilter/data/png/pass/CVE-2016-0951-1.png: Pass (0ms)
  119. Testing file:///core/vcl/qa/cppunit/graphicfilter/data/png/pass/CVE-2016-0952-1.png:
  120. Tested file:///core/vcl/qa/cppunit/graphicfilter/data/png/pass/CVE-2016-0952-1.png: Pass (1ms)
  121. Testing file:///core/vcl/qa/cppunit/graphicfilter/data/png/pass/afl-sample-IDAT.png:
  122. Tested file:///core/vcl/qa/cppunit/graphicfilter/data/png/pass/afl-sample-IDAT.png: Pass (0ms)
  123. Testing file:///core/vcl/qa/cppunit/graphicfilter/data/png/pass/black.png:
  124. Tested file:///core/vcl/qa/cppunit/graphicfilter/data/png/pass/black.png: Pass (1ms)
  125. Testing file:///core/vcl/qa/cppunit/graphicfilter/data/png/pass/invalid-chunk.png:
  126. Tested file:///core/vcl/qa/cppunit/graphicfilter/data/png/pass/invalid-chunk.png: Pass (7ms)
  127. Testing file:///core/vcl/qa/cppunit/graphicfilter/data/png/fail/CVE-2004-0597-1.png:
  128. Tested file:///core/vcl/qa/cppunit/graphicfilter/data/png/fail/CVE-2004-0597-1.png: Fail (0ms)
  129. Testing file:///core/vcl/qa/cppunit/graphicfilter/data/png/fail/CVE-2005-0633-1.png:
  130. Tested file:///core/vcl/qa/cppunit/graphicfilter/data/png/fail/CVE-2005-0633-1.png: Fail (0ms)
  131. Testing file:///core/vcl/qa/cppunit/graphicfilter/data/png/fail/CVE-2006-7210-1.png:
  132. warn:vcl.gdi:27513:1:vcl/source/gdi/pngread.cxx:605: overlarge png dimensions: 65535 x 65535 depth: 8 couldn't be supplied by file length 2495 at least 4161726 needed
  133. Tested file:///core/vcl/qa/cppunit/graphicfilter/data/png/fail/CVE-2006-7210-1.png: Fail (0ms)
  134. Testing file:///core/vcl/qa/cppunit/graphicfilter/data/png/fail/CVE-2007-2365-1.png:
  135. Tested file:///core/vcl/qa/cppunit/graphicfilter/data/png/fail/CVE-2007-2365-1.png: Fail (0ms)
  136. Testing file:///core/vcl/qa/cppunit/graphicfilter/data/png/fail/CVE-2009-1511-1.png:
  137. warn:vcl.gdi:27513:1:vcl/source/gdi/pngread.cxx:605: overlarge png dimensions: 768 x 1024 depth: 8 couldn't be supplied by file length 57 at least 2287 needed
  138. Tested file:///core/vcl/qa/cppunit/graphicfilter/data/png/fail/CVE-2009-1511-1.png: Fail (0ms)
  139. Testing file:///core/vcl/qa/cppunit/graphicfilter/data/png/fail/CVE-2016-0951-2.png:
  140. Tested file:///core/vcl/qa/cppunit/graphicfilter/data/png/fail/CVE-2016-0951-2.png: Fail (0ms)
  141. Testing file:///core/vcl/qa/cppunit/graphicfilter/data/png/fail/CVE-2016-0952-2.png:
  142. Tested file:///core/vcl/qa/cppunit/graphicfilter/data/png/fail/CVE-2016-0952-2.png: Fail (0ms)
  143. Testing file:///core/vcl/qa/cppunit/graphicfilter/data/png/fail/EDB-34720-1.png:
  144. Tested file:///core/vcl/qa/cppunit/graphicfilter/data/png/fail/EDB-34720-1.png: Fail (0ms)
  145. Testing file:///core/vcl/qa/cppunit/graphicfilter/data/png/fail/afl-sample-Z_NEED_DICT.png:
  146. Tested file:///core/vcl/qa/cppunit/graphicfilter/data/png/fail/afl-sample-Z_NEED_DICT.png: Fail (0ms)
  147. Testing file:///core/vcl/qa/cppunit/graphicfilter/data/jpg/pass/CVE-2004-0200-1.jpg:
  148. warn:vcl.filter:27513:1:vcl/source/filter/jpeg/jpegc.cxx:52: failure reading JPEG: Corrupt JPEG data: 130 extraneous bytes before marker 0xc0
  149. warn:vcl.filter:27513:1:vcl/source/filter/jpeg/jpegc.cxx:44: fatal failure reading JPEG: Quantization table 0x00 was not defined
  150. terminate called after throwing an instance of 'com::sun::star::uno::RuntimeException'
  151.  
  152.  
  153. Fatal exception: Signal 6
  154. Stack:
  155. /core/instdir/program/libuno_sal.so.3(+0x84c44)[0x4022fc44]
  156. /core/instdir/program/libuno_sal.so.3(+0x84ac9)[0x4022fac9]
  157. /core/instdir/program/libuno_sal.so.3(+0x84490)[0x4022f490]
  158. [0x40108c20]
  159. [0x40108c31]
  160. /lib/i386-linux-gnu/libc.so.6(gsignal+0x39)[0x404a9ea9]
  161. /lib/i386-linux-gnu/libc.so.6(abort+0x157)[0x404ab407]
  162. /usr/lib/i386-linux-gnu/libstdc++.so.6(_ZN9__gnu_cxx27__verbose_terminate_handlerEv+0x155)[0x40307d35]
  163. /usr/lib/i386-linux-gnu/libstdc++.so.6(+0x70833)[0x40305833]
  164. /usr/lib/i386-linux-gnu/libstdc++.so.6(+0x708ad)[0x403058ad]
  165. /usr/lib/i386-linux-gnu/libstdc++.so.6(__cxa_rethrow+0x0)[0x40305b70]
  166. /core/instdir/program/libvcllo.so(+0x9b9ea4)[0x458d4ea4]
  167. /core/instdir/program/libvcllo.so(+0xbea2e2)[0x45b052e2]
  168. /core/instdir/program/libvcllo.so(+0xbe9ab7)[0x45b04ab7]
  169. /core/instdir/program/libvcllo.so(+0xbefa98)[0x45b0aa98]
  170. /core/instdir/program/libvcllo.so(+0xbef3ce)[0x45b0a3ce]
  171. /core/instdir/program/libvcllo.so(+0xbe83ca)[0x45b033ca]
  172. /core/instdir/program/libvcllo.so(+0x9ba738)[0x458d5738]
  173. /core/instdir/program/libvcllo.so(+0x9bcf0b)[0x458d7f0b]
  174. /core/instdir/program/libvcllo.so(_Z10ImportJPEGR8SvStreamR7GraphicPv24GraphicFilterImportFlags+0x2c2)[0x458d34f2]
  175. /core/instdir/program/libvcllo.so(_ZN13GraphicFilter13ImportGraphicER7GraphicRKN3rtl8OUStringER8SvStreamtPt24GraphicFilterImportFlagsPN3com3sun4star3uno8SequenceINSC_5beans13PropertyValueEEEP18WMF_EXTERNALHEADER+0x143e)[0x45865aee]
  176. /core/instdir/program/libvcllo.so(_ZN13GraphicFilter13ImportGraphicER7GraphicRKN3rtl8OUStringER8SvStreamtPt24GraphicFilterImportFlagsP18WMF_EXTERNALHEADER+0xb8)[0x45864698]
  177. /core/workdir/LinkTarget/CppunitTest/libtest_vcl_filters_test.so(+0x34fc)[0x486914fc]
  178. /core/workdir/LinkTarget/CppunitTest/../Library/libunotest.so(_ZN4test11FiltersTest13recursiveScanENS_12filterStatusERKN3rtl8OUStringES5_S5_14SfxFilterFlags20SotClipboardFormatIdjb+0xd4e)[0x487afb0e]
  179. /core/workdir/LinkTarget/CppunitTest/../Library/libunotest.so(_ZN4test11FiltersTest7testDirERKN3rtl8OUStringES4_S4_14SfxFilterFlags20SotClipboardFormatIdjb+0x101)[0x487b0641]
  180. /core/workdir/LinkTarget/CppunitTest/libtest_vcl_filters_test.so(+0x54b4)[0x486934b4]
  181. /core/workdir/LinkTarget/CppunitTest/libtest_vcl_filters_test.so(+0xa859)[0x48698859]
  182. /core/workdir/UnpackedTarball/cppunit/src/cppunit/.libs/libcppunit-1.13.so.0(_ZNK7CppUnit21TestCaseMethodFunctorclEv+0x69)[0x40163479]
  183. /core/workdir/LinkTarget/Library/libvclbootstrapprotector.so(+0xb33)[0x40292b33]
  184. /core/workdir/UnpackedTarball/cppunit/src/cppunit/.libs/libcppunit-1.13.so.0(_ZNK7CppUnit14ProtectorChain14ProtectFunctorclEv+0x3b)[0x4015c3fb]
  185. /core/workdir/LinkTarget/Library/unobootstrapprotector.so(+0x1713)[0x40ea9713]
  186. /core/workdir/UnpackedTarball/cppunit/src/cppunit/.libs/libcppunit-1.13.so.0(_ZNK7CppUnit14ProtectorChain14ProtectFunctorclEv+0x3b)[0x4015c3fb]
  187. /core/workdir/LinkTarget/Library/unoexceptionprotector.so(+0x1392)[0x40a95392]
  188. /core/workdir/UnpackedTarball/cppunit/src/cppunit/.libs/libcppunit-1.13.so.0(_ZNK7CppUnit14ProtectorChain14ProtectFunctorclEv+0x3b)[0x4015c3fb]
  189. /core/workdir/UnpackedTarball/cppunit/src/cppunit/.libs/libcppunit-1.13.so.0(_ZN7CppUnit16DefaultProtector7protectERKNS_7FunctorERKNS_16ProtectorContextE+0x49)[0x4014e669]
  190. /core/workdir/UnpackedTarball/cppunit/src/cppunit/.libs/libcppunit-1.13.so.0(_ZNK7CppUnit14ProtectorChain14ProtectFunctorclEv+0x3b)[0x4015c3fb]
  191. /core/workdir/UnpackedTarball/cppunit/src/cppunit/.libs/libcppunit-1.13.so.0(_ZN7CppUnit14ProtectorChain7protectERKNS_7FunctorERKNS_16ProtectorContextE+0x205)[0x4015bbb5]
  192. /core/workdir/UnpackedTarball/cppunit/src/cppunit/.libs/libcppunit-1.13.so.0(_ZN7CppUnit10TestResult7protectERKNS_7FunctorEPNS_4TestERKNSt7__cxx1112basic_stringIcSt11char_traitsIcESaIcEEE+0x76)[0x401727d6]
  193. /core/workdir/UnpackedTarball/cppunit/src/cppunit/.libs/libcppunit-1.13.so.0(_ZN7CppUnit8TestCase3runEPNS_10TestResultE+0x23b)[0x40162b5b]
  194. /core/workdir/UnpackedTarball/cppunit/src/cppunit/.libs/libcppunit-1.13.so.0(_ZN7CppUnit13TestComposite15doRunChildTestsEPNS_10TestResultE+0x99)[0x40163c29]
  195. /core/workdir/UnpackedTarball/cppunit/src/cppunit/.libs/libcppunit-1.13.so.0(_ZN7CppUnit13TestComposite3runEPNS_10TestResultE+0x53)[0x40163a43]
  196. /core/workdir/UnpackedTarball/cppunit/src/cppunit/.libs/libcppunit-1.13.so.0(_ZN7CppUnit13TestComposite15doRunChildTestsEPNS_10TestResultE+0x99)[0x40163c29]
  197. /core/workdir/UnpackedTarball/cppunit/src/cppunit/.libs/libcppunit-1.13.so.0(_ZN7CppUnit13TestComposite3runEPNS_10TestResultE+0x53)[0x40163a43]
  198. /core/workdir/UnpackedTarball/cppunit/src/cppunit/.libs/libcppunit-1.13.so.0(_ZN7CppUnit10TestRunner13WrappingSuite3runEPNS_10TestResultE+0x69)[0x40178579]
  199. /core/workdir/UnpackedTarball/cppunit/src/cppunit/.libs/libcppunit-1.13.so.0(_ZN7CppUnit10TestResult7runTestEPNS_4TestE+0x51)[0x40172481]
  200. /core/workdir/UnpackedTarball/cppunit/src/cppunit/.libs/libcppunit-1.13.so.0(_ZN7CppUnit10TestRunner3runERNS_10TestResultERKNSt7__cxx1112basic_stringIcSt11char_traitsIcESaIcEEE+0x83)[0x40178873]
  201. /core/workdir/LinkTarget/Executable/cppunittester[0x804cfde]
  202. /core/workdir/LinkTarget/Executable/cppunittester[0x804c051]
  203. /core/workdir/LinkTarget/Executable/cppunittester[0x804b715]
  204. /lib/i386-linux-gnu/libc.so.6(__libc_start_main+0xf7)[0x40496637]
  205.  
  206. It looks like /core/workdir/LinkTarget/Executable/cppunittester generated a core file at /core/workdir/CppunitTest/vcl_filters_test.test.core/core
  207. Backtraces:
  208. [New LWP 27513]
  209. [New LWP 27514]
  210. [Thread debugging using libthread_db enabled]
  211. Using host libthread_db library "/lib/i386-linux-gnu/libthread_db.so.1".
  212. Core was generated by `/core/workdir/Link'.
  213. Program terminated with signal SIGABRT, Aborted.
  214. #0 0x40108c31 in __kernel_vsyscall ()
  215. [Current thread is 1 (Thread 0x40661480 (LWP 27513))]
  216. warning: File "/core/instdir/program/libuno_sal.so.3-gdb.py" auto-loading has been declined by your `auto-load safe-path' set to "$debugdir:$datadir/auto-load".
  217. To enable execution of this file add
  218. add-auto-load-safe-path /core/instdir/program/libuno_sal.so.3-gdb.py
  219. line to your configuration file "/home/luke/.gdbinit".
  220. To completely disable this security protection add
  221. set auto-load safe-path /
  222. line to your configuration file "/home/luke/.gdbinit".
  223. For more information about this security protection see the
  224. "Auto-loading safe path" section in the GDB manual. E.g., run from the shell:
  225. info "(gdb)Auto-loading safe path"
  226. warning: File "/core/instdir/program/libuno_cppu.so.3-gdb.py" auto-loading has been declined by your `auto-load safe-path' set to "$debugdir:$datadir/auto-load".
  227. warning: File "/core/instdir/program/libtllo.so-gdb.py" auto-loading has been declined by your `auto-load safe-path' set to "$debugdir:$datadir/auto-load".
  228. warning: File "/core/instdir/program/libvcllo.so-gdb.py" auto-loading has been declined by your `auto-load safe-path' set to "$debugdir:$datadir/auto-load".
  229. warning: File "/core/instdir/program/libbasegfxlo.so-gdb.py" auto-loading has been declined by your `auto-load safe-path' set to "$debugdir:$datadir/auto-load".
  230. warning: File "/core/instdir/program/libsvllo.so-gdb.py" auto-loading has been declined by your `auto-load safe-path' set to "$debugdir:$datadir/auto-load".
  231. eax 0x0 0
  232. ecx 0x6b79 27513
  233. edx 0x6 6
  234. ebx 0x6b79 27513
  235. esp 0xbfa9afc8 0xbfa9afc8
  236. ebp 0xbfa9b218 0xbfa9b218
  237. esi 0x6 6
  238. edi 0xbfa9b084 -1079398268
  239. eip 0x40108c31 0x40108c31 <__kernel_vsyscall+9>
  240. eflags 0x202 [ IF ]
  241. cs 0x73 115
  242. ss 0x7b 123
  243. ds 0x7b 123
  244. es 0x7b 123
  245. fs 0x0 0
  246. gs 0x33 51
  247.  
  248. Thread 2 (Thread 0x40873b40 (LWP 27514)):
  249. #0 0x40108c31 in __kernel_vsyscall ()
  250. No symbol table info available.
  251. #1 0x40645e36 in pthread_cond_timedwait@@GLIBC_2.3.2 () at ../sysdeps/unix/sysv/linux/i386/i686/../pthread_cond_timedwait.S:245
  252. No locals.
  253. #2 0x405716a1 in __pthread_cond_timedwait (cond=0x4026dd88 <g_cache_list+352>, mutex=0x4026dc28 <g_cache_list>, abstime=0x40873318) at forward.c:162
  254. __p = <optimized out>
  255. #3 0x401c67c9 in rtl_cache_wsupdate_wait (seconds=10) at /core/sal/rtl/alloc_cache.cxx:1336
  256. now = {tv_sec = 1492016946, tv_usec = 552953}
  257. wakeup = {tv_sec = 1492016956, tv_nsec = 552953000}
  258. #4 0x401c66bf in rtl_cache_wsupdate_all (arg=0xa) at /core/sal/rtl/alloc_cache.cxx:1487
  259. seconds = 10
  260. #5 0x40640295 in start_thread (arg=0x40873b40) at pthread_create.c:333
  261. __res = <optimized out>
  262. pd = 0x40873b40
  263. now = <optimized out>
  264. unwind_buf = {cancel_jmp_buf = {{jmp_buf = {1080377344, 0, 4001536, 1082602536, -1019189033, 86130390}, mask_was_saved = 0}}, priv = {pad = {0x0, 0x0, 0x0, 0x0}, data = {prev = 0x0, cleanup = 0x0, canceltype = 0}}}
  265. not_first_call = 0
  266. pagesize_m1 = <optimized out>
  267. sp = <optimized out>
  268. freesize = <optimized out>
  269. __PRETTY_FUNCTION__ = "start_thread"
  270. #6 0x40564eee in clone () at ../sysdeps/unix/sysv/linux/i386/clone.S:114
  271. No locals.
  272.  
  273. Thread 1 (Thread 0x40661480 (LWP 27513)):
  274. #0 0x40108c31 in __kernel_vsyscall ()
  275. No symbol table info available.
  276. #1 0x404a9ea9 in __GI_raise (sig=6) at ../sysdeps/unix/sysv/linux/raise.c:54
  277. resultvar = <optimized out>
  278. resultvar = <optimized out>
  279. pid = 27513
  280. selftid = 27513
  281. #2 0x404ab407 in __GI_abort () at abort.c:89
  282. save_stage = 2
  283. act = {__sigaction_handler = {sa_handler = 0xce18a471, sa_sigaction = 0xce18a471}, sa_mask = {__val = {289268996, 842414155, 1074702704, 1075499532, 5, 1074802792, 1076282148, 1074722722, 1074803232, 1080249824, 1, 5, 0, 1075574173, 0, 16781312, 1076281344, 4, 1074810880, 1075509916, 1076089657, 1076089657, 4, 1078477240, 3215569272, 1075573595, 1074722539, 1076281344, 6, 2529990400, 3215569432, 1074749200}}, sa_flags = 0, sa_restorer = 0x404ab2b0 <__GI_abort>}
  284. sigs = {__val = {32, 0 <repeats 31 times>}}
  285. #3 0x4022fad4 in (anonymous namespace)::callSystemHandler (signal=6, info=0xbfa9b34c, context=0xbfa9b3cc) at /core/sal/osl/unx/signal.cxx:377
  286. act = {__sigaction_handler = {sa_handler = 0x0, sa_sigaction = 0x0}, sa_mask = {__val = {0 <repeats 32 times>}}, sa_flags = 0, sa_restorer = 0x403b6e49}
  287. i = 5
  288. #4 0x4022f490 in (anonymous namespace)::signalHandlerFunction (signal=6, info=0xbfa9b34c, context=0xbfa9b3cc) at /core/sal/osl/unx/signal.cxx:489
  289. act = {__sigaction_handler = {sa_handler = 0x919221fd, sa_sigaction = 0x919221fd}, sa_mask = {__val = {1074701629, 5, 1, 1078336272, 83, 1078337520, 1074804992, 3215569652, 3215569648, 113, 0, 1074810880, 1076576295, 2442273277, 1078334738, 83, 1078337520, 1078336272, 76321039, 1074780520, 3215569792, 1074771999, 160077304, 3215569716, 3215569712, 113, 0, 0, 0, 1172201362, 1076482578, 1074699977}}, sa_flags = 0, sa_restorer = 0x40103530}
  290. Info = {Signal = osl_Signal_AccessViolation, UserSignal = 6, UserData = 0x0}
  291. #5 <signal handler called>
  292. No symbol table info available.
  293. #6 0x40108c31 in __kernel_vsyscall ()
  294. No symbol table info available.
  295. #7 0x404a9ea9 in __GI_raise (sig=6) at ../sysdeps/unix/sysv/linux/raise.c:54
  296. resultvar = <optimized out>
  297. resultvar = <optimized out>
  298. pid = 27513
  299. selftid = 27513
  300. #8 0x404ab407 in __GI_abort () at abort.c:89
  301. save_stage = 2
  302. act = {__sigaction_handler = {sa_handler = 0x4029dfec, sa_sigaction = 0x4029dfec}, sa_mask = {__val = {5, 1074803576, 1074702704, 1076482860, 5, 1074803576, 1077968924, 1074722722, 1074804016, 1080427088, 1, 5, 0, 1074738062, 1074810880, 1076568876, 1074737433, 1077968896, 1074810880, 1076568876, 3215571352, 1074738062, 1, 1078477240, 1080233464, 166234256, 1074722539, 1077968896, 1080233464, 166234256, 3215571352, 1074749200}}, sa_flags = 165950152, sa_restorer = 0x404ab2b0 <__GI_abort>}
  303. sigs = {__val = {32, 0 <repeats 31 times>}}
  304. #9 0x40307d35 in __gnu_cxx::__verbose_terminate_handler() () from /usr/lib/i386-linux-gnu/libstdc++.so.6
  305. No symbol table info available.
  306. #10 0x40305833 in ?? () from /usr/lib/i386-linux-gnu/libstdc++.so.6
  307. No symbol table info available.
  308. #11 0x403058ad in std::terminate() () from /usr/lib/i386-linux-gnu/libstdc++.so.6
  309. No symbol table info available.
  310. #12 0x40305b70 in __cxa_throw () from /usr/lib/i386-linux-gnu/libstdc++.so.6
  311. No symbol table info available.
  312. #13 0x458d4ea4 in errorExit (cinfo=0xbfa9beb0) at /core/vcl/source/filter/jpeg/jpegc.cxx:45
  313. buffer = "Quantization table 0x00 was not defined\000\016\225\261E\260\276\251\277S\v\000\000\230\273\251\277\273\221\261E\b\000\000\000\b\000\000\000\000\260\367E\b\000\000\000\b\000\000\000\000\260\367E\300\245\362\t\260\245\362\t\370\320\362\t@\v\000\000\001\000\000\000\260\276\251\277\001\000\000\000\000\260\367E軩\277\060\227\261E\260\276\251\277\001\000\000\000@\v\000\000\n\000\000\000 \001\000\000\020\000\000\000`\000\000\000\000\260\367E^\373\064\000\000\000\000\000\n\000\000\000\n\000\000\000\000\261\362\t0\205\362\t\370\320\362\t\n\000\000\000 \001\000\000\001\000\000\000\260\276\251\277"
  314. #14 0x45b052e2 in latch_quant_tables (cinfo=0xbfa9beb0) at jdinput.c:259
  315. ci = 0
  316. qtblno = 0
  317. compptr = 0x9f26620
  318. qtbl = 0x1
  319. #15 0x45b04ab7 in start_input_pass (cinfo=0xbfa9beb0) at jdinput.c:281
  320. No locals.
  321. #16 0x45b0aa98 in master_selection (cinfo=0xbfa9beb0) at jdmaster.c:575
  322. master = 0x9e64870
  323. use_c_buffer = 0
  324. samplesperrow = 2220
  325. jd_samplesperrow = 2220
  326. #17 0x45b0a3ce in jinit_master_decompress (cinfo=0xbfa9beb0) at jdmaster.c:735
  327. master = 0x9e64870
  328. #18 0x45b033ca in jpeg_start_decompress (cinfo=0xbfa9beb0) at jdapistd.c:47
  329. No locals.
  330. #19 0x458d5738 in ReadJPEG (pJPEGReader=0x9e5e03c, pInputStream=0xbfa9ca30, pLines=0xbfa9c124, previewSize=...) at /core/vcl/source/filter/jpeg/jpegc.cxx:206
  331. best_out_color_space = JCS_EXT_BGRA
  332. eScanlineFormat = ScanlineFormat::N32BitTcBgra
  333. eFinalFormat = ScanlineFormat::N32BitTcBgra
  334. aRangeLimit = 0x45c5b16f "SVIJPEG"
  335. pScanLineBuffer = std::vector of length -1245451788, capacity 0 = {104 'h', 64 '@', 247 '\367', 69 'E', 232 '\350', 37 '%', 69 'E', 74 'J', 0 '\000', 0 '\000', 0 '\000', 0 '\000', 48 '0', 202 '\312', 169 '\251', 191 '\277', 0 '\000', 220 '\334', 246 '\366', 69 'E', 120 'x', 28 '\034', 232 '\350', 9 '\t', 104 'h', 77 'M', 228 '\344', 9 '\t', 32 ' ', 158 '\236', 139 '\213', 9 '\t', 0 '\000', 0 '\000', 0 '\000', 0 '\000', 0 '\000', 0 '\000', 0 '\000', 0 '\000', 0 '\000', 220 '\334', 246 '\366', 69 'E', 0 '\000', 0 '\000', 0 '\000', 0 '\000', 0 '\000', 0 '\000', 0 '\000', 0 '\000', 32 ' ', 158 '\236', 139 '\213', 9 '\t', 0 '\000', 0 '\000', 0 '\000', 0 '\000', 0 '\000', 0 '\000', 0 '\000', 0 '\000', 0 '\000', 0 '\000', 0 '\000', 0 '\000', 0 '\000', 0 '\000', 0 '\000', 0 '\000', 1 '\001', 102 'f', 102 'f', 102 'f', 185 '\271', 0 '\000', 0 '\000', 3 '\003', 33 '!', 3 '\003', 0 '\000', 0 '\000', 8 '\b', 0 '\000', 0 '\000', 0 '\000', 0 '\000', 0 '\000', 0 '\000', 0 '\000', 57 '9', 0 '\000', 0 '\000', 0 '\000', 0 '\000', 0 '\000', 0 '\000', 0 '\000', 255 '\377', 255 '\377', 0 '\000', 0 '\000', 248 '\370', 93 ']', 232 '\350', 9 '\t', 16 '\020', 201 '\311', 231 '\347', 9 '\t', 0 '\000', 0 '\000', 0 '\000', 0 '\000', 0 '\000', 0 '\000', 0 '\000', 0 '\000', 6 '\006', 0 '\000', 0 '\000', 0 '\000', 8 '\b', 203 '\313', 221 '\335', 9 '\t', 0 '\000', 0 '\000', 0 '\000', 0 '\000', 0 '\000', 0 '\000', 0 '\000', 0 '\000', 11 '\v', 252 '\374', 255 '\377', 255 '\377', 234 '\352', 251 '\373', 255 '\377', 255 '\377', 110 'n', 11 '\v', 0 '\000', 0 '\000', 14 '\016', 7 '\a', 0 '\000', 0 '\000', 232 '\350', 3 '\003', 136 '\210', 4 '\004', 192 '\300', 254 '\376', 200 '\310', 5 '\005', 184 '\270', 11 '\v', 184 '\270', 11 '\v', 106 'j', 255 '\377', 50 '2', 0 '\000', 208 '\320', 55 '7', 232 '\350', 9 '\t', 72 'H', 51 '3', 228 '\344', 9 '\t', 40 '(', 201 '\311', 221 '\335', 9 '\t', 232 '\350', 196 '\304', 223 '\337', 9 '\t', 120 'x', 195 '\303', 223 '\337', 9 '\t', 176 '\260', 163 '\243', 232 '\350', 9 '\t', 48 '0', 51 '3', 228 '\344', 9 '\t', 24 '\030', 224 '\340', 229 '\345', 9 '\t'...}
  336. nPixelSize = 4
  337. pCYMKBuffer = std::vector of length -1173860336, capacity -1008201912 = {160 '\240', 240 '\360', 5 '\005', 1 '\001', 32 ' ', 131 '\203', 135 '\207', 9 '\t', 0 '\000', 95 '_', 15 '\017', 64 '@', 198 '\306', 240 '\360', 9 '\t', 69 'E', 214 '\326', 240 '\360', 9 '\t', 69 'E', 240 '\360', 85 'U', 152 '\230', 70 'F', 246 '\366', 240 '\360', 9 '\t', 69 'E', 6 '\006', 241 '\361', 9 '\t', 69 'E', 22 '\026', 241 '\361', 9 '\t', 69 'E', 160 '\240', 249 '\371', 32 ' ', 64 '@', 54 '6', 241 '\361', 9 '\t', 69 'E', 70 'F', 241 '\361', 9 '\t', 69 'E', 86 'V', 241 '\361', 9 '\t', 69 'E', 102 'f', 241 '\361', 9 '\t', 69 'E', 118 'v', 241 '\361', 9 '\t', 69 'E', 134 '\206', 241 '\361', 9 '\t', 69 'E', 150 '\226', 241 '\361', 9 '\t', 69 'E', 166 '\246', 241 '\361', 9 '\t', 69 'E', 182 '\266', 241 '\361', 9 '\t', 69 'E', 198 '\306', 241 '\361', 9 '\t', 69 'E', 208 '\320', 196 '\304', 250 '\372', 69 'E', 32 ' ', 63 '?', 199 '\307', 68 'D', 246 '\366', 241 '\361', 9 '\t', 69 'E', 6 '\006', 242 '\362', 9 '\t', 69 'E', 22 '\026', 242 '\362', 9 '\t', 69 'E', 38 '&', 242 '\362', 9 '\t', 69 'E', 54 '6', 242 '\362', 9 '\t', 69 'E', 240 '\360', 71 'G', 57 '9', 64 '@', 112 'p', 192 '\300', 225 '\341', 68 'D', 102 'f', 242 '\362', 9 '\t', 69 'E', 118 'v', 242 '\362', 9 '\t', 69 'E', 134 '\206', 242 '\362', 9 '\t', 69 'E', 0 '\000', 137 '\211', 193 '\301', 68 'D', 166 '\246', 242 '\362', 9 '\t', 69 'E', 64 '@', 210 '\322', 111 'o', 70 'F', 32 ' ', 186 '\272', 30 '\036', 64 '@', 214 '\326', 242 '\362', 9 '\t', 69 'E', 240 '\360', 53 '5', 57 '9', 64 '@', 160 '\240', 173 '\255', 31 '\037', 64 '@', 6 '\006', 243 '\363', 9 '\t', 69 'E', 22 '\026', 243 '\363', 9 '\t', 69 'E', 38 '&', 243 '\363', 9 '\t', 69 'E', 64 '@', 29 '\035', 84 'T', 65 'A', 70 'F', 243 '\363', 9 '\t', 69 'E', 86 'V', 243 '\363', 9 '\t', 69 'E', 102 'f', 243 '\363', 9 '\t', 69 'E', 64 '@', 98 'b', 48 '0', 64 '@', 134 '\206', 243 '\363', 9 '\t', 69 'E', 192 '\300', 52 '4', 7 '\a', 65 'A', 160 '\240', 223 '\337', 45 '-', 65 'A'...}
  338. pAccess = {mpAccess = 0x9e9b6c0, mpBitmap = 0x9e5e04c}
  339. source = 0x9e648e8
  340. aCreateBitmapParam = {nWidth = 555, nHeight = 857, density_unit = 0, X_density = 100, Y_density = 100, bGray = false}
  341. bBitmapCreated = true
  342. aOwner = {m_cinfo = @0xbfa9beb0}
  343. nPreviewHeight = 0
  344. nWidth = 555
  345. nHeight = 857
  346. cinfo = {err = 0xbfa9be28, mem = 0x9f2d0f8, progress = 0x0, client_data = 0xbfa9ca30, is_decompressor = 1, global_state = 202, src = 0x9e648e8, image_width = 555, image_height = 857, num_components = 3, jpeg_color_space = JCS_YCbCr, out_color_space = JCS_EXT_BGRA, scale_num = 1, scale_denom = 1, output_gamma = 1, buffered_image = 0, raw_data_out = 0, dct_method = JDCT_ISLOW, do_fancy_upsampling = 1, do_block_smoothing = 1, quantize_colors = 0, dither_mode = JDITHER_FS, two_pass_quantize = 1, desired_number_of_colors = 256, enable_1pass_quant = 0, enable_external_quant = 0, enable_2pass_quant = 0, output_width = 555, output_height = 857, out_color_components = 4, output_components = 4, rec_outbuf_height = 1, actual_number_of_colors = 0, colormap = 0x0, output_scanline = 0, input_scan_number = 1, input_iMCU_row = 0, output_scan_number = 0, output_iMCU_row = 0, coef_bits = 0x0, quant_tbl_ptrs = {0x0, 0x0, 0x0, 0x0}, dc_huff_tbl_ptrs = {0x9e64918, 0x9e64a30, 0x0, 0x0}, ac_huff_tbl_ptrs = {0x9e64b48, 0x9e64c60, 0x0, 0x0}, data_precision = 8, comp_info = 0x9f26620, is_baseline = 0, progressive_mode = 0, arith_code = 0, arith_dc_L = '\000' <repeats 15 times>, arith_dc_U = '\001' <repeats 16 times>, arith_ac_K = '\005' <repeats 16 times>, restart_interval = 0, saw_JFIF_marker = 1, JFIF_major_version = 1 '\001', JFIF_minor_version = 2 '\002', density_unit = 0 '\000', X_density = 100, Y_density = 100, saw_Adobe_marker = 1, Adobe_transform = 1 '\001', CCIR601_sampling = 0, marker_list = 0x0, max_h_samp_factor = 2, max_v_samp_factor = 2, min_DCT_h_scaled_size = 8, min_DCT_v_scaled_size = 8, total_iMCU_rows = 54, sample_range_limit = 0x9f26828 "", comps_in_scan = 3, cur_comp_info = {0x9f26620, 0x9f26678, 0x9f266d0, 0x0}, MCUs_per_row = 35, MCU_rows_in_scan = 54, blocks_in_MCU = 6, MCU_membership = {0, 0, 0, 0, 1, 2, 0, 0, 0, 0}, Ss = 0, Se = 63, Ah = 0, Al = 0, block_size = 8, natural_order = 0x45c80eb0 <jpeg_natural_order>, lim_Se = 63, unread_marker = 0, master = 0x9e64870, main = 0x9f282d0, coef = 0x9f281d8, post = 0x9f27d78, inputctl = 0x9e64850, marker = 0x9e647a0, entropy = 0x9f280f0, idct = 0x9f27d98, upsample = 0x9f27cc8, cconvert = 0x9f26ca8, cquantize = 0x0}
  347. jerr = {error_exit = 0x458d4c50 <errorExit(j_common_ptr)>, emit_message = 0x45b14d50 <emit_message>, output_message = 0x458d4f50 <outputMessage(j_common_ptr)>, format_message = 0x45b14e70 <format_message>, reset_error_mgr = 0x45b15060 <reset_error_mgr>, msg_code = 54, msg_parm = {i = {0, 63, 0, 0, 1, 0, 0, 0}, s = "\000\000\000\000?", '\000' <repeats 11 times>, "\001", '\000' <repeats 15 times>, "\307\301\251\277\344\301\251\277\060ʩ\277<\340\345\t\200\277\251\277\000\260\367E\307\301\251\277\344\301\251\277\060ʩ\277<\340\345\t\200\277\251\277<\340\345\t"}, trace_level = 0, num_warnings = 1, jpeg_message_table = 0x45f78b3c <jpeg_std_message_table>, last_jpeg_message = 126, addon_message_table = 0x0, first_addon_message = 0, last_addon_message = 0}
  348. nPreviewWidth = 0
  349. bGray = false
  350. #20 0x458d7f0b in JPEGReader::Read (this=0x9e5e03c, rGraphic=...) at /core/vcl/source/filter/jpeg/JpegReader.cxx:282
  351. eReadState = (JPEGREAD_ERROR | JPEGREAD_NEED_MORE | unknown: 1163799544)
  352. bRet = false
  353. nLines = 166060092
  354. #21 0x458d34f2 in ImportJPEG (rInputStream=..., rGraphic=..., pCallerData=0x0, nImportFlags=GraphicFilterImportFlags::SetLogsizeForJpeg) at /core/vcl/source/filter/jpeg/jpeg.cxx:50
  355. bReturn = true
  356. pContext = warning: RTTI symbol not found for class 'std::_Sp_counted_ptr_inplace<JPEGReader, std::allocator<JPEGReader>, (__gnu_cxx::_Lock_policy)2>'
  357. warning: RTTI symbol not found for class 'std::_Sp_counted_ptr_inplace<JPEGReader, std::allocator<JPEGReader>, (__gnu_cxx::_Lock_policy)2>'
  358. std::shared_ptr (count 1, weak 0) 0x9e5e03c
  359. pJPEGReader = 0x9e5e03c
  360. eReadState = (unknown: 3215573472)
  361. #22 0x45865aee in GraphicFilter::ImportGraphic (this=0x98b98e8, rGraphic=..., rPath=..., rIStream=..., nFormat=4, pDeterminedFormat=0x0, nImportFlags=GraphicFilterImportFlags::SetLogsizeForJpeg, pFilterData=0x0, pExtHeader=0x0) at /core/vcl/source/filter/graphicfilter.cxx:1495
  362. aFilterName = {pData = 0x486e97b0}
  363. aExternalFilterName = {pData = 0x40247ea0 <aImplEmpty_rtl_uString>}
  364. nStreamBegin = 0
  365. nStatus = 0
  366. pContext = std::shared_ptr (empty) 0x0
  367. eLinkType = GfxLinkType::NONE
  368. bDummyContext = false
  369. bLinkSet = false
  370. pFilterConfigItem = std::unique_ptr<FilterConfigItem> containing 0x0
  371. aPreviewSizeHint = {<Pair> = {nA = 0, nB = 0}, <No data fields>}
  372. bAllowPartialStreamRead = false
  373. bCreateNativeLink = true
  374. pGraphicContent = std::unique_ptr<unsigned char> containing 0x0
  375. nGraphicContentSize = 0
  376. #23 0x45864698 in GraphicFilter::ImportGraphic (this=0x98b98e8, rGraphic=..., rPath=..., rIStream=..., nFormat=65535, pDeterminedFormat=0x0, nImportFlags=GraphicFilterImportFlags::NONE, pExtHeader=0x0) at /core/vcl/source/filter/graphicfilter.cxx:1315
  377. No locals.
  378. #24 0x486914fc in VclFiltersTest::load (this=0x98b98c0, rURL=...) at /core/vcl/qa/cppunit/graphicfilter/filters-test.cxx:60
  379. aFileStream = {<SvStream> = {_vptr$SvStream = 0x44cb7df8 <vtable for SvFileStream+8>, m_xLockBytes = {pObj = 0x0}, m_nActPos = 0, m_pRWBuf = 0x9ddc260 "\377\330\377", <incomplete sequence \340>, m_pBufPos = 0x9ddc260 "\377\330\377", <incomplete sequence \340>, m_nBufSize = 1024, m_nBufActualLen = 0, m_nBufActualPos = 0, m_nBufFree = 0, m_isIoRead = false, m_isIoWrite = false, m_isDirty = false, m_isConsistent = true, m_isSwap = false, m_isEof = false, m_nError = 0, m_nEndian = SvStreamEndian::LITTLE, m_nCompressMode = SvStreamCompressFlags::NONE, m_eLineDelimiter = LINEEND_LF, m_eStreamCharSet = 76, m_aCryptMaskKey = {pData = 0x4024428c <aImplEmpty_rtl_String>}, m_nCryptMask = 0 '\000', m_nVersion = 0, m_nBufFilePos = 4096, m_eStreamMode = StreamMode::READ, m_isWritable = false}, pInstanceData = 0x9899330, aFilename = {pData = 0x4a451bd0}, nLockCounter = 0, bIsOpen = true}
  380. aGraphic = {mxImpGraphic = warning: RTTI symbol not found for class 'std::_Sp_counted_ptr<ImpGraphic*, (__gnu_cxx::_Lock_policy)2>'
  381. warning: RTTI symbol not found for class 'std::_Sp_counted_ptr<ImpGraphic*, (__gnu_cxx::_Lock_policy)2>'
  382. std::shared_ptr (count 1, weak 0) 0x9e9e7d0}
  383. #25 0x487afb0e in test::FiltersTest::recursiveScan (this=0x98b98c0, nExpected=test::pass, rFilter=..., rURL=..., rUserData=..., nFilterFlags=SfxFilterFlags::IMPORT, nClipboardID=SotClipboardFormatId::NONE, nFilterVersion=0, bExport=false) at /core/unotest/source/cpp/filters-test.cxx:130
  384. sTmpFile = {pData = 0x4a07bda8}
  385. bEncrypted = true
  386. realUrl = {pData = 0x4a07bda8}
  387. bRes = false
  388. nEndTime = 1219
  389. nResult = test::fail
  390. nLastSlash = 116
  391. aRes = {pData = 0x4630af50}
  392. nStartTime = 1219
  393. sURL = @0x9e9f438: {pData = 0x486e3a34}
  394. __range = std::set with 9 elements = {[0] = {pData = 0x4a4505ac}, [1] = {pData = 0x486e3a34}, [2] = {pData = 0x486e38f4}, [3] = {pData = 0x486e3cb4}, [4] = {pData = 0x46315038}, [5] = {pData = 0x4a45096c}, [6] = {pData = 0x4a450e6c}, [7] = {pData = 0x486e3b74}, [8] = {pData = 0x4a45082c}}
  395. __begin = {pData = }
  396. __end = {pData = }
  397. aDir = {<osl::FileBase> = {<No data fields>}, _pData = 0x4066cb18, _aPath = {pData = 0x4872f828}}
  398. aItem = {<osl::FileBase> = {<No data fields>}, _pData = 0x0}
  399. aFileStatus = {_aStatus = {uStructSize = 64, uValidFields = 513, eType = osl_File_Type_Regular, uAttributes = 0, aCreationTime = {Seconds = 0, Nanosec = 0}, aAccessTime = {Seconds = 0, Nanosec = 0}, aModifyTime = {Seconds = 0, Nanosec = 0}, uFileSize = 0, ustrFileName = 0x0, ustrFileURL = 0x4a4505ac, ustrLinkTargetURL = 0x0}, _nMask = 513}
  400. dirs = std::set with 0 elements
  401. files = std::set with 9 elements = {[0] = {pData = 0x4a4505ac}, [1] = {pData = 0x486e3a34}, [2] = {pData = 0x486e38f4}, [3] = {pData = 0x486e3cb4}, [4] = {pData = 0x46315038}, [5] = {pData = 0x4a45096c}, [6] = {pData = 0x4a450e6c}, [7] = {pData = 0x486e3b74}, [8] = {pData = 0x4a45082c}}
  402. #26 0x487b0641 in test::FiltersTest::testDir (this=0x98b98c0, rFilter=..., rURL=..., rUserData=..., nFilterFlags=SfxFilterFlags::IMPORT, nClipboardID=SotClipboardFormatId::NONE, nFilterVersion=0, bExport=false) at /core/unotest/source/cpp/filters-test.cxx:155
  403. No locals.
  404. #27 0x486934b4 in VclFiltersTest::testCVEs (this=0x98b98c0) at /core/vcl/qa/cppunit/graphicfilter/filters-test.cxx:137
  405. No locals.
  406. #28 0x48698859 in CppUnit::TestCaller<VclFiltersTest>::runTest (this=0x98b9860) at /core/workdir/UnpackedTarball/cppunit/include/cppunit/TestCaller.h:166
  407. No locals.
  408. #29 0x40163479 in CppUnit::TestCaseMethodFunctor::operator() (this=0xbfa9d770) at TestCase.cpp:32
  409. No locals.
  410. #30 0x40292b33 in (anonymous namespace)::Protector::protect (this=0x988e470, functor=...) at /core/test/source/vclbootstrapprotector.cxx:39
  411. No locals.
  412. #31 0x4015c3fb in CppUnit::ProtectorChain::ProtectFunctor::operator() (this=0x98b9c60) at ProtectorChain.cpp:20
  413. No locals.
  414. #32 0x40ea9713 in (anonymous namespace)::Prot::protect (this=0x985e928, functor=...) at /core/unotest/source/cpp/unobootstrapprotector/unobootstrapprotector.cxx:89
  415. No locals.
  416. #33 0x4015c3fb in CppUnit::ProtectorChain::ProtectFunctor::operator() (this=0x98ba4f0) at ProtectorChain.cpp:20
  417. No locals.
  418. #34 0x40a95392 in (anonymous namespace)::Prot::protect (this=0x985b800, functor=..., context=...) at /core/unotest/source/cpp/unoexceptionprotector/unoexceptionprotector.cxx:63
  419. e = @0x4010e50c: {Message = {pData = 0xef1be723}, Context = {<com::sun::star::uno::BaseReference> = {_pInterface = 0xeb2e341f}, <No data fields>}}
  420. #35 0x4015c3fb in CppUnit::ProtectorChain::ProtectFunctor::operator() (this=0x98b9bb0) at ProtectorChain.cpp:20
  421. No locals.
  422. #36 0x4014e669 in CppUnit::DefaultProtector::protect (this=0x985b6f0, functor=..., context=...) at DefaultProtector.cpp:15
  423. failure = @0x4015e180: {<std::exception> = {<No data fields>}, m_message = {m_shortDescription = <incomplete type>, m_details = std::deque with -7353836932 elements = {<error reading variable>, m_sourceLine = {_vptr$SourceLine = 0x8b0c4d8b, m_fileName = <incomplete type>, m_lineNumber = -1014431744}, m_whatMessage = <incomplete type>}
  424. e = @0x4015de00: <incomplete type>
  425. #37 0x4015c3fb in CppUnit::ProtectorChain::ProtectFunctor::operator() (this=0x98b9bc8) at ProtectorChain.cpp:20
  426. No locals.
  427. #38 0x4015bbb5 in CppUnit::ProtectorChain::protect (this=0x985b488, functor=..., context=...) at ProtectorChain.cpp:77
  428. functors = std::deque with 4 elements = {0x98b9c60, 0x98ba4f0, 0x98b9bb0, 0x98b9bc8}
  429. outermostFunctor = @0x98b9bc8: {_vptr$Functor = 0x401a848c <vtable for CppUnit::ProtectorChain::ProtectFunctor+8>}
  430. succeed = 64Python Exception <class 'gdb.error'> There is no member named _M_dataplus.:
  431.  
  432. #39 0x401727d6 in CppUnit::TestResult::protect (this=0xbfa9dd28, functor=..., test=0x98b9860, shortDescription=) at TestResult.cpp:181
  433. context = {m_test = 0x98b9860, m_result = 0xbfa9dd28, m_shortDescription = <incomplete type>}
  434. #40 0x40162b5b in CppUnit::TestCase::run (this=0x98b9860, result=0xbfa9dd28) at TestCase.cpp:91
  435. No locals.
  436. #41 0x40163c29 in CppUnit::TestComposite::doRunChildTests (this=0x98b9830, controller=0xbfa9dd28) at TestComposite.cpp:64
  437. index = 0
  438. childCount = 3
  439. #42 0x40163a43 in CppUnit::TestComposite::run (this=0x98b9830, result=0xbfa9dd28) at TestComposite.cpp:23
  440. No locals.
  441. #43 0x40163c29 in CppUnit::TestComposite::doRunChildTests (this=0x98b9800, controller=0xbfa9dd28) at TestComposite.cpp:64
  442. index = 0
  443. childCount = 1
  444. #44 0x40163a43 in CppUnit::TestComposite::run (this=0x98b9800, result=0xbfa9dd28) at TestComposite.cpp:23
  445. No locals.
  446. #45 0x40178579 in CppUnit::TestRunner::WrappingSuite::run (this=0x98b3200, result=0xbfa9dd28) at TestRunner.cpp:47
  447. No locals.
  448. #46 0x40172481 in CppUnit::TestResult::runTest (this=0xbfa9dd28, test=0x98b3200) at TestResult.cpp:148
  449. Python Exception <class 'gdb.error'> There is no member named _M_dataplus.:
  450. No locals.
  451. #47 0x40178873 in CppUnit::TestRunner::run (this=0xbfa9da78, controller=..., testPath=) at TestRunner.cpp:96
  452. path = {_vptr$TestPath = 0x401a8820 <vtable for CppUnit::TestPath+8>, m_tests = std::deque with 1 elements = {0x98b3200}}
  453. testToRun = 0x98b3200
  454. #48 0x0804cfde in (anonymous namespace)::ProtectedFixtureFunctor::run (this=0xbfa9dcc8) at /core/sal/cppunittester/cppunittester.cxx:305
  455. collector = {<CppUnit::TestSuccessListener> = {<CppUnit::TestListener> = {_vptr$TestListener = 0x401a8950 <vtable for CppUnit::TestResultCollector+8>}, <CppUnit::SynchronizedObject> = {_vptr$SynchronizedObject = 0x401a899c <vtable for CppUnit::TestResultCollector+84>, m_syncObject = 0x98985f8}, m_success = true}, m_tests = std::deque with 1 elements = {0x98b9860}, m_failures = std::deque with 0 elements, m_testErrors = 0}
  456. logger = {<CppUnit::TestListener> = {_vptr$TestListener = 0x8061c8c <vtable for (anonymous namespace)::LogFailuresAsTheyHappen+8>}, <No data fields>}
  457. timer = {<CppUnit::TestListener> = {_vptr$TestListener = 0x8061cc4 <vtable for (anonymous namespace)::TimingListener+8>}, m_nStartTime = 683}
  458. eye = {<CppUnit::TestListener> = {_vptr$TestListener = 0x8061cfc <vtable for (anonymous namespace)::EyecatcherListener+8>}, <No data fields>}
  459. lib = <incomplete type>
  460. runner = {_vptr$TestRunner = 0x401a8a0c <vtable for CppUnit::TestRunner+8>, m_suite = 0x98b3200}
  461. pVal = 0x0
  462. outputter = {<CppUnit::Outputter> = {_vptr$Outputter = 0xbfa9dc00}, m_result = 0x4630001c, m_stream = @0x0, m_locationFormat = <incomplete type>, m_wrapColumn = 134619136}
  463. manager = {_vptr$PlugInManager = 0x401a83f8 <vtable for CppUnit::PlugInManager+8>, m_plugIns = std::deque with 1 elements = {{m_fileName = <incomplete type>, m_manager = 0x98b4f80, m_interface = 0x4869d18c <cppunitTestPlugIn::plugIn>}}}
  464. e = @0x2: <error reading variable>
  465. success = 8
  466. #49 0x0804c051 in sal_main () at /core/sal/cppunittester/cppunittester.cxx:455
  467. testlib = <incomplete type>Python Exception <class 'gdb.error'> There is no member named _M_dataplus.:
  468. Python Exception <class 'gdb.error'> There is no member named _M_dataplus.:
  469.  
  470. tests = {<CppUnit::Functor> = {_vptr$Functor = 0x8061c68 <vtable for (anonymous namespace)::ProtectedFixtureFunctor+8>}, testlib = , args = , protectors = std::vector of length 3, capacity 4 = {0x985b800, 0x985e928, 0x988e470}, result = @0xbfa9dd28}
  471. protectors = std::vector of length 3, capacity 4 = {0x985b800, 0x985e928, 0x988e470}
  472. result = {<CppUnit::SynchronizedObject> = {_vptr$SynchronizedObject = 0x401a88d8 <vtable for CppUnit::TestResult+8>, m_syncObject = 0x985aaa8}, m_listeners = std::deque with 4 elements = {0xbfa9daa0, 0xbfa9da98, 0xbfa9da90, 0xbfa9da88}, m_protectorChain = 0x985b488, m_stop = false}
  473. args = <incomplete type>
  474. index = 21
  475. ok = false
  476. path = {pData = 0x4630001c}
  477. e = @0x4026c000: <incomplete type>
  478. #50 0x0804b715 in main (argc=22, argv=0xbfa9df64) at /core/sal/cppunittester/cppunittester.cxx:362
  479. ret = 134514332
  480.  
  481.  
  482. Error: a unit test failed, please do one of:
  483. make CppunitTest_vcl_filters_test CPPUNITTRACE="gdb --args"
  484. # for interactive debugging on Linux
  485. make CppunitTest_vcl_filters_test VALGRIND=memcheck
  486. # for memory checking
  487. make CppunitTest_vcl_filters_test DEBUGCPPUNIT=TRUE
  488. # for exception catching
  489.  
  490. /core/solenv/gbuild/CppunitTest.mk:109: recipe for target '/core/workdir/CppunitTest/vcl_filters_test.test' failed
  491. make[1]: *** [/core/workdir/CppunitTest/vcl_filters_test.test] Error 1
  492. Makefile:161: recipe for target 'CppunitTest_vcl_filters_test' failed
  493. make: *** [CppunitTest_vcl_filters_test] Error 2
RAW Paste Data