kscottz

Untitled

Aug 15th, 2011
715
Never
Not a member of Pastebin yet? Sign Up, it unlocks many cool features!
  1. Scanning dependencies of target ecto
  2. [  1%] Building CXX object src/lib/CMakeFiles/ecto.dir/abi.cpp.o
  3. i686-apple-darwin10-g++-4.2.1: --no-undefined: linker input file unused because linking not done
  4. [  2%] Building CXX object src/lib/CMakeFiles/ecto.dir/tendril.cpp.o
  5. i686-apple-darwin10-g++-4.2.1: --no-undefined: linker input file unused because linking not done
  6. [  4%] Building CXX object src/lib/CMakeFiles/ecto.dir/tendrils.cpp.o
  7. i686-apple-darwin10-g++-4.2.1: --no-undefined: linker input file unused because linking not done
  8. [  5%] Building CXX object src/lib/CMakeFiles/ecto.dir/cell.cpp.o
  9. i686-apple-darwin10-g++-4.2.1: --no-undefined: linker input file unused because linking not done
  10. [  7%] Building CXX object src/lib/CMakeFiles/ecto.dir/plasm.cpp.o
  11. i686-apple-darwin10-g++-4.2.1: --no-undefined: linker input file unused because linking not done
  12. [  8%] Building CXX object src/lib/CMakeFiles/ecto.dir/plasm/impl.cpp.o
  13. i686-apple-darwin10-g++-4.2.1: --no-undefined: linker input file unused because linking not done
  14. [ 10%] Building CXX object src/lib/CMakeFiles/ecto.dir/util.cpp.o
  15. i686-apple-darwin10-g++-4.2.1: --no-undefined: linker input file unused because linking not done
  16. [ 11%] Building CXX object src/lib/CMakeFiles/ecto.dir/log.cpp.o
  17. i686-apple-darwin10-g++-4.2.1: --no-undefined: linker input file unused because linking not done
  18. [ 12%] Building CXX object src/lib/CMakeFiles/ecto.dir/except.cpp.o
  19. i686-apple-darwin10-g++-4.2.1: --no-undefined: linker input file unused because linking not done
  20. [ 14%] Building CXX object src/lib/CMakeFiles/ecto.dir/needs_gil.cpp.o
  21. i686-apple-darwin10-g++-4.2.1: --no-undefined: linker input file unused because linking not done
  22. [ 15%] Building CXX object src/lib/CMakeFiles/ecto.dir/profile.cpp.o
  23. i686-apple-darwin10-g++-4.2.1: --no-undefined: linker input file unused because linking not done
  24. [ 17%] Building CXX object src/lib/CMakeFiles/ecto.dir/registry.cpp.o
  25. i686-apple-darwin10-g++-4.2.1: --no-undefined: linker input file unused because linking not done
  26. [ 18%] Building CXX object src/lib/CMakeFiles/ecto.dir/schedulers/invoke.cpp.o
  27. i686-apple-darwin10-g++-4.2.1: --no-undefined: linker input file unused because linking not done
  28. [ 20%] Building CXX object src/lib/CMakeFiles/ecto.dir/schedulers/singlethreaded.cpp.o
  29. i686-apple-darwin10-g++-4.2.1: --no-undefined: linker input file unused because linking not done
  30. [ 21%] Building CXX object src/lib/CMakeFiles/ecto.dir/schedulers/threadpool.cpp.o
  31. i686-apple-darwin10-g++-4.2.1: --no-undefined: linker input file unused because linking not done
  32. Linking CXX shared library ../../lib/libecto.dylib
  33. [ 21%] Built target ecto
  34. Scanning dependencies of target ecto_ectomodule
  35. [ 22%] Building CXX object src/pybindings/CMakeFiles/ecto_ectomodule.dir/ecto.cpp.o
  36. i686-apple-darwin10-g++-4.2.1: --no-undefined: linker input file unused because linking not done
  37. [ 24%] Building CXX object src/pybindings/CMakeFiles/ecto_ectomodule.dir/except.cpp.o
  38. i686-apple-darwin10-g++-4.2.1: --no-undefined: linker input file unused because linking not done
  39. [ 25%] Building CXX object src/pybindings/CMakeFiles/ecto_ectomodule.dir/plasm.cpp.o
  40. i686-apple-darwin10-g++-4.2.1: --no-undefined: linker input file unused because linking not done
  41. [ 27%] Building CXX object src/pybindings/CMakeFiles/ecto_ectomodule.dir/tendril.cpp.o
  42. i686-apple-darwin10-g++-4.2.1: --no-undefined: linker input file unused because linking not done
  43. [ 28%] Building CXX object src/pybindings/CMakeFiles/ecto_ectomodule.dir/tendrils.cpp.o
  44. /usr/local/include/boost/noncopyable.hpp: In copy constructor ‘ecto::tendrils::tendrils(const ecto::tendrils&):
  45. /Users/katherinescott/ecto/include/ecto/tendrils.hpp:46:   instantiated from ‘static boost::python::api::object boost::python::std_map_indexing_suite<Container, NoProxy, DerivedPolicies>::dict_fromkeys(const boost::python::api::object&, const boost::python::api::object&) [with Container = ecto::tendrils, bool NoProxy = false, DerivedPolicies = boost::python::detail::final_std_map_derived_policies<ecto::tendrils, false>]
  46. /Users/katherinescott/ecto/include/ecto/python/std_map_indexing_suite.hpp:428:   instantiated from ‘static void boost::python::std_map_indexing_suite<Container, NoProxy, DerivedPolicies>::extension_def(Class&) [with Class = boost::python::class_<ecto::tendrils, boost::shared_ptr<ecto::tendrils>, boost::noncopyable_::noncopyable, boost::python::detail::not_specified>, Container = ecto::tendrils, bool NoProxy = false, DerivedPolicies = boost::python::detail::final_std_map_derived_policies<ecto::tendrils, false>]
  47. /usr/local/include/boost/python/suite/indexing/indexing_suite.hpp:193:   instantiated from ‘void boost::python::indexing_suite<Container, DerivedPolicies, NoProxy, NoSlice, Data, Index, Key>::visit(Class&) const [with Class = boost::python::class_<ecto::tendrils, boost::shared_ptr<ecto::tendrils>, boost::noncopyable_::noncopyable, boost::python::detail::not_specified>, Container = ecto::tendrils, DerivedPolicies = boost::python::detail::final_std_map_derived_policies<ecto::tendrils, false>, bool NoProxy = false, bool NoSlice = true, Data = boost::shared_ptr<ecto::tendril>, Index = std::basic_string<char, std::char_traits<char>, std::allocator<char> >, Key = std::basic_string<char, std::char_traits<char>, std::allocator<char> >]
  48. /usr/local/include/boost/python/def_visitor.hpp:31:   instantiated from ‘static void boost::python::def_visitor_access::visit(const V&, classT&) [with V = boost::python::def_visitor<boost::python::indexing_suite<ecto::tendrils, boost::python::detail::final_std_map_derived_policies<ecto::tendrils, false>, false, true, boost::shared_ptr<ecto::tendril>, std::basic_string<char, std::char_traits<char>, std::allocator<char> >, std::basic_string<char, std::char_traits<char>, std::allocator<char> > > >, classT = boost::python::class_<ecto::tendrils, boost::shared_ptr<ecto::tendrils>, boost::noncopyable_::noncopyable, boost::python::detail::not_specified>]
  49. /usr/local/include/boost/python/def_visitor.hpp:67:   instantiated from ‘void boost::python::def_visitor<DerivedVisitor>::visit(classT&) const [with classT = boost::python::class_<ecto::tendrils, boost::shared_ptr<ecto::tendrils>, boost::noncopyable_::noncopyable, boost::python::detail::not_specified>, DerivedVisitor = boost::python::indexing_suite<ecto::tendrils, boost::python::detail::final_std_map_derived_policies<ecto::tendrils, false>, false, true, boost::shared_ptr<ecto::tendril>, std::basic_string<char, std::char_traits<char>, std::allocator<char> >, std::basic_string<char, std::char_traits<char>, std::allocator<char> > >]
  50. /usr/local/include/boost/python/class.hpp:225:   instantiated from ‘boost::python::class_<T, X1, X2, X3>& boost::python::class_<T, X1, X2, X3>::def(const boost::python::def_visitor<Derived>&) [with Derived = boost::python::indexing_suite<ecto::tendrils, boost::python::detail::final_std_map_derived_policies<ecto::tendrils, false>, false, true, boost::shared_ptr<ecto::tendril>, std::basic_string<char, std::char_traits<char>, std::allocator<char> >, std::basic_string<char, std::char_traits<char>, std::allocator<char> > >, W = ecto::tendrils, X1 = boost::shared_ptr<ecto::tendrils>, X2 = boost::noncopyable_::noncopyable, X3 = boost::python::detail::not_specified]
  51. /Users/katherinescott/ecto/src/pybindings/tendrils.cpp:94:   instantiated from here
  52. /usr/local/include/boost/noncopyable.hpp:27: error: ‘boost::noncopyable_::noncopyable::noncopyable(const boost::noncopyable_::noncopyable&)’ is private
  53. /Users/katherinescott/ecto/include/ecto/tendrils.hpp:46: error: within this context
  54. /Users/katherinescott/ecto/include/ecto/tendrils.hpp:46:   instantiated from ‘static boost::python::api::object boost::python::std_map_indexing_suite<Container, NoProxy, DerivedPolicies>::dict_fromkeys(const boost::python::api::object&, const boost::python::api::object&) [with Container = ecto::tendrils, bool NoProxy = false, DerivedPolicies = boost::python::detail::final_std_map_derived_policies<ecto::tendrils, false>]
  55. /Users/katherinescott/ecto/include/ecto/python/std_map_indexing_suite.hpp:428:   instantiated from ‘static void boost::python::std_map_indexing_suite<Container, NoProxy, DerivedPolicies>::extension_def(Class&) [with Class = boost::python::class_<ecto::tendrils, boost::shared_ptr<ecto::tendrils>, boost::noncopyable_::noncopyable, boost::python::detail::not_specified>, Container = ecto::tendrils, bool NoProxy = false, DerivedPolicies = boost::python::detail::final_std_map_derived_policies<ecto::tendrils, false>]
  56. /usr/local/include/boost/python/suite/indexing/indexing_suite.hpp:193:   instantiated from ‘void boost::python::indexing_suite<Container, DerivedPolicies, NoProxy, NoSlice, Data, Index, Key>::visit(Class&) const [with Class = boost::python::class_<ecto::tendrils, boost::shared_ptr<ecto::tendrils>, boost::noncopyable_::noncopyable, boost::python::detail::not_specified>, Container = ecto::tendrils, DerivedPolicies = boost::python::detail::final_std_map_derived_policies<ecto::tendrils, false>, bool NoProxy = false, bool NoSlice = true, Data = boost::shared_ptr<ecto::tendril>, Index = std::basic_string<char, std::char_traits<char>, std::allocator<char> >, Key = std::basic_string<char, std::char_traits<char>, std::allocator<char> >]
  57. /usr/local/include/boost/python/def_visitor.hpp:31:   instantiated from ‘static void boost::python::def_visitor_access::visit(const V&, classT&) [with V = boost::python::def_visitor<boost::python::indexing_suite<ecto::tendrils, boost::python::detail::final_std_map_derived_policies<ecto::tendrils, false>, false, true, boost::shared_ptr<ecto::tendril>, std::basic_string<char, std::char_traits<char>, std::allocator<char> >, std::basic_string<char, std::char_traits<char>, std::allocator<char> > > >, classT = boost::python::class_<ecto::tendrils, boost::shared_ptr<ecto::tendrils>, boost::noncopyable_::noncopyable, boost::python::detail::not_specified>]
  58. /usr/local/include/boost/python/def_visitor.hpp:67:   instantiated from ‘void boost::python::def_visitor<DerivedVisitor>::visit(classT&) const [with classT = boost::python::class_<ecto::tendrils, boost::shared_ptr<ecto::tendrils>, boost::noncopyable_::noncopyable, boost::python::detail::not_specified>, DerivedVisitor = boost::python::indexing_suite<ecto::tendrils, boost::python::detail::final_std_map_derived_policies<ecto::tendrils, false>, false, true, boost::shared_ptr<ecto::tendril>, std::basic_string<char, std::char_traits<char>, std::allocator<char> >, std::basic_string<char, std::char_traits<char>, std::allocator<char> > >]
  59. /usr/local/include/boost/python/class.hpp:225:   instantiated from ‘boost::python::class_<T, X1, X2, X3>& boost::python::class_<T, X1, X2, X3>::def(const boost::python::def_visitor<Derived>&) [with Derived = boost::python::indexing_suite<ecto::tendrils, boost::python::detail::final_std_map_derived_policies<ecto::tendrils, false>, false, true, boost::shared_ptr<ecto::tendril>, std::basic_string<char, std::char_traits<char>, std::allocator<char> >, std::basic_string<char, std::char_traits<char>, std::allocator<char> > >, W = ecto::tendrils, X1 = boost::shared_ptr<ecto::tendrils>, X2 = boost::noncopyable_::noncopyable, X3 = boost::python::detail::not_specified]
  60. /Users/katherinescott/ecto/src/pybindings/tendrils.cpp:94:   instantiated from here
  61. /usr/local/include/boost/thread/pthread/mutex.hpp:33: error: ‘boost::mutex::mutex(const boost::mutex&)’ is private
  62. /Users/katherinescott/ecto/include/ecto/tendrils.hpp:46: error: within this context
  63. /Users/katherinescott/ecto/include/ecto/python/std_map_indexing_suite.hpp: In static member function ‘static boost::python::api::object boost::python::std_map_indexing_suite<Container, NoProxy, DerivedPolicies>::dict_fromkeys(const boost::python::api::object&, const boost::python::api::object&) [with Container = ecto::tendrils, bool NoProxy = false, DerivedPolicies = boost::python::detail::final_std_map_derived_policies<ecto::tendrils, false>]:
  64. /Users/katherinescott/ecto/include/ecto/python/std_map_indexing_suite.hpp:194: note: synthesized method ‘ecto::tendrils::tendrils(const ecto::tendrils&)’ first required here
  65. make[2]: *** [src/pybindings/CMakeFiles/ecto_ectomodule.dir/tendrils.cpp.o] Error 1
  66. make[1]: *** [src/pybindings/CMakeFiles/ecto_ectomodule.dir/all] Error 2
  67. make: *** [all] Error 2
  68. K
RAW Paste Data