SHARE
TWEET

Untitled

Hariton Dec 26th, 2019 93 Never
Not a member of Pastebin yet? Sign Up, it unlocks many cool features!
  1. 09:19:35.230  Testing credentials for 'C:\Users\Hariton\Documents\Corona Projects\myevpanet.keystore':
  2. 09:19:38.226  Picked up JAVA_TOOL_OPTIONS: -Duser.language=en
  3. 09:19:38.226  jar signed.
  4. 09:19:39.960  Using custom build id from app bundle: 00000 (AppSettings.lua)
  5. 09:19:39.960  
  6. 09:19:39.960  Using custom Build Id 00000
  7. 09:25:19.049  @ver > NUL
  8. 09:25:19.049  Picked up JAVA_TOOL_OPTIONS: -Duser.language=en
  9. 09:25:19.049  Exception in thread "DisconnectableInputStream source reader" org.gradle.api.UncheckedIOException: java.io.IOException:                  
  10. 09:25:19.049    at org.gradle.internal.UncheckedException.throwAsUncheckedException(UncheckedException.java:61)
  11. 09:25:19.049    at org.gradle.internal.UncheckedException.throwAsUncheckedException(UncheckedException.java:41)
  12. 09:25:19.049    at org.gradle.util.DisconnectableInputStream$1.run(DisconnectableInputStream.java:125)
  13. 09:25:19.049    at java.base/java.lang.Thread.run(Thread.java:830)
  14. 09:25:19.049  Caused by: java.io.IOException:                  
  15. 09:25:19.049    at java.base/java.io.FileInputStream.readBytes(Native Method)
  16. 09:25:19.049    at java.base/java.io.FileInputStream.read(FileInputStream.java:273)
  17. 09:25:19.049    at java.base/java.io.BufferedInputStream.fill(BufferedInputStream.java:245)
  18. 09:25:19.049    at java.base/java.io.BufferedInputStream.read1(BufferedInputStream.java:285)
  19. 09:25:19.049    at java.base/java.io.BufferedInputStream.read(BufferedInputStream.java:344)
  20. 09:25:19.049    at org.gradle.util.DisconnectableInputStream$1.run(DisconnectableInputStream.java:96)
  21. 09:25:19.049    ... 1 more
  22. 09:25:19.049  ERROR: configuring 'shared.firebase.messaging_com.coronalabs' failed!
  23. 09:25:19.049  
  24. 09:25:19.049  FAILURE: Build failed with an exception.
  25. 09:25:19.049  
  26. 09:25:19.049  * Where:
  27. 09:25:19.049  Build file 'C:\Users\Hariton\AppData\Local\Temp\Corona Labs\CLtmpa07376\template\app\build.gradle.kts' line: 277
  28. 09:25:19.049  
  29. 09:25:19.049  * What went wrong:
  30. 09:25:19.049  Could not open dsl remapped class cache for 21tjb5jf7wgv11saot1wddt1t (C:\Users\Hariton\.gradle\caches\5.4.1\scripts-remapped\corona_f31usfshxcvzc7pw68nnmvh08\21tjb5jf7wgv11saot1wddt1t\dsldcd040730888da95d185715568c9cc57).
  31. 09:25:19.049  > Could not open dsl generic class cache for script 'C:\Users\Hariton\AppData\Local\Temp\Corona Labs\CLtmpa07376\template\app\build\corona-plugins\shared.firebase.messaging_com.coronalabs\corona.gradle' (C:\Users\Hariton\.gradle\caches\5.4.1\scripts\21tjb5jf7wgv11saot1wddt1t\dsl\dsldcd040730888da95d185715568c9cc57).
  32. 09:25:19.049     > Could not compile script 'C:\Users\Hariton\AppData\Local\Temp\Corona Labs\CLtmpa07376\template\app\build\corona-plugins\shared.firebase.messaging_com.coronalabs\corona.gradle'.
  33. 09:25:19.049        > startup failed:
  34. 09:25:19.049          General error during semantic analysis: Unsupported class file major version 57
  35. 09:25:19.049          
  36. 09:25:19.049          java.lang.IllegalArgumentException: Unsupported class file major version 57
  37. 09:25:19.049            at groovyjarjarasm.asm.ClassReader.<init>(ClassReader.java:184)
  38. 09:25:19.049            at groovyjarjarasm.asm.ClassReader.<init>(ClassReader.java:166)
  39. 09:25:19.049            at groovyjarjarasm.asm.ClassReader.<init>(ClassReader.java:152)
  40. 09:25:19.049            at groovyjarjarasm.asm.ClassReader.<init>(ClassReader.java:273)
  41. 09:25:19.049            at org.codehaus.groovy.ast.decompiled.AsmDecompiler.parseClass(AsmDecompiler.java:81)
  42. 09:25:19.049            at org.codehaus.groovy.control.ClassNodeResolver.findDecompiled(ClassNodeResolver.java:254)
  43. 09:25:19.049            at org.codehaus.groovy.control.ClassNodeResolver.tryAsLoaderClassOrScript(ClassNodeResolver.java:192)
  44. 09:25:19.049            at org.codehaus.groovy.control.ClassNodeResolver.findClassNode(ClassNodeResolver.java:172)
  45. 09:25:19.049            at org.codehaus.groovy.control.ClassNodeResolver.resolveName(ClassNodeResolver.java:128)
  46. 09:25:19.049            at org.codehaus.groovy.ast.decompiled.AsmReferenceResolver.resolveClassNullable(AsmReferenceResolver.java:59)
  47. 09:25:19.049            at org.codehaus.groovy.ast.decompiled.AsmReferenceResolver.resolveClass(AsmReferenceResolver.java:46)
  48. 09:25:19.049            at org.codehaus.groovy.ast.decompiled.AsmReferenceResolver.resolveNonArrayType(AsmReferenceResolver.java:81)
  49. 09:25:19.049            at org.codehaus.groovy.ast.decompiled.AsmReferenceResolver.resolveType(AsmReferenceResolver.java:72)
  50. 09:25:19.049            at org.codehaus.groovy.ast.decompiled.MemberSignatureParser.createMethodNode(MemberSignatureParser.java:55)
  51. 09:25:19.049            at org.codehaus.groovy.ast.decompiled.DecompiledClassNode.lazyInitMembers(DecompiledClassNode.java:195)
  52. 09:25:19.049            at org.codehaus.groovy.ast.decompiled.DecompiledClassNode.getDeclaredMethods(DecompiledClassNode.java:121)
  53. 09:25:19.049            at org.codehaus.groovy.ast.ClassNode.getMethods(ClassNode.java:912)
  54. 09:25:19.049            at org.codehaus.groovy.ast.ClassNode.tryFindPossibleMethod(ClassNode.java:1280)
  55. 09:25:19.049            at org.codehaus.groovy.control.StaticImportVisitor.transformMethodCallExpression(StaticImportVisitor.java:252)
  56. 09:25:19.049            at org.codehaus.groovy.control.StaticImportVisitor.transform(StaticImportVisitor.java:112)
  57. 09:25:19.049            at org.codehaus.groovy.ast.ClassCodeExpressionTransformer.visitExpressionStatement(ClassCodeExpressionTransformer.java:144)
  58. 09:25:19.049            at org.codehaus.groovy.ast.stmt.ExpressionStatement.visit(ExpressionStatement.java:42)
  59. 09:25:19.049            at org.codehaus.groovy.ast.ClassCodeVisitorSupport.visitClassCodeContainer(ClassCodeVisitorSupport.java:110)
  60. 09:25:19.049            at org.codehaus.groovy.ast.ClassCodeVisitorSupport.visitConstructorOrMethod(ClassCodeVisitorSupport.java:121)
  61. 09:25:19.049            at org.codehaus.groovy.ast.ClassCodeExpressionTransformer.visitConstructorOrMethod(ClassCodeExpressionTransformer.java:55)
  62. 09:25:19.049            at org.codehaus.groovy.control.StaticImportVisitor.visitConstructorOrMethod(StaticImportVisitor.java:88)
  63. 09:25:19.049            at org.codehaus.groovy.ast.ClassCodeVisitorSupport.visitConstructor(ClassCodeVisitorSupport.java:128)
  64. 09:25:19.049            at org.codehaus.groovy.ast.ClassNode.visitContents(ClassNode.java:1099)
  65. 09:25:19.049            at org.codehaus.groovy.ast.ClassCodeVisitorSupport.visitClass(ClassCodeVisitorSupport.java:54)
  66. 09:25:19.049            at org.codehaus.groovy.control.StaticImportVisitor.visitClass(StaticImportVisitor.java:82)
  67. 09:25:19.049            at org.codehaus.groovy.control.CompilationUnit$14.call(CompilationUnit.java:717)
  68. 09:25:19.049            at org.codehaus.groovy.control.CompilationUnit.applyToPrimaryClassNodes(CompilationUnit.java:1095)
  69. 09:25:19.049            at org.codehaus.groovy.control.CompilationUnit.doPhaseOperation(CompilationUnit.java:649)
  70. 09:25:19.049            at org.codehaus.groovy.control.CompilationUnit.processPhaseOperations(CompilationUnit.java:627)
  71. 09:25:19.049            at org.codehaus.groovy.control.CompilationUnit.compile(CompilationUnit.java:604)
  72. 09:25:19.049            at groovy.lang.GroovyClassLoader.doParseClass(GroovyClassLoader.java:390)
  73. 09:25:19.049            at groovy.lang.GroovyClassLoader.access$300(GroovyClassLoader.java:89)
  74. 09:25:19.049            at groovy.lang.GroovyClassLoader$5.provide(GroovyClassLoader.java:330)
  75. 09:25:19.049            at groovy.lang.GroovyClassLoader$5.provide(GroovyClassLoader.java:327)
  76. 09:25:19.049            at org.codehaus.groovy.runtime.memoize.ConcurrentCommonCache.getAndPut(ConcurrentCommonCache.java:147)
  77. 09:25:19.049            at groovy.lang.GroovyClassLoader.parseClass(GroovyClassLoader.java:325)
  78. 09:25:19.049            at org.gradle.groovy.scripts.internal.DefaultScriptCompilationHandler.compileScript(DefaultScriptCompilationHandler.java:133)
  79. 09:25:19.049            at org.gradle.groovy.scripts.internal.DefaultScriptCompilationHandler.compileToDir(DefaultScriptCompilationHandler.java:93)
  80. 09:25:19.049            at org.gradle.groovy.scripts.internal.BuildOperationBackedScriptCompilationHandler$2.run(BuildOperationBackedScriptCompilationHandler.java:54)
  81. 09:25:19.049            at org.gradle.internal.operations.DefaultBuildOperationExecutor$RunnableBuildOperationWorker.execute(DefaultBuildOperationExecutor.java:402)
  82. 09:25:19.049            at org.gradle.internal.operations.DefaultBuildOperationExecutor$RunnableBuildOperationWorker.execute(DefaultBuildOperationExecutor.java:394)
  83. 09:25:19.049            at org.gradle.internal.operations.DefaultBuildOperationExecutor$1.execute(DefaultBuildOperationExecutor.java:165)
  84. 09:25:19.049            at org.gradle.internal.operations.DefaultBuildOperationExecutor.execute(DefaultBuildOperationExecutor.java:250)
  85. 09:25:19.049            at org.gradle.internal.operations.DefaultBuildOperationExecutor.execute(DefaultBuildOperationExecutor.java:158)
  86. 09:25:19.049            at org.gradle.internal.operations.DefaultBuildOperationExecutor.run(DefaultBuildOperationExecutor.java:92)
  87. 09:25:19.049            at org.gradle.internal.operations.DelegatingBuildOperationExecutor.run(DelegatingBuildOperationExecutor.java:31)
  88. 09:25:19.049            at org.gradle.groovy.scripts.internal.BuildOperationBackedScriptCompilationHandler.compileToDir(BuildOperationBackedScriptCompilationHandler.java:51)
  89. 09:25:19.049            at org.gradle.groovy.scripts.internal.FileCacheBackedScriptClassCompiler$CompileToCrossBuildCacheAction.execute(FileCacheBackedScriptClassCompiler.java:151)
  90. 09:25:19.049            at org.gradle.groovy.scripts.internal.FileCacheBackedScriptClassCompiler$CompileToCrossBuildCacheAction.execute(FileCacheBackedScriptClassCompiler.java:132)
  91. 09:25:19.049            at org.gradle.groovy.scripts.internal.FileCacheBackedScriptClassCompiler$ProgressReportingInitializer.execute(FileCacheBackedScriptClassCompiler.java:175)
  92. 09:25:19.049            at org.gradle.groovy.scripts.internal.FileCacheBackedScriptClassCompiler$ProgressReportingInitializer.execute(FileCacheBackedScriptClassCompiler.java:155)
  93. 09:25:19.049            at org.gradle.cache.internal.DefaultPersistentDirectoryCache$Initializer.initialize(DefaultPersistentDirectoryCache.java:98)
  94. 09:25:19.049            at org.gradle.cache.internal.FixedSharedModeCrossProcessCacheAccess$1.run(FixedSharedModeCrossProcessCacheAccess.java:85)
  95. 09:25:19.049            at org.gradle.cache.internal.DefaultFileLockManager$DefaultFileLock.doWriteAction(DefaultFileLockManager.java:207)
  96. 09:25:19.049            at org.gradle.cache.internal.DefaultFileLockManager$DefaultFileLock.writeFile(DefaultFileLockManager.java:197)
  97. 09:25:19.049            at org.gradle.cache.internal.FixedSharedModeCrossProcessCacheAccess.open(FixedSharedModeCrossProcessCacheAccess.java:83)
  98. 09:25:19.049            at org.gradle.cache.internal.DefaultCacheAccess.open(DefaultCacheAccess.java:142)
  99. 09:25:19.049            at org.gradle.cache.internal.DefaultPersistentDirectoryStore.open(DefaultPersistentDirectoryStore.java:78)
  100. 09:25:19.049            at org.gradle.cache.internal.DefaultPersistentDirectoryStore.open(DefaultPersistentDirectoryStore.java:42)
  101. 09:25:19.049            at org.gradle.cache.internal.DefaultCacheFactory.doOpen(DefaultCacheFactory.java:94)
  102. 09:25:19.049            at org.gradle.cache.internal.DefaultCacheFactory.open(DefaultCacheFactory.java:68)
  103. 09:25:19.049            at org.gradle.cache.internal.DefaultCacheRepository$PersistentCacheBuilder.open(DefaultCacheRepository.java:118)
  104. 09:25:19.049            at org.gradle.groovy.scripts.internal.FileCacheBackedScriptClassCompiler$RemapBuildScriptsAction.execute(FileCacheBackedScriptClassCompiler.java:421)
  105. 09:25:19.049            at org.gradle.groovy.scripts.internal.FileCacheBackedScriptClassCompiler$RemapBuildScriptsAction.execute(FileCacheBackedScriptClassCompiler.java:390)
  106. 09:25:19.059            at org.gradle.groovy.scripts.internal.FileCacheBackedScriptClassCompiler$ProgressReportingInitializer.execute(FileCacheBackedScriptClassCompiler.java:175)
  107. 09:25:19.059            at org.gradle.groovy.scripts.internal.FileCacheBackedScriptClassCompiler$ProgressReportingInitializer.execute(FileCacheBackedScriptClassCompiler.java:155)
  108. 09:25:19.059            at org.gradle.cache.internal.DefaultPersistentDirectoryCache$Initializer.initialize(DefaultPersistentDirectoryCache.java:98)
  109. 09:25:19.059            at org.gradle.cache.internal.FixedSharedModeCrossProcessCacheAccess$1.run(FixedSharedModeCrossProcessCacheAccess.java:85)
  110. 09:25:19.059            at org.gradle.cache.internal.DefaultFileLockManager$DefaultFileLock.doWriteAction(DefaultFileLockManager.java:207)
  111. 09:25:19.059            at org.gradle.cache.internal.DefaultFileLockManager$DefaultFileLock.writeFile(DefaultFileLockManager.java:197)
  112. 09:25:19.059            at org.gradle.cache.internal.FixedSharedModeCrossProcessCacheAccess.open(FixedSharedModeCrossProcessCacheAccess.java:83)
  113. 09:25:19.059            at org.gradle.cache.internal.DefaultCacheAccess.open(DefaultCacheAccess.java:142)
  114. 09:25:19.059            at org.gradle.cache.internal.DefaultPersistentDirectoryStore.open(DefaultPersistentDirectoryStore.java:78)
  115. 09:25:19.059            at org.gradle.cache.internal.DefaultPersistentDirectoryStore.open(DefaultPersistentDirectoryStore.java:42)
  116. 09:25:19.059            at org.gradle.cache.internal.DefaultCacheFactory.doOpen(DefaultCacheFactory.java:94)
  117. 09:25:19.059            at org.gradle.cache.internal.DefaultCacheFactory.open(DefaultCacheFactory.java:68)
  118. 09:25:19.059            at org.gradle.cache.internal.DefaultCacheRepository$PersistentCacheBuilder.open(DefaultCacheRepository.java:118)
  119. 09:25:19.059            at org.gradle.groovy.scripts.internal.FileCacheBackedScriptClassCompiler.compile(FileCacheBackedScriptClassCompiler.java:105)
  120. 09:25:19.059            at org.gradle.groovy.scripts.internal.CrossBuildInMemoryCachingScriptClassCache.getOrCompile(CrossBuildInMemoryCachingScriptClassCache.java:49)
  121. 09:25:19.059            at org.gradle.groovy.scripts.internal.BuildScopeInMemoryCachingScriptClassCompiler.compile(BuildScopeInMemoryCachingScriptClassCompiler.java:50)
  122. 09:25:19.059            at org.gradle.groovy.scripts.DefaultScriptCompilerFactory$ScriptCompilerImpl.compile(DefaultScriptCompilerFactory.java:50)
  123. 09:25:19.059            at org.gradle.configuration.DefaultScriptPluginFactory$ScriptPluginImpl.apply(DefaultScriptPluginFactory.java:211)
  124. 09:25:19.059            at org.gradle.configuration.BuildOperationScriptPlugin$1$1.run(BuildOperationScriptPlugin.java:69)
  125. 09:25:19.059            at org.gradle.internal.operations.DefaultBuildOperationExecutor$RunnableBuildOperationWorker.execute(DefaultBuildOperationExecutor.java:402)
  126. 09:25:19.059            at org.gradle.internal.operations.DefaultBuildOperationExecutor$RunnableBuildOperationWorker.execute(DefaultBuildOperationExecutor.java:394)
  127. 09:25:19.059            at org.gradle.internal.operations.DefaultBuildOperationExecutor$1.execute(DefaultBuildOperationExecutor.java:165)
  128. 09:25:19.059            at org.gradle.internal.operations.DefaultBuildOperationExecutor.execute(DefaultBuildOperationExecutor.java:250)
  129. 09:25:19.059            at org.gradle.internal.operations.DefaultBuildOperationExecutor.execute(DefaultBuildOperationExecutor.java:158)
  130. 09:25:19.059            at org.gradle.internal.operations.DefaultBuildOperationExecutor.run(DefaultBuildOperationExecutor.java:92)
  131. 09:25:19.059            at org.gradle.internal.operations.DelegatingBuildOperationExecutor.run(DelegatingBuildOperationExecutor.java:31)
  132. 09:25:19.059            at org.gradle.configuration.BuildOperationScriptPlugin$1.execute(BuildOperationScriptPlugin.java:66)
  133. 09:25:19.059            at org.gradle.configuration.BuildOperationScriptPlugin$1.execute(BuildOperationScriptPlugin.java:63)
  134. 09:25:19.059            at org.gradle.configuration.internal.DefaultUserCodeApplicationContext.apply(DefaultUserCodeApplicationContext.java:48)
  135. 09:25:19.059            at org.gradle.configuration.BuildOperationScriptPlugin.apply(BuildOperationScriptPlugin.java:63)
  136. 09:25:19.059            at org.gradle.api.internal.plugins.DefaultObjectConfigurationAction.applyScript(DefaultObjectConfigurationAction.java:109)
  137. 09:25:19.059            at org.gradle.api.internal.plugins.DefaultObjectConfigurationAction.access$000(DefaultObjectConfigurationAction.java:38)
  138. 09:25:19.059            at org.gradle.api.internal.plugins.DefaultObjectConfigurationAction$1.run(DefaultObjectConfigurationAction.java:68)
  139. 09:25:19.059            at org.gradle.api.internal.plugins.DefaultObjectConfigurationAction.execute(DefaultObjectConfigurationAction.java:143)
  140. 09:25:19.059            at org.gradle.api.internal.project.AbstractPluginAware.apply(AbstractPluginAware.java:40)
  141. 09:25:19.059            at org.gradle.kotlin.dsl.support.delegates.ProjectDelegate.apply(ProjectDelegate.kt:344)
  142. 09:25:19.059            at org.gradle.kotlin.dsl.PluginAwareExtensionsKt.apply(PluginAwareExtensions.kt:33)
  143. 09:25:19.059            at org.gradle.kotlin.dsl.PluginAwareExtensionsKt.apply$default(PluginAwareExtensions.kt:31)
  144. 09:25:19.059            at Build_gradle.processPluginGradleScripts(build.gradle.kts:277)
  145. 09:25:19.059            at Build_gradle.downloadAndProcessCoronaPlugins(build.gradle.kts:607)
  146. 09:25:19.059            at Build_gradle.downloadAndProcessCoronaPlugins$default(build.gradle.kts:550)
  147. 09:25:19.059            at Build_gradle.<init>(build.gradle.kts:179)
  148. 09:25:19.059            at Program.execute(Unknown Source)
  149. 09:25:19.059            at org.gradle.kotlin.dsl.execution.Interpreter$ProgramHost.eval(Interpreter.kt:506)
  150. 09:25:19.069            at org.gradle.kotlin.dsl.execution.Interpreter$ProgramHost.evaluateSecondStageOf(Interpreter.kt:422)
  151. 09:25:19.069            at Program.execute(Unknown Source)
  152. 09:25:19.069            at org.gradle.kotlin.dsl.execution.Interpreter$ProgramHost.eval(Interpreter.kt:506)
  153. 09:25:19.069            at org.gradle.kotlin.dsl.execution.Interpreter.eval(Interpreter.kt:206)
  154. 09:25:19.069            at org.gradle.kotlin.dsl.provider.StandardKotlinScriptEvaluator.evaluate(KotlinScriptEvaluator.kt:114)
  155. 09:25:19.069            at org.gradle.kotlin.dsl.provider.KotlinScriptPluginFactory$create$1.invoke(KotlinScriptPluginFactory.kt:51)
  156. 09:25:19.069            at org.gradle.kotlin.dsl.provider.KotlinScriptPluginFactory$create$1.invoke(KotlinScriptPluginFactory.kt:36)
  157. 09:25:19.069            at org.gradle.kotlin.dsl.provider.KotlinScriptPlugin.apply(KotlinScriptPlugin.kt:34)
  158. 09:25:19.069            at org.gradle.configuration.BuildOperationScriptPlugin$1$1.run(BuildOperationScriptPlugin.java:69)
  159. 09:25:19.069            at org.gradle.internal.operations.DefaultBuildOperationExecutor$RunnableBuildOperationWorker.execute(DefaultBuildOperationExecutor.java:402)
  160. 09:25:19.069            at org.gradle.internal.operations.DefaultBuildOperationExecutor$RunnableBuildOperationWorker.execute(DefaultBuildOperationExecutor.java:394)
  161. 09:25:19.069            at org.gradle.internal.operations.DefaultBuildOperationExecutor$1.execute(DefaultBuildOperationExecutor.java:165)
  162. 09:25:19.069            at org.gradle.internal.operations.DefaultBuildOperationExecutor.execute(DefaultBuildOperationExecutor.java:250)
  163. 09:25:19.069            at org.gradle.internal.operations.DefaultBuildOperationExecutor.execute(DefaultBuildOperationExecutor.java:158)
  164. 09:25:19.069            at org.gradle.internal.operations.DefaultBuildOperationExecutor.run(DefaultBuildOperationExecutor.java:92)
  165. 09:25:19.069            at org.gradle.internal.operations.DelegatingBuildOperationExecutor.run(DelegatingBuildOperationExecutor.java:31)
  166. 09:25:19.069            at org.gradle.configuration.BuildOperationScriptPlugin$1.execute(BuildOperationScriptPlugin.java:66)
  167. 09:25:19.069            at org.gradle.configuration.BuildOperationScriptPlugin$1.execute(BuildOperationScriptPlugin.java:63)
  168. 09:25:19.069            at org.gradle.configuration.internal.DefaultUserCodeApplicationContext.apply(DefaultUserCodeApplicationContext.java:48)
  169. 09:25:19.069            at org.gradle.configuration.BuildOperationScriptPlugin.apply(BuildOperationScriptPlugin.java:63)
  170. 09:25:19.069            at org.gradle.configuration.project.BuildScriptProcessor$1.run(BuildScriptProcessor.java:44)
  171. 09:25:19.069            at org.gradle.internal.Factories$1.create(Factories.java:25)
  172. 09:25:19.069            at org.gradle.api.internal.project.DefaultProjectStateRegistry$ProjectStateImpl.withMutableState(DefaultProjectStateRegistry.java:200)
  173. 09:25:19.069            at org.gradle.api.internal.project.DefaultProjectStateRegistry$ProjectStateImpl.withMutableState(DefaultProjectStateRegistry.java:186)
  174. 09:25:19.069            at org.gradle.configuration.project.BuildScriptProcessor.execute(BuildScriptProcessor.java:41)
  175. 09:25:19.069            at org.gradle.configuration.project.BuildScriptProcessor.execute(BuildScriptProcessor.java:26)
  176. 09:25:19.069            at org.gradle.configuration.project.ConfigureActionsProjectEvaluator.evaluate(ConfigureActionsProjectEvaluator.java:34)
  177. 09:25:19.069            at org.gradle.configuration.project.LifecycleProjectEvaluator$EvaluateProject$1.run(LifecycleProjectEvaluator.java:106)
  178. 09:25:19.069            at org.gradle.internal.Factories$1.create(Factories.java:25)
  179. 09:25:19.069            at org.gradle.internal.work.DefaultWorkerLeaseService.withLocks(DefaultWorkerLeaseService.java:183)
  180. 09:25:19.069            at org.gradle.internal.work.StopShieldingWorkerLeaseService.withLocks(StopShieldingWorkerLeaseService.java:40)
  181. 09:25:19.069            at org.gradle.api.internal.project.DefaultProjectStateRegistry$ProjectStateImpl.withProjectLock(DefaultProjectStateRegistry.java:226)
  182. 09:25:19.069            at org.gradle.api.internal.project.DefaultProjectStateRegistry$ProjectStateImpl.withMutableState(DefaultProjectStateRegistry.java:220)
  183. 09:25:19.069            at org.gradle.api.internal.project.DefaultProjectStateRegistry$ProjectStateImpl.withMutableState(DefaultProjectStateRegistry.java:186)
  184. 09:25:19.069            at org.gradle.configuration.project.LifecycleProjectEvaluator$EvaluateProject.run(LifecycleProjectEvaluator.java:95)
  185. 09:25:19.069            at org.gradle.internal.operations.DefaultBuildOperationExecutor$RunnableBuildOperationWorker.execute(DefaultBuildOperationExecutor.java:402)
  186. 09:25:19.069            at org.gradle.internal.operations.DefaultBuildOperationExecutor$RunnableBuildOperationWorker.execute(DefaultBuildOperationExecutor.java:394)
  187. 09:25:19.069            at org.gradle.internal.operations.DefaultBuildOperationExecutor$1.execute(DefaultBuildOperationExecutor.java:165)
  188. 09:25:19.069            at org.gradle.internal.operations.DefaultBuildOperationExecutor.execute(DefaultBuildOperationExecutor.java:250)
  189. 09:25:19.069            at org.gradle.internal.operations.DefaultBuildOperationExecutor.execute(DefaultBuildOperationExecutor.java:158)
  190. 09:25:19.069            at org.gradle.internal.operations.DefaultBuildOperationExecutor.run(DefaultBuildOperationExecutor.java:92)
  191. 09:25:19.069            at org.gradle.internal.operations.DelegatingBuildOperationExecutor.run(DelegatingBuildOperationExecutor.java:31)
  192. 09:25:19.069            at org.gradle.configuration.project.LifecycleProjectEvaluator.evaluate(LifecycleProjectEvaluator.java:67)
  193. 09:25:19.069            at org.gradle.api.internal.project.DefaultProject.evaluate(DefaultProject.java:695)
  194. 09:25:19.069            at org.gradle.api.internal.project.DefaultProject.evaluate(DefaultProject.java:143)
  195. 09:25:19.069            at org.gradle.execution.TaskPathProjectEvaluator.configure(TaskPathProjectEvaluator.java:35)
  196. 09:25:19.069            at org.gradle.execution.TaskPathProjectEvaluator.configureHierarchy(TaskPathProjectEvaluator.java:62)
  197. 09:25:19.069            at org.gradle.configuration.DefaultBuildConfigurer.configure(DefaultBuildConfigurer.java:41)
  198. 09:25:19.069            at org.gradle.initialization.DefaultGradleLauncher$ConfigureBuild.run(DefaultGradleLauncher.java:302)
  199. 09:25:19.069            at org.gradle.internal.operations.DefaultBuildOperationExecutor$RunnableBuildOperationWorker.execute(DefaultBuildOperationExecutor.java:402)
  200. 09:25:19.069            at org.gradle.internal.operations.DefaultBuildOperationExecutor$RunnableBuildOperationWorker.execute(DefaultBuildOperationExecutor.java:394)
  201. 09:25:19.069            at org.gradle.internal.operations.DefaultBuildOperationExecutor$1.execute(DefaultBuildOperationExecutor.java:165)
  202. 09:25:19.069            at org.gradle.internal.operations.DefaultBuildOperationExecutor.execute(DefaultBuildOperationExecutor.java:250)
  203. 09:25:19.069            at org.gradle.internal.operations.DefaultBuildOperationExecutor.execute(DefaultBuildOperationExecutor.java:158)
  204. 09:25:19.069            at org.gradle.internal.operations.DefaultBuildOperationExecutor.run(DefaultBuildOperationExecutor.java:92)
  205. 09:25:19.069            at org.gradle.internal.operations.DelegatingBuildOperationExecutor.run(DelegatingBuildOperationExecutor.java:31)
  206. 09:25:19.069            at org.gradle.initialization.DefaultGradleLauncher.configureBuild(DefaultGradleLauncher.java:210)
  207. 09:25:19.069            at org.gradle.initialization.DefaultGradleLauncher.doBuildStages(DefaultGradleLauncher.java:151)
  208. 09:25:19.069            at org.gradle.initialization.DefaultGradleLauncher.executeTasks(DefaultGradleLauncher.java:134)
  209. 09:25:19.069            at org.gradle.internal.invocation.GradleBuildController$1.execute(GradleBuildController.java:58)
  210. 09:25:19.069            at org.gradle.internal.invocation.GradleBuildController$1.execute(GradleBuildController.java:55)
  211. 09:25:19.069            at org.gradle.internal.invocation.GradleBuildController$3.create(GradleBuildController.java:82)
  212. 09:25:19.069            at org.gradle.internal.invocation.GradleBuildController$3.create(GradleBuildController.java:75)
  213. 09:25:19.069            at org.gradle.internal.work.DefaultWorkerLeaseService.withLocks(DefaultWorkerLeaseService.java:183)
  214. 09:25:19.069            at org.gradle.internal.work.StopShieldingWorkerLeaseService.withLocks(StopShieldingWorkerLeaseService.java:40)
  215. 09:25:19.069            at org.gradle.internal.invocation.GradleBuildController.doBuild(GradleBuildController.java:75)
  216. 09:25:19.069            at org.gradle.internal.invocation.GradleBuildController.run(GradleBuildController.java:55)
  217. 09:25:19.069            at org.gradle.tooling.internal.provider.ExecuteBuildActionRunner.run(ExecuteBuildActionRunner.java:31)
  218. 09:25:19.069            at org.gradle.launcher.exec.ChainingBuildActionRunner.run(ChainingBuildActionRunner.java:35)
  219. 09:25:19.069            at org.gradle.launcher.exec.BuildOutcomeReportingBuildActionRunner.run(BuildOutcomeReportingBuildActionRunner.java:58)
  220. 09:25:19.069            at org.gradle.tooling.internal.provider.ValidatingBuildActionRunner.run(ValidatingBuildActionRunner.java:32)
  221. 09:25:19.069            at org.gradle.launcher.exec.BuildCompletionNotifyingBuildActionRunner.run(BuildCompletionNotifyingBuildActionRunner.java:39)
  222. 09:25:19.069            at org.gradle.launcher.exec.RunAsBuildOperationBuildActionRunner$3.call(RunAsBuildOperationBuildActionRunner.java:51)
  223. 09:25:19.069            at org.gradle.launcher.exec.RunAsBuildOperationBuildActionRunner$3.call(RunAsBuildOperationBuildActionRunner.java:45)
  224. 09:25:19.069            at org.gradle.internal.operations.DefaultBuildOperationExecutor$CallableBuildOperationWorker.execute(DefaultBuildOperationExecutor.java:416)
  225. 09:25:19.069            at org.gradle.internal.operations.DefaultBuildOperationExecutor$CallableBuildOperationWorker.execute(DefaultBuildOperationExecutor.java:406)
  226. 09:25:19.069            at org.gradle.internal.operations.DefaultBuildOperationExecutor$1.execute(DefaultBuildOperationExecutor.java:165)
  227. 09:25:19.069            at org.gradle.internal.operations.DefaultBuildOperationExecutor.execute(DefaultBuildOperationExecutor.java:250)
  228. 09:25:19.069            at org.gradle.internal.operations.DefaultBuildOperationExecutor.execute(DefaultBuildOperationExecutor.java:158)
  229. 09:25:19.069            at org.gradle.internal.operations.DefaultBuildOperationExecutor.call(DefaultBuildOperationExecutor.java:102)
  230. 09:25:19.069            at org.gradle.internal.operations.DelegatingBuildOperationExecutor.call(DelegatingBuildOperationExecutor.java:36)
  231. 09:25:19.069            at org.gradle.launcher.exec.RunAsBuildOperationBuildActionRunner.run(RunAsBuildOperationBuildActionRunner.java:45)
  232. 09:25:19.069            at org.gradle.launcher.exec.InProcessBuildActionExecuter$1.transform(InProcessBuildActionExecuter.java:49)
  233. 09:25:19.069            at org.gradle.launcher.exec.InProcessBuildActionExecuter$1.transform(InProcessBuildActionExecuter.java:46)
  234. 09:25:19.069            at org.gradle.composite.internal.DefaultRootBuildState.run(DefaultRootBuildState.java:78)
  235. 09:25:19.069            at org.gradle.launcher.exec.InProcessBuildActionExecuter.execute(InProcessBuildActionExecuter.java:46)
  236. 09:25:19.069            at org.gradle.launcher.exec.InProcessBuildActionExecuter.execute(InProcessBuildActionExecuter.java:31)
  237. 09:25:19.087            at org.gradle.launcher.exec.BuildTreeScopeBuildActionExecuter.execute(BuildTreeScopeBuildActionExecuter.java:42)
  238. 09:25:19.087            at org.gradle.launcher.exec.BuildTreeScopeBuildActionExecuter.execute(BuildTreeScopeBuildActionExecuter.java:28)
  239. 09:25:19.087            at org.gradle.tooling.internal.provider.ContinuousBuildActionExecuter.execute(ContinuousBuildActionExecuter.java:78)
  240. 09:25:19.087            at org.gradle.tooling.internal.provider.ContinuousBuildActionExecuter.execute(ContinuousBuildActionExecuter.java:52)
  241. 09:25:19.087            at org.gradle.tooling.internal.provider.SubscribableBuildActionExecuter.execute(SubscribableBuildActionExecuter.java:59)
  242. 09:25:19.087            at org.gradle.tooling.internal.provider.SubscribableBuildActionExecuter.execute(SubscribableBuildActionExecuter.java:36)
  243. 09:25:19.087            at org.gradle.tooling.internal.provider.SessionScopeBuildActionExecuter.execute(SessionScopeBuildActionExecuter.java:68)
  244. 09:25:19.087            at org.gradle.tooling.internal.provider.SessionScopeBuildActionExecuter.execute(SessionScopeBuildActionExecuter.java:38)
  245. 09:25:19.087            at org.gradle.tooling.internal.provider.GradleThreadBuildActionExecuter.execute(GradleThreadBuildActionExecuter.java:37)
  246. 09:25:19.087            at org.gradle.tooling.internal.provider.GradleThreadBuildActionExecuter.execute(GradleThreadBuildActionExecuter.java:26)
  247. 09:25:19.087            at org.gradle.tooling.internal.provider.ParallelismConfigurationBuildActionExecuter.execute(ParallelismConfigurationBuildActionExecuter.java:43)
  248. 09:25:19.087            at org.gradle.tooling.internal.provider.ParallelismConfigurationBuildActionExecuter.execute(ParallelismConfigurationBuildActionExecuter.java:29)
  249. 09:25:19.087            at org.gradle.tooling.internal.provider.StartParamsValidatingActionExecuter.execute(StartParamsValidatingActionExecuter.java:60)
  250. 09:25:19.087            at org.gradle.tooling.internal.provider.StartParamsValidatingActionExecuter.execute(StartParamsValidatingActionExecuter.java:32)
  251. 09:25:19.087            at org.gradle.tooling.internal.provider.SessionFailureReportingActionExecuter.execute(SessionFailureReportingActionExecuter.java:55)
  252. 09:25:19.087            at org.gradle.tooling.internal.provider.SessionFailureReportingActionExecuter.execute(SessionFailureReportingActionExecuter.java:41)
  253. 09:25:19.087            at org.gradle.tooling.internal.provider.SetupLoggingActionExecuter.execute(SetupLoggingActionExecuter.java:48)
  254. 09:25:19.087            at org.gradle.tooling.internal.provider.SetupLoggingActionExecuter.execute(SetupLoggingActionExecuter.java:32)
  255. 09:25:19.087            at org.gradle.launcher.daemon.server.exec.ExecuteBuild.doBuild(ExecuteBuild.java:67)
  256. 09:25:19.087            at org.gradle.launcher.daemon.server.exec.BuildCommandOnly.execute(BuildCommandOnly.java:36)
  257. 09:25:19.087            at org.gradle.launcher.daemon.server.api.DaemonCommandExecution.proceed(DaemonCommandExecution.java:104)
  258. 09:25:19.087            at org.gradle.launcher.daemon.server.exec.WatchForDisconnection.execute(WatchForDisconnection.java:37)
  259. 09:25:19.087            at org.gradle.launcher.daemon.server.api.DaemonCommandExecution.proceed(DaemonCommandExecution.java:104)
  260. 09:25:19.087            at org.gradle.launcher.daemon.server.exec.ResetDeprecationLogger.execute(ResetDeprecationLogger.java:26)
  261. 09:25:19.087            at org.gradle.launcher.daemon.server.api.DaemonCommandExecution.proceed(DaemonCommandExecution.java:104)
  262. 09:25:19.087            at org.gradle.launcher.daemon.server.exec.RequestStopIfSingleUsedDaemon.execute(RequestStopIfSingleUsedDaemon.java:34)
  263. 09:25:19.087            at org.gradle.launcher.daemon.server.api.DaemonCommandExecution.proceed(DaemonCommandExecution.java:104)
  264. 09:25:19.087            at org.gradle.launcher.daemon.server.exec.ForwardClientInput$2.call(ForwardClientInput.java:74)
  265. 09:25:19.087            at org.gradle.launcher.daemon.server.exec.ForwardClientInput$2.call(ForwardClientInput.java:72)
  266. 09:25:19.087            at org.gradle.util.Swapper.swap(Swapper.java:38)
  267. 09:25:19.087            at org.gradle.launcher.daemon.server.exec.ForwardClientInput.execute(ForwardClientInput.java:72)
  268. 09:25:19.087            at org.gradle.launcher.daemon.server.api.DaemonCommandExecution.proceed(DaemonCommandExecution.java:104)
  269. 09:25:19.087            at org.gradle.launcher.daemon.server.exec.LogAndCheckHealth.execute(LogAndCheckHealth.java:50)
  270. 09:25:19.087            at org.gradle.launcher.daemon.server.api.DaemonCommandExecution.proceed(DaemonCommandExecution.java:104)
  271. 09:25:19.087            at org.gradle.launcher.daemon.server.exec.LogToClient.doBuild(LogToClient.java:62)
  272. 09:25:19.087            at org.gradle.launcher.daemon.server.exec.BuildCommandOnly.execute(BuildCommandOnly.java:36)
  273. 09:25:19.087            at org.gradle.launcher.daemon.server.api.DaemonCommandExecution.proceed(DaemonCommandExecution.java:104)
  274. 09:25:19.087            at org.gradle.launcher.daemon.server.exec.EstablishBuildEnvironment.doBuild(EstablishBuildEnvironment.java:81)
  275. 09:25:19.087            at org.gradle.launcher.daemon.server.exec.BuildCommandOnly.execute(BuildCommandOnly.java:36)
  276. 09:25:19.087            at org.gradle.launcher.daemon.server.api.DaemonCommandExecution.proceed(DaemonCommandExecution.java:104)
  277. 09:25:19.087            at org.gradle.launcher.daemon.server.exec.StartBuildOrRespondWithBusy$1.run(StartBuildOrRespondWithBusy.java:50)
  278. 09:25:19.087            at org.gradle.launcher.daemon.server.DaemonStateCoordinator$1.run(DaemonStateCoordinator.java:295)
  279. 09:25:19.087            at org.gradle.internal.concurrent.ExecutorPolicy$CatchAndRecordFailures.onExecute(ExecutorPolicy.java:63)
  280. 09:25:19.097            at org.gradle.internal.concurrent.ManagedExecutorImpl$1.run(ManagedExecutorImpl.java:46)
  281. 09:25:19.097            at java.base/java.util.concurrent.ThreadPoolExecutor.runWorker(ThreadPoolExecutor.java:1128)
  282. 09:25:19.097            at java.base/java.util.concurrent.ThreadPoolExecutor$Worker.run(ThreadPoolExecutor.java:628)
  283. 09:25:19.097            at org.gradle.internal.concurrent.ThreadFactoryImpl$ManagedThreadRunnable.run(ThreadFactoryImpl.java:55)
  284. 09:25:19.097            at java.base/java.lang.Thread.run(Thread.java:830)
  285. 09:25:19.097          
  286. 09:25:19.097          1 error
  287. 09:25:19.097  
  288. 09:25:19.097  
  289. 09:25:19.097  * Try:
  290. 09:25:19.097  Run with --stacktrace option to get the stack trace. Run with --info or --debug option to get more log output. Run with --scan to get full insights.
  291. 09:25:19.097  
  292. 09:25:19.097  * Get more help at https://help.gradle.org
  293. 09:25:19.097  
  294. 09:25:19.097  BUILD FAILED in 5m 33s
  295. 09:25:19.292  Android build failed (1) after 340 seconds
RAW Paste Data
We use cookies for various purposes including analytics. By continuing to use Pastebin, you agree to our use of cookies as described in the Cookies Policy. OK, I Understand
Top