Guest User

qt6 already upgraded

a guest
Aug 24th, 2021
174
0
Never
Not a member of Pastebin yet? Sign Up, it unlocks many cool features!
text 9.94 KB | None | 0 0
  1. cd 'C:\Users\Patron\Desktop\Code Projects\Sistema_Silo'
  2. C:\MinGW\msys\1.0\bin\make.exe -f Makefile CONF=Debug clean QMAKE=/C/Qt14/6.1.2/mingw81_64/bin/qmake.exe
  3. "/C/MinGW/msys/1.0/bin/make.exe" -f nbproject/Makefile-Debug.mk QMAKE=/C/Qt14/6.1.2/mingw81_64/bin/qmake.exe SUBPROJECTS= .clean-conf
  4. make.exe[1]: Entering directory `/c/Users/Patron/Desktop/Code Projects/Sistema_Silo'
  5. /C/Qt14/6.1.2/mingw81_64/bin/qmake.exe VPATH=. -spec win32-g++ -o qttmp-Debug.mk nbproject/qt-Debug.pro
  6. mv -f qttmp-Debug.mk nbproject/qt-Debug.mk
  7. /C/MinGW/msys/1.0/bin/make.exe -f nbproject/qt-Debug.mk distclean
  8. make.exe[2]: Entering directory `/c/Users/Patron/Desktop/Code Projects/Sistema_Silo'
  9. rm -f qrc_darkstyle.cpp qrc_framelesswindow.cpp qrc_LogoSplashScreen.cpp
  10. rm -f moc_predefs.h
  11. rm -f moc_DarkStyle.cpp moc_framelesswindow.cpp moc_windowdragger.cpp moc_Launcher.cpp moc_Login.cpp moc_Silo_SaS.cpp
  12. rm -f ui_framelesswindow.h ui_Launcher.h "ui_Login V0.2.h" "ui_Pantalla_Principal V2.6.h"
  13. rm -f build/Debug/MinGW64__Qt_6.1.2-Windows/DarkStyle.o build/Debug/MinGW64__Qt_6.1.2-Windows/framelesswindow.o build/Debug/MinGW64__Qt_6.1.2-Windows/windowdragger.o build/Debug/MinGW64__Qt_6.1.2-Windows/Impresora.o build/Debug/MinGW64__Qt_6.1.2-Windows/Launcher.o build/Debug/MinGW64__Qt_6.1.2-Windows/Login.o build/Debug/MinGW64__Qt_6.1.2-Windows/Serial.o build/Debug/MinGW64__Qt_6.1.2-Windows/Silo_SaS.o build/Debug/MinGW64__Qt_6.1.2-Windows/Web_handler.o build/Debug/MinGW64__Qt_6.1.2-Windows/main_Pantalla_Principal.o build/Debug/MinGW64__Qt_6.1.2-Windows/qrc_darkstyle.o build/Debug/MinGW64__Qt_6.1.2-Windows/qrc_framelesswindow.o build/Debug/MinGW64__Qt_6.1.2-Windows/qrc_LogoSplashScreen.o build/Debug/MinGW64__Qt_6.1.2-Windows/moc_DarkStyle.o build/Debug/MinGW64__Qt_6.1.2-Windows/moc_framelesswindow.o build/Debug/MinGW64__Qt_6.1.2-Windows/moc_windowdragger.o build/Debug/MinGW64__Qt_6.1.2-Windows/moc_Launcher.o build/Debug/MinGW64__Qt_6.1.2-Windows/moc_Login.o build/Debug/MinGW64__Qt_6.1.2-Windows/moc_Silo_SaS.o
  14. rm -f build/Debug/MinGW64__Qt_6.1.2-Windows/Sistema_Silo_MinGW64__Qt_6.1.2-Windows_V1.1_resource_res.o
  15. rm -f .qmake.stash
  16. rm -f dist/Debug/MinGW64__Qt_6.1.2-Windows/Sistema_Silo_MinGW64__Qt_6.1.2-Windows_V1.1.exe
  17. rm -f qttmp-Debug.mk
  18. make.exe[2]: Leaving directory `/c/Users/Patron/Desktop/Code Projects/Sistema_Silo'
  19. make.exe[1]: Leaving directory `/c/Users/Patron/Desktop/Code Projects/Sistema_Silo'
  20.  
  21. CLEAN SUCCESSFUL (total time: 4s)
  22. cd 'C:\Users\Patron\Desktop\Code Projects\Sistema_Silo'
  23. C:\MinGW\msys\1.0\bin\make.exe -f Makefile CONF=Debug QMAKE=/C/Qt14/6.1.2/mingw81_64/bin/qmake.exe
  24. "/C/MinGW/msys/1.0/bin/make.exe" -f nbproject/Makefile-Debug.mk QMAKE=/C/Qt14/6.1.2/mingw81_64/bin/qmake.exe SUBPROJECTS= .build-conf
  25. make.exe[1]: Entering directory `/c/Users/Patron/Desktop/Code Projects/Sistema_Silo'
  26. /C/Qt14/6.1.2/mingw81_64/bin/qmake.exe VPATH=. -spec win32-g++ -o qttmp-Debug.mk nbproject/qt-Debug.pro
  27. Info: creating stash file C:\Users\Patron\Desktop\Code Projects\Sistema_Silo\.qmake.stash
  28. WARNING: Failure to find: ui_Launcher.h
  29. WARNING: Failure to find: ui_Login V0.2.h
  30. WARNING: Failure to find: ui_framelesswindow.h
  31. mv -f qttmp-Debug.mk nbproject/qt-Debug.mk
  32. "/C/MinGW/msys/1.0/bin/make.exe" -f nbproject/qt-Debug.mk dist/Debug/MinGW64__Qt_6.1.2-Windows/Sistema_Silo_MinGW64__Qt_6.1.2-Windows_V1.1.exe
  33. make.exe[2]: Entering directory `/c/Users/Patron/Desktop/Code Projects/Sistema_Silo'
  34. 'C:\Qt14\6.1.2\mingw81_64\bin\uic.exe' ../Qt-Frameless-Window-DarkStyle/framelesswindow/framelesswindow.ui -o ui_framelesswindow.h
  35. 'C:\Qt14\6.1.2\mingw81_64\bin\uic.exe' Launcher.ui -o ui_Launcher.h
  36. 'C:\Qt14\6.1.2\mingw81_64\bin\uic.exe' "Login V0.2.ui" -o "ui_Login V0.2.h"
  37. 'C:\Qt14\6.1.2\mingw81_64\bin\uic.exe' "Pantalla_Principal V2.6.ui" -o "ui_Pantalla_Principal V2.6.h"
  38. g++ -c -fno-keep-inline-dllexport -g -std=gnu++1z -Wall -Wextra -Wextra -fexceptions -mthreads -DUNICODE -D_UNICODE -DWIN32 -DMINGW_HAS_SECURE_API=1 -DQT_PRINTSUPPORT_LIB -DQT_WIDGETS_LIB -DQT_GUI_LIB -DQT_SQL_LIB -DQT_CORE_LIB -DQT_NEEDS_QMAIN -Inbproject -I. -I../Qt-Frameless-Window-DarkStyle/framelesswindow -I../Qt-Frameless-Window-DarkStyle -I../curl-7.78.0-win64-mingw/include -I../openssl-1.1.1k-win64-mingw/include -IC:/Qt14/6.1.2/mingw81_64/include -IC:/Qt14/6.1.2/mingw81_64/include/QtPrintSupport -IC:/Qt14/6.1.2/mingw81_64/include/QtWidgets -IC:/Qt14/6.1.2/mingw81_64/include/QtGui -IC:/Qt14/6.1.2/mingw81_64/include/QtSql -IC:/Qt14/6.1.2/mingw81_64/include/QtCore -I. -I. -IC:/VulkanSDK/1.0.51.0/Include -IC:/Qt14/6.1.2/mingw81_64/mkspecs/win32-g++ -o build/Debug/MinGW64__Qt_6.1.2-Windows/DarkStyle.o ../Qt-Frameless-Window-DarkStyle/DarkStyle.cpp
  39. In file included from ../Qt-Frameless-Window-DarkStyle/DarkStyle.cpp:14:
  40. ../Qt-Frameless-Window-DarkStyle/DarkStyle.h:18:32: warning: unknown option after '#pragma GCC diagnostic' kind [-Wpragmas]
  41. #pragma GCC diagnostic ignored "-Wdeprecated-copy"
  42. ^~~~~~~~~~~~~~~~~~~
  43. g++ -c -fno-keep-inline-dllexport -g -std=gnu++1z -Wall -Wextra -Wextra -fexceptions -mthreads -DUNICODE -D_UNICODE -DWIN32 -DMINGW_HAS_SECURE_API=1 -DQT_PRINTSUPPORT_LIB -DQT_WIDGETS_LIB -DQT_GUI_LIB -DQT_SQL_LIB -DQT_CORE_LIB -DQT_NEEDS_QMAIN -Inbproject -I. -I../Qt-Frameless-Window-DarkStyle/framelesswindow -I../Qt-Frameless-Window-DarkStyle -I../curl-7.78.0-win64-mingw/include -I../openssl-1.1.1k-win64-mingw/include -IC:/Qt14/6.1.2/mingw81_64/include -IC:/Qt14/6.1.2/mingw81_64/include/QtPrintSupport -IC:/Qt14/6.1.2/mingw81_64/include/QtWidgets -IC:/Qt14/6.1.2/mingw81_64/include/QtGui -IC:/Qt14/6.1.2/mingw81_64/include/QtSql -IC:/Qt14/6.1.2/mingw81_64/include/QtCore -I. -I. -IC:/VulkanSDK/1.0.51.0/Include -IC:/Qt14/6.1.2/mingw81_64/mkspecs/win32-g++ -o build/Debug/MinGW64__Qt_6.1.2-Windows/framelesswindow.o ../Qt-Frameless-Window-DarkStyle/framelesswindow/framelesswindow.cpp
  44. In file included from ./ui_framelesswindow.h:19,
  45. from ../Qt-Frameless-Window-DarkStyle/framelesswindow/framelesswindow.cpp:23:
  46. ../Qt-Frameless-Window-DarkStyle/framelesswindow/windowdragger.h:18:32: warning: unknown option after '#pragma GCC diagnostic' kind [-Wpragmas]
  47. #pragma GCC diagnostic ignored "-Wdeprecated-copy"
  48. ^~~~~~~~~~~~~~~~~~~
  49. ../Qt-Frameless-Window-DarkStyle/framelesswindow/framelesswindow.cpp: In member function 'void FramelessWindow::styleWindow(bool, bool)':
  50. ../Qt-Frameless-Window-DarkStyle/framelesswindow/framelesswindow.cpp:120:17: error: 'class QLayout' has no member named 'setMargin'; did you mean 'setParent'?
  51. layout()->setMargin(15);
  52. ^~~~~~~~~
  53. setParent
  54. ../Qt-Frameless-Window-DarkStyle/framelesswindow/framelesswindow.cpp:136:17: error: 'class QLayout' has no member named 'setMargin'; did you mean 'setParent'?
  55. layout()->setMargin(0);
  56. ^~~~~~~~~
  57. setParent
  58. ../Qt-Frameless-Window-DarkStyle/framelesswindow/framelesswindow.cpp:150:17: error: 'class QLayout' has no member named 'setMargin'; did you mean 'setParent'?
  59. layout()->setMargin(15);
  60. ^~~~~~~~~
  61. setParent
  62. ../Qt-Frameless-Window-DarkStyle/framelesswindow/framelesswindow.cpp:166:17: error: 'class QLayout' has no member named 'setMargin'; did you mean 'setParent'?
  63. layout()->setMargin(0);
  64. ^~~~~~~~~
  65. setParent
  66. ../Qt-Frameless-Window-DarkStyle/framelesswindow/framelesswindow.cpp: In member function 'virtual void FramelessWindow::checkBorderDragging(QMouseEvent*)':
  67. ../Qt-Frameless-Window-DarkStyle/framelesswindow/framelesswindow.cpp:220:48: error: conversion from 'QPointF' to non-scalar type 'QPoint' requested
  68. QPoint globalMousePos = event->globalPosition(); // globalPos();
  69. ~~~~~~~~~~~~~~~~~~~~~^~
  70. ../Qt-Frameless-Window-DarkStyle/framelesswindow/framelesswindow.cpp:229:32: error: 'desktop' is not a member of 'QApplication'
  71. QSize sz = QApplication::desktop()->size(); // Qt 5.11
  72. ^~~~~~~
  73. ../Qt-Frameless-Window-DarkStyle/framelesswindow/framelesswindow.cpp: In member function 'virtual void FramelessWindow::mousePressEvent(QMouseEvent*)':
  74. ../Qt-Frameless-Window-DarkStyle/framelesswindow/framelesswindow.cpp:385:55: warning: 'int QMouseEvent::x() const' is deprecated: Use position() [-Wdeprecated-declarations]
  75. QPoint globalMousePos = mapToGlobal(QPoint(event->x(), event->y()));
  76. ^
  77. In file included from C:/Qt14/6.1.2/mingw81_64/include/QtGui/QMouseEvent:1,
  78. from ../Qt-Frameless-Window-DarkStyle/framelesswindow/windowdragger.h:19,
  79. from ./ui_framelesswindow.h:19,
  80. from ../Qt-Frameless-Window-DarkStyle/framelesswindow/framelesswindow.cpp:23:
  81. C:/Qt14/6.1.2/mingw81_64/include/QtGui/qevent.h:260:16: note: declared here
  82. inline int x() const { return qRound(position().x()); }
  83. ^
  84. ../Qt-Frameless-Window-DarkStyle/framelesswindow/framelesswindow.cpp:385:67: warning: 'int QMouseEvent::y() const' is deprecated: Use position() [-Wdeprecated-declarations]
  85. QPoint globalMousePos = mapToGlobal(QPoint(event->x(), event->y()));
  86. ^
  87. In file included from C:/Qt14/6.1.2/mingw81_64/include/QtGui/QMouseEvent:1,
  88. from ../Qt-Frameless-Window-DarkStyle/framelesswindow/windowdragger.h:19,
  89. from ./ui_framelesswindow.h:19,
  90. from ../Qt-Frameless-Window-DarkStyle/framelesswindow/framelesswindow.cpp:23:
  91. C:/Qt14/6.1.2/mingw81_64/include/QtGui/qevent.h:262:16: note: declared here
  92. inline int y() const { return qRound(position().y()); }
  93. ^
  94. make.exe[2]: *** [build/Debug/MinGW64__Qt_6.1.2-Windows/framelesswindow.o] Error 1
  95. make.exe[2]: Leaving directory `/c/Users/Patron/Desktop/Code Projects/Sistema_Silo'
  96. make.exe[1]: *** [.build-conf] Error 2
  97. make.exe[1]: Leaving directory `/c/Users/Patron/Desktop/Code Projects/Sistema_Silo'
  98. make.exe": *** [.build-impl] Error 2
  99.  
  100. BUILD FAILED (exit value 2, total time: 16s)
  101.  
Advertisement
Add Comment
Please, Sign In to add comment