Not a member of Pastebin yet?
Sign Up,
it unlocks many cool features!
- dmap-mdns-browser-avahi.c:50:2: error: unknown type name 'AvahiServiceBrowser'
- AvahiServiceBrowser *service_browser;
- ^
- dmap-mdns-browser-avahi.c:71:25: error: unknown type name 'AvahiServiceResolver'
- static void resolve_cb (AvahiServiceResolver * service_resolver,
- ^
- mv -f .deps/libdmapsharing_3_0_la-dmap-share.Tpo .deps/libdmapsharing_3_0_la-dmap-share.Plo
- dmap-mdns-browser-avahi.c:93:24: error: unknown type name 'AvahiServiceBrowser'
- static void browse_cb (AvahiServiceBrowser * service_browser,
- ^
- dmap-mdns-browser-avahi.c:175:14: error: use of undeclared identifier 'avahi_service_resolver_free'
- (GFunc) avahi_service_resolver_free, NULL);
- ^
- dmap-mdns-browser-avahi.c:180:3: warning: implicit declaration of function 'avahi_service_browser_free' is invalid in C99 [-Wimplicit-function-declaration]
- avahi_service_browser_free (browser->priv->service_browser);
- ^
- dmap-mdns-browser-avahi.c:234:3: warning: implicit declaration of function 'avahi_service_browser_new' is invalid in C99 [-Wimplicit-function-declaration]
- avahi_service_browser_new (browser->priv->client,
- ^
- dmap-mdns-browser-avahi.c:243:10: error: use of undeclared identifier 'AvahiServiceBrowserCallback'
- (AvahiServiceBrowserCallback)
- ^
- dmap-mdns-browser-avahi.c:317:7: warning: unused variable 'error' [-Wunused-variable]
- gint error = 0;
- ^
- dmap-gst-input-stream.c:310:22: warning: multiple unsequenced modifications to 'end_time' [-Wunsequenced]
- end_time = end_time = g_get_monotonic_time () + QUEUE_POP_WAIT_SECONDS * G_TIME_SPAN_SECOND;
- ~ ^
- dmap-mdns-browser-avahi.c:346:13: error: unknown type name 'AvahiServiceResolver'
- resolve_cb (AvahiServiceResolver * service_resolver,
- ^
- dmap-mdns-browser-avahi.c:374:8: warning: implicit declaration of function 'avahi_service_resolver_get_client' is invalid in C99 [-Wimplicit-function-declaration]
- (avahi_service_resolver_get_client
- ^
- dmap-mdns-browser-avahi.c:455:2: warning: implicit declaration of function 'avahi_service_resolver_free' is invalid in C99 [-Wimplicit-function-declaration]
- avahi_service_resolver_free (service_resolver);
- ^
- dmap-mdns-browser-avahi.c:462:2: error: use of undeclared identifier 'AvahiServiceResolver'
- AvahiServiceResolver *service_resolver;
- ^
- dmap-mdns-browser-avahi.c:462:24: error: use of undeclared identifier 'service_resolver'
- AvahiServiceResolver *service_resolver;
- ^
- dmap-mdns-browser-avahi.c:464:2: error: use of undeclared identifier 'service_resolver'
- service_resolver = avahi_service_resolver_new (browser->priv->client,
- ^
- dmap-mdns-browser-avahi.c:464:21: warning: implicit declaration of function 'avahi_service_resolver_new' is invalid in C99 [-Wimplicit-function-declaration]
- service_resolver = avahi_service_resolver_new (browser->priv->client,
- ^
- dmap-mdns-browser-avahi.c:476:15: error: use of undeclared identifier 'AvahiServiceResolverCallback'
- (AvahiServiceResolverCallback) resolve_cb, browser);
- ^
- dmap-mdns-browser-avahi.c:477:6: error: use of undeclared identifier 'service_resolver'
- if (service_resolver == NULL) {
- ^
- mv -f .deps/libdmapsharing_3_0_la-dmap-gst-qt-input-stream.Tpo .deps/libdmapsharing_3_0_la-dmap-gst-qt-input-stream.Plo
- dmap-mdns-browser-avahi.c:483:46: error: use of undeclared identifier 'service_resolver'
- g_slist_prepend (browser->priv->resolvers, service_resolver);
- ^
- dmap-mdns-browser-avahi.c:504:12: error: unknown type name 'AvahiServiceBrowser'
- browse_cb (AvahiServiceBrowser * service_browser,
- ^
- 6 warnings and 13 errors generated.
- gmake[4]: *** [libdmapsharing_3_0_la-dmap-mdns-browser-avahi.lo] Error 1
- gmake[4]: *** Waiting for unfinished jobs....
- 1 warning generated.
- mv -f .deps/libdmapsharing_3_0_la-dmap-gst-mp3-input-stream.Tpo .deps/libdmapsharing_3_0_la-dmap-gst-mp3-input-stream.Plo
- mv -f .deps/libdmapsharing_3_0_la-dmap-gst-input-stream.Tpo .deps/libdmapsharing_3_0_la-dmap-gst-input-stream.Plo
- mv -f .deps/libdmapsharing_3_0_la-dmap-gst-wav-input-stream.Tpo .deps/libdmapsharing_3_0_la-dmap-gst-wav-input-stream.Plo
- mv -f .deps/libdmapsharing_3_0_la-gst-util.Tpo .deps/libdmapsharing_3_0_la-gst-util.Plo
- gmake[4]: Leaving directory `/wrkdirs/usr/ports/net/libdmapsharing/work/libdmapsharing-2.9.24/libdmapsharing'
- gmake[3]: *** [all] Error 2
- gmake[3]: Leaving directory `/wrkdirs/usr/ports/net/libdmapsharing/work/libdmapsharing-2.9.24/libdmapsharing'
- gmake[2]: *** [all-recursive] Error 1
- gmake[2]: Leaving directory `/wrkdirs/usr/ports/net/libdmapsharing/work/libdmapsharing-2.9.24'
- gmake[1]: *** [all] Error 2
- gmake[1]: Leaving directory `/wrkdirs/usr/ports/net/libdmapsharing/work/libdmapsharing-2.9.24'
- ===> Compilation failed unexpectedly.
- Try to set MAKE_JOBS_UNSAFE=yes and rebuild before reporting the failure to
Advertisement
Add Comment
Please, Sign In to add comment