Mhermank

logsss

Oct 19th, 2021
751
Never
Not a member of Pastebin yet? Sign Up, it unlocks many cool features!
  1. ------------------------------------------------------
  2.  T E S T S
  3. -------------------------------------------------------
  4. Running org.openmrs.contrib.qaframework.RunTest
  5. Running locally...
  6. log4j:WARN No appenders could be found for logger (io.netty.util.internal.logging.InternalLoggerFactory).
  7. log4j:WARN Please initialize the log4j system properly.
  8. log4j:WARN See http://logging.apache.org/log4j/1.2/faq.html#noconfig for more info.
  9. Starting ChromeDriver 93.0.4577.63 (ff5c0da2ec0adeaed5550e6c7e98417dac77d98a-refs/branch-heads/4577@{#1135}) on port 31399
  10. Only local connections are allowed.
  11. Please see https://chromedriver.chromium.org/security-considerations for suggestions on keeping ChromeDriver safe.
  12. ChromeDriver was started successfully.
  13. Oct 19, 2021 11:24:23 AM org.openqa.selenium.remote.ProtocolHandshake createSession
  14. INFO: Detected dialect: W3C
  15. Running locally...
  16. Starting ChromeDriver 93.0.4577.63 (ff5c0da2ec0adeaed5550e6c7e98417dac77d98a-refs/branch-heads/4577@{#1135}) on port 5373
  17. Only local connections are allowed.
  18. Please see https://chromedriver.chromium.org/security-considerations for suggestions on keeping ChromeDriver safe.
  19. ChromeDriver was started successfully.
  20. Oct 19, 2021 11:24:40 AM org.openqa.selenium.remote.ProtocolHandshake createSession
  21. INFO: Detected dialect: W3C
  22. Running locally...
  23. Starting ChromeDriver 93.0.4577.63 (ff5c0da2ec0adeaed5550e6c7e98417dac77d98a-refs/branch-heads/4577@{#1135}) on port 6033
  24. Only local connections are allowed.
  25. Please see https://chromedriver.chromium.org/security-considerations for suggestions on keeping ChromeDriver safe.
  26. ChromeDriver was started successfully.
  27. Oct 19, 2021 11:24:42 AM org.openqa.selenium.remote.ProtocolHandshake createSession
  28. INFO: Detected dialect: W3C
  29. Running locally...
  30. Starting ChromeDriver 93.0.4577.63 (ff5c0da2ec0adeaed5550e6c7e98417dac77d98a-refs/branch-heads/4577@{#1135}) on port 16756
  31. Only local connections are allowed.
  32. Please see https://chromedriver.chromium.org/security-considerations for suggestions on keeping ChromeDriver safe.
  33. ChromeDriver was started successfully.
  34. Oct 19, 2021 11:24:52 AM org.openqa.selenium.remote.ProtocolHandshake createSession
  35. INFO: Detected dialect: W3C
  36. Running locally...
  37. Starting ChromeDriver 93.0.4577.63 (ff5c0da2ec0adeaed5550e6c7e98417dac77d98a-refs/branch-heads/4577@{#1135}) on port 4777
  38. Only local connections are allowed.
  39. Please see https://chromedriver.chromium.org/security-considerations for suggestions on keeping ChromeDriver safe.
  40. ChromeDriver was started successfully.
  41. Oct 19, 2021 11:24:54 AM org.openqa.selenium.remote.ProtocolHandshake createSession
  42. INFO: Detected dialect: W3C
  43. Running locally...
  44. Starting ChromeDriver 93.0.4577.63 (ff5c0da2ec0adeaed5550e6c7e98417dac77d98a-refs/branch-heads/4577@{#1135}) on port 16354
  45. Only local connections are allowed.
  46. Please see https://chromedriver.chromium.org/security-considerations for suggestions on keeping ChromeDriver safe.
  47. ChromeDriver was started successfully.
  48. Oct 19, 2021 11:28:01 AM org.openqa.selenium.remote.ProtocolHandshake createSession
  49. INFO: Detected dialect: W3C
  50. Tests run: 3, Failures: 0, Errors: 1, Skipped: 0, Time elapsed: 282.576 sec <<< FAILURE!
  51. Delete first condition(Patient's Conditions Managment)  Time elapsed: 247.286 sec  <<< ERROR!
  52. org.openqa.selenium.remote.UnreachableBrowserException: Error communicating with the remote browser. It may have died.
  53. Build info: version: '4.0.0-alpha-6', revision: '5f43a29cfc'
  54. System info: host: 'mherman22', ip: '192.168.43.144', os.name: 'Linux', os.arch: 'amd64', os.version: '5.11.0-37-generic', java.version: '1.8.0_292'
  55. Driver info: driver.version: RemoteWebDriver
  56. Capabilities {acceptInsecureCerts: false, browserName: chrome, browserVersion: 93.0.4577.82, chrome: {chromedriverVersion: 93.0.4577.63 (ff5c0da2ec0ad..., userDataDir: /tmp/.com.google.Chrome.idWOoa}, goog:chromeOptions: {debuggerAddress: localhost:44861}, javascriptEnabled: true, networkConnectionEnabled: false, pageLoadStrategy: normal, platform: LINUX, platformName: LINUX, proxy: Proxy(), setWindowRect: true, strictFileInteractability: false, timeouts: {implicit: 0, pageLoad: 300000, script: 30000}, unhandledPromptBehavior: dismiss and notify, webauthn:extension:credBlob: true, webauthn:extension:largeBlob: true, webauthn:virtualAuthenticators: true}
  57. Session ID: 9e7fd97f09d2b343e9761f2ee3efef7a
  58.     at org.openqa.selenium.remote.RemoteWebDriver.execute(RemoteWebDriver.java:603)
  59.     at org.openqa.selenium.remote.RemoteWebDriver.findElement(RemoteWebDriver.java:333)
  60.     at org.openqa.selenium.remote.RemoteWebDriver.findElementByCssSelector(RemoteWebDriver.java:441)
  61.     at org.openqa.selenium.By$ByCssSelector.findElement(By.java:494)
  62.     at org.openqa.selenium.remote.RemoteWebDriver.findElement(RemoteWebDriver.java:325)
  63.     at org.openmrs.contrib.qaframework.automation.ConditionsSteps.delete(ConditionsSteps.java:175)
  64.     at ✽.User clicks delete condition(file:///home/mherman22/Documents/qaTests/openmrs-contrib-qaframework/src/test/resources/features/refapp-2.x/12-condition/conditions.feature:47)
  65. Caused by: java.lang.RuntimeException: NettyHttpHandler request execution error
  66.     at org.openqa.selenium.remote.http.netty.NettyHttpHandler.makeCall(NettyHttpHandler.java:72)
  67.     at org.openqa.selenium.remote.http.AddSeleniumUserAgent.lambda$apply$0(AddSeleniumUserAgent.java:42)
  68.     at org.openqa.selenium.remote.http.Filter.lambda$andFinally$1(Filter.java:56)
  69.     at org.openqa.selenium.remote.http.netty.NettyHttpHandler.execute(NettyHttpHandler.java:47)
  70.     at org.openqa.selenium.remote.http.AddSeleniumUserAgent.lambda$apply$0(AddSeleniumUserAgent.java:42)
  71.     at org.openqa.selenium.remote.http.Filter.lambda$andFinally$1(Filter.java:56)
  72.     at org.openqa.selenium.remote.http.netty.NettyClient.execute(NettyClient.java:55)
  73.     at org.openqa.selenium.remote.HttpCommandExecutor.execute(HttpCommandExecutor.java:157)
  74.     at org.openqa.selenium.remote.service.DriverCommandExecutor.execute(DriverCommandExecutor.java:83)
  75.     at org.openqa.selenium.remote.RemoteWebDriver.execute(RemoteWebDriver.java:582)
  76.     at org.openqa.selenium.remote.RemoteWebDriver.findElement(RemoteWebDriver.java:333)
  77.     at org.openqa.selenium.remote.RemoteWebDriver.findElementByCssSelector(RemoteWebDriver.java:441)
  78.     at org.openqa.selenium.By$ByCssSelector.findElement(By.java:494)
  79.     at org.openqa.selenium.remote.RemoteWebDriver.findElement(RemoteWebDriver.java:325)
  80.     at org.openmrs.contrib.qaframework.automation.ConditionsSteps.delete(ConditionsSteps.java:173)
  81.     at sun.reflect.NativeMethodAccessorImpl.invoke0(Native Method)
  82.     at sun.reflect.NativeMethodAccessorImpl.invoke(NativeMethodAccessorImpl.java:62)
  83.     at sun.reflect.DelegatingMethodAccessorImpl.invoke(DelegatingMethodAccessorImpl.java:43)
  84.     at java.lang.reflect.Method.invoke(Method.java:498)
  85.     at io.cucumber.java.Invoker.doInvoke(Invoker.java:66)
  86.     at io.cucumber.java.Invoker.invoke(Invoker.java:24)
  87.     at io.cucumber.java.AbstractGlueDefinition.invokeMethod(AbstractGlueDefinition.java:47)
  88.     at io.cucumber.java.JavaStepDefinition.execute(JavaStepDefinition.java:29)
  89.     at io.cucumber.core.runner.CoreStepDefinition.execute(CoreStepDefinition.java:66)
  90.     at io.cucumber.core.runner.PickleStepDefinitionMatch.runStep(PickleStepDefinitionMatch.java:63)
  91.     at io.cucumber.core.runner.ExecutionMode$1.execute(ExecutionMode.java:10)
  92.     at io.cucumber.core.runner.TestStep.executeStep(TestStep.java:92)
  93.     at io.cucumber.core.runner.TestStep.run(TestStep.java:64)
  94.     at io.cucumber.core.runner.PickleStepTestStep.run(PickleStepTestStep.java:51)
  95.     at io.cucumber.core.runner.TestCase.run(TestCase.java:104)
  96.     at io.cucumber.core.runner.Runner.runPickle(Runner.java:71)
  97.     at io.cucumber.junit.PickleRunners$NoStepDescriptions.run(PickleRunners.java:151)
  98.     at io.cucumber.junit.FeatureRunner.runChild(FeatureRunner.java:135)
  99.     at io.cucumber.junit.FeatureRunner.runChild(FeatureRunner.java:27)
  100.     at org.junit.runners.ParentRunner$4.run(ParentRunner.java:331)
  101.     at org.junit.runners.ParentRunner$1.schedule(ParentRunner.java:79)
  102.     at org.junit.runners.ParentRunner.runChildren(ParentRunner.java:329)
  103.     at org.junit.runners.ParentRunner.access$100(ParentRunner.java:66)
  104.     at org.junit.runners.ParentRunner$2.evaluate(ParentRunner.java:293)
  105.     at org.junit.runners.ParentRunner$3.evaluate(ParentRunner.java:306)
  106.     at org.junit.runners.ParentRunner.run(ParentRunner.java:413)
  107.     at io.cucumber.junit.Cucumber.runChild(Cucumber.java:199)
  108.     at io.cucumber.junit.Cucumber.runChild(Cucumber.java:90)
  109.     at org.junit.runners.ParentRunner$4.run(ParentRunner.java:331)
  110.     at org.junit.runners.ParentRunner$1.schedule(ParentRunner.java:79)
  111.     at org.junit.runners.ParentRunner.runChildren(ParentRunner.java:329)
  112.     at org.junit.runners.ParentRunner.access$100(ParentRunner.java:66)
  113.     at org.junit.runners.ParentRunner$2.evaluate(ParentRunner.java:293)
  114.     at io.cucumber.junit.Cucumber$RunCucumber.evaluate(Cucumber.java:234)
  115.     at org.junit.runners.ParentRunner$3.evaluate(ParentRunner.java:306)
  116.     at org.junit.runners.ParentRunner.run(ParentRunner.java:413)
  117.     at org.apache.maven.surefire.junit4.JUnit4Provider.execute(JUnit4Provider.java:252)
  118.     at org.apache.maven.surefire.junit4.JUnit4Provider.executeTestSet(JUnit4Provider.java:141)
  119.     at org.apache.maven.surefire.junit4.JUnit4Provider.invoke(JUnit4Provider.java:112)
  120.     at sun.reflect.NativeMethodAccessorImpl.invoke0(Native Method)
  121.     at sun.reflect.NativeMethodAccessorImpl.invoke(NativeMethodAccessorImpl.java:62)
  122.     at sun.reflect.DelegatingMethodAccessorImpl.invoke(DelegatingMethodAccessorImpl.java:43)
  123.     at java.lang.reflect.Method.invoke(Method.java:498)
  124.     at org.apache.maven.surefire.util.ReflectionUtils.invokeMethodWithArray(ReflectionUtils.java:189)
  125.     at org.apache.maven.surefire.booter.ProviderFactory$ProviderProxy.invoke(ProviderFactory.java:165)
  126.     at org.apache.maven.surefire.booter.ProviderFactory.invokeProvider(ProviderFactory.java:85)
  127.     at org.apache.maven.surefire.booter.ForkedBooter.runSuitesInProcess(ForkedBooter.java:115)
  128.     at org.apache.maven.surefire.booter.ForkedBooter.main(ForkedBooter.java:75)
  129. Caused by: java.util.concurrent.ExecutionException: java.util.concurrent.TimeoutException: Request timeout to localhost/127.0.0.1:4777 after 60000 ms
  130.     at java.util.concurrent.CompletableFuture.reportGet(CompletableFuture.java:357)
  131.     at java.util.concurrent.CompletableFuture.get(CompletableFuture.java:1908)
  132.     at org.asynchttpclient.netty.NettyResponseFuture.get(NettyResponseFuture.java:201)
  133.     at org.openqa.selenium.remote.http.netty.NettyHttpHandler.makeCall(NettyHttpHandler.java:57)
  134.     ... 62 more
  135. Caused by: java.util.concurrent.TimeoutException: Request timeout to localhost/127.0.0.1:4777 after 60000 ms
  136.     at org.asynchttpclient.netty.timeout.TimeoutTimerTask.expire(TimeoutTimerTask.java:43)
  137.     at org.asynchttpclient.netty.timeout.RequestTimeoutTimerTask.run(RequestTimeoutTimerTask.java:50)
  138.     at io.netty.util.HashedWheelTimer$HashedWheelTimeout.expire(HashedWheelTimer.java:672)
  139.     at io.netty.util.HashedWheelTimer$HashedWheelBucket.expireTimeouts(HashedWheelTimer.java:747)
  140.     at io.netty.util.HashedWheelTimer$Worker.run(HashedWheelTimer.java:472)
  141.     at io.netty.util.concurrent.FastThreadLocalRunnable.run(FastThreadLocalRunnable.java:30)
  142.     at java.lang.Thread.run(Thread.java:748)
  143.  
  144.  
  145. Results :
  146.  
  147. Tests in error:
  148.  Delete first condition(Patient's Conditions Managment): Error communicating with the remote browser. It may have died.(..)
  149.  
  150. Tests run: 3, Failures: 0, Errors: 1, Skipped: 0
  151.  
  152. [INFO] ------------------------------------------------------------------------
  153. [INFO] BUILD FAILURE
  154. [INFO] ------------------------------------------------------------------------
  155. [INFO] Total time:  04:51 min
  156. [INFO] Finished at: 2021-10-19T11:29:01+03:00
  157. [INFO] ------------------------------------------------------------------------
  158. [ERROR] Failed to execute goal org.apache.maven.plugins:maven-surefire-plugin:2.12.4:test (default-test) on project qaframework: There are test failures.
  159. [ERROR]
  160. [ERROR] Please refer to /home/mherman22/Documents/qaTests/openmrs-contrib-qaframework/target/surefire-reports for the individual test results.
  161. [ERROR] -> [Help 1]
  162. [ERROR]
  163. [ERROR] To see the full stack trace of the errors, re-run Maven with the -e switch.
  164. [ERROR] Re-run Maven using the -X switch to enable full debug logging.
  165. [ERROR]
  166. [ERROR] For more information about the errors and possible solutions, please read the following articles:
  167. [ERROR] [Help 1] http://cwiki.apache.org/confluence/display/MAVEN/MojoFailureException
  168. npm ERR! code ELIFECYCLE
  169. npm ERR! errno 1
  170. npm ERR! openmrs-contrib-qaframework@0.1.0 refapp2Conditions: `mvn test -Dcucumber.filter.tags='@selenium and @conditions'`
  171. npm ERR! Exit status 1
  172. npm ERR!
  173. npm ERR! Failed at the openmrs-contrib-qaframework@0.1.0 refapp2Conditions script.
  174. npm ERR! This is probably not a problem with npm. There is likely additional logging output above.
  175. npm WARN Local package.json exists, but node_modules missing, did you mean to install?
  176.  
  177. npm ERR! A complete log of this run can be found in:
  178. npm ERR!     /home/mherman22/.npm/_logs/2021-10-19T08_29_01_496Z-debug.log
  179.  
RAW Paste Data