Advertisement
ODORA

Untitled

Jul 14th, 2019
111
Never
Not a member of Pastebin yet? Sign Up, it unlocks many cool features!
text 71.40 KB | None
  1. [INFO] Scanning for projects...
  2. [INFO] ------------------------------------------------------------------------
  3. [INFO] Reactor Build Order:
  4. [INFO]
  5. [INFO] OpenMRS [pom]
  6. [INFO] openmrs-tools [jar]
  7. [INFO] openmrs-test [pom]
  8. [INFO] openmrs-api [jar]
  9. [INFO] openmrs-web [jar]
  10. [INFO] openmrs-webapp [war]
  11. [INFO] Downloading from : http://mavenrepo.openmrs.org/nexus/content/repositories/public/org/eclipse/m2e/lifecycle-mapping/1.0.0/lifecycle-mapping-1.0.0.pom
  12. [INFO] Downloading from : https://dl.bintray.com/openmrs/maven/org/eclipse/m2e/lifecycle-mapping/1.0.0/lifecycle-mapping-1.0.0.pom
  13. [WARNING] The POM for org.eclipse.m2e:lifecycle-mapping:jar:1.0.0 is missing, no dependency information available
  14. [INFO] Downloading from : http://mavenrepo.openmrs.org/nexus/content/repositories/public/org/eclipse/m2e/lifecycle-mapping/1.0.0/lifecycle-mapping-1.0.0.jar
  15. [INFO] Downloading from : https://dl.bintray.com/openmrs/maven/org/eclipse/m2e/lifecycle-mapping/1.0.0/lifecycle-mapping-1.0.0.jar
  16. [WARNING] Failed to retrieve plugin descriptor for org.eclipse.m2e:lifecycle-mapping:1.0.0: Plugin org.eclipse.m2e:lifecycle-mapping:1.0.0 or one of its dependencies could not be resolved: Could not find artifact org.eclipse.m2e:lifecycle-mapping:jar:1.0.0 in openmrs-repo (http://mavenrepo.openmrs.org/nexus/content/repositories/public)
  17. [INFO] Downloading from : https://dl.bintray.com/openmrs/maven/org/apache/maven/plugins/maven-metadata.xml
  18. [INFO] Downloading from : https://dl.bintray.com/openmrs/maven/org/codehaus/mojo/maven-metadata.xml
  19. [INFO]
  20. [INFO] ------------------------< org.openmrs:openmrs >-------------------------
  21. [INFO] Building OpenMRS 2.3.0-SNAPSHOT [1/6]
  22. [INFO] --------------------------------[ pom ]---------------------------------
  23. [INFO]
  24. [INFO] --- maven-clean-plugin:2.5:clean (default-clean) @ openmrs ---
  25. [INFO] Deleting C:\Users\Admin\core\target
  26. [INFO]
  27. [INFO] --- buildnumber-maven-plugin:1.1:create (default) @ openmrs ---
  28. [INFO] Checking for local modifications: skipped.
  29. [INFO] Updating project files from SCM: skipped.
  30. [INFO] ShortRevision tag detected. The value is '6'.
  31. [INFO] Executing: cmd.exe /X /C "git rev-parse --verify --short=6 HEAD"
  32. [INFO] Working directory: C:\Users\Admin\core
  33. [INFO] Storing buildNumber: 0f4ac9 at timestamp: 1563128766822
  34. [INFO] ShortRevision tag detected. The value is '6'.
  35. [INFO] Executing: cmd.exe /X /C "git rev-parse --verify --short=6 HEAD"
  36. [INFO] Working directory: C:\Users\Admin\core
  37. [INFO] Storing buildScmBranch: UNKNOWN
  38. [INFO]
  39. [INFO] --- build-helper-maven-plugin:1.5:parse-version (parse-version) @ openmrs ---
  40. [INFO]
  41. [INFO] --- maven-jar-plugin:2.3.2:test-jar (default) @ openmrs ---
  42. [WARNING] JAR will be empty - no content was marked for inclusion!
  43. [INFO] Building jar: C:\Users\Admin\core\target\openmrs-2.3.0-SNAPSHOT-tests.jar
  44. [INFO]
  45. [INFO] --- license-maven-plugin:3.0:check (default) @ openmrs ---
  46. [INFO] Checking licenses...
  47. [INFO]
  48. [INFO] --- maven-install-plugin:2.4:install (default-install) @ openmrs ---
  49. [INFO] Installing C:\Users\Admin\core\pom.xml to C:\Users\Admin\.m2\repository\org\openmrs\openmrs\2.3.0-SNAPSHOT\openmrs-2.3.0-SNAPSHOT.pom
  50. [INFO] Installing C:\Users\Admin\core\target\openmrs-2.3.0-SNAPSHOT-tests.jar to C:\Users\Admin\.m2\repository\org\openmrs\openmrs\2.3.0-SNAPSHOT\openmrs-2.3.0-SNAPSHOT-tests.jar
  51. [INFO]
  52. [INFO] ------------------< org.openmrs.tools:openmrs-tools >-------------------
  53. [INFO] Building openmrs-tools 2.3.0-SNAPSHOT [2/6]
  54. [INFO] --------------------------------[ jar ]---------------------------------
  55. [INFO]
  56. [INFO] --- maven-clean-plugin:2.5:clean (default-clean) @ openmrs-tools ---
  57. [INFO] Deleting C:\Users\Admin\core\tools\target
  58. [INFO]
  59. [INFO] --- buildnumber-maven-plugin:1.1:create (default) @ openmrs-tools ---
  60. [INFO]
  61. [INFO] --- build-helper-maven-plugin:1.5:parse-version (parse-version) @ openmrs-tools ---
  62. [INFO]
  63. [INFO] --- maven-resources-plugin:2.4:resources (default-resources) @ openmrs-tools ---
  64. [INFO] Using 'UTF-8' encoding to copy filtered resources.
  65. [INFO] Copying 4 resources
  66. [INFO]
  67. [INFO] --- maven-compiler-plugin:2.1:compile (default-compile) @ openmrs-tools ---
  68. [INFO] Compiling 1 source file to C:\Users\Admin\core\tools\target\classes
  69. [INFO]
  70. [INFO] --- maven-resources-plugin:2.4:testResources (default-testResources) @ openmrs-tools ---
  71. [INFO] Using 'UTF-8' encoding to copy filtered resources.
  72. [INFO] skip non existing resourceDirectory C:\Users\Admin\core\tools\src\test\resources
  73. [INFO]
  74. [INFO] --- maven-compiler-plugin:2.1:testCompile (default-testCompile) @ openmrs-tools ---
  75. [INFO] No sources to compile
  76. [INFO]
  77. [INFO] --- maven-surefire-plugin:2.18.1:test (default-test) @ openmrs-tools ---
  78. [INFO] No tests to run.
  79. [INFO]
  80. [INFO] --- maven-jar-plugin:2.3.2:jar (default-jar) @ openmrs-tools ---
  81. [INFO] Building jar: C:\Users\Admin\core\tools\target\openmrs-tools-2.3.0-SNAPSHOT.jar
  82. [INFO]
  83. [INFO] --- maven-jar-plugin:2.3.2:test-jar (default) @ openmrs-tools ---
  84. [WARNING] JAR will be empty - no content was marked for inclusion!
  85. [INFO] Building jar: C:\Users\Admin\core\tools\target\openmrs-tools-2.3.0-SNAPSHOT-tests.jar
  86. [INFO]
  87. [INFO] --- license-maven-plugin:3.0:check (default) @ openmrs-tools ---
  88. [INFO] Checking licenses...
  89. [INFO]
  90. [INFO] --- maven-install-plugin:2.4:install (default-install) @ openmrs-tools ---
  91. [INFO] Installing C:\Users\Admin\core\tools\target\openmrs-tools-2.3.0-SNAPSHOT.jar to C:\Users\Admin\.m2\repository\org\openmrs\tools\openmrs-tools\2.3.0-SNAPSHOT\openmrs-tools-2.3.0-SNAPSHOT.jar
  92. [INFO] Installing C:\Users\Admin\core\tools\pom.xml to C:\Users\Admin\.m2\repository\org\openmrs\tools\openmrs-tools\2.3.0-SNAPSHOT\openmrs-tools-2.3.0-SNAPSHOT.pom
  93. [INFO] Installing C:\Users\Admin\core\tools\target\openmrs-tools-2.3.0-SNAPSHOT-tests.jar to C:\Users\Admin\.m2\repository\org\openmrs\tools\openmrs-tools\2.3.0-SNAPSHOT\openmrs-tools-2.3.0-SNAPSHOT-tests.jar
  94. [INFO]
  95. [INFO] -------------------< org.openmrs.test:openmrs-test >--------------------
  96. [INFO] Building openmrs-test 2.3.0-SNAPSHOT [3/6]
  97. [INFO] --------------------------------[ pom ]---------------------------------
  98. [INFO]
  99. [INFO] --- maven-clean-plugin:2.5:clean (default-clean) @ openmrs-test ---
  100. [INFO] Deleting C:\Users\Admin\core\test\target
  101. [INFO]
  102. [INFO] --- buildnumber-maven-plugin:1.1:create (default) @ openmrs-test ---
  103. [INFO]
  104. [INFO] --- build-helper-maven-plugin:1.5:parse-version (parse-version) @ openmrs-test ---
  105. [INFO]
  106. [INFO] --- maven-jar-plugin:2.3.2:test-jar (default) @ openmrs-test ---
  107. [WARNING] JAR will be empty - no content was marked for inclusion!
  108. [INFO] Building jar: C:\Users\Admin\core\test\target\openmrs-test-2.3.0-SNAPSHOT-tests.jar
  109. [INFO]
  110. [INFO] --- license-maven-plugin:3.0:check (default) @ openmrs-test ---
  111. [INFO] Checking licenses...
  112. [INFO]
  113. [INFO] --- maven-install-plugin:2.4:install (default-install) @ openmrs-test ---
  114. [INFO] Installing C:\Users\Admin\core\test\pom.xml to C:\Users\Admin\.m2\repository\org\openmrs\test\openmrs-test\2.3.0-SNAPSHOT\openmrs-test-2.3.0-SNAPSHOT.pom
  115. [INFO] Installing C:\Users\Admin\core\test\target\openmrs-test-2.3.0-SNAPSHOT-tests.jar to C:\Users\Admin\.m2\repository\org\openmrs\test\openmrs-test\2.3.0-SNAPSHOT\openmrs-test-2.3.0-SNAPSHOT-tests.jar
  116. [INFO]
  117. [INFO] --------------------< org.openmrs.api:openmrs-api >---------------------
  118. [INFO] Building openmrs-api 2.3.0-SNAPSHOT [4/6]
  119. [INFO] --------------------------------[ jar ]---------------------------------
  120. [INFO]
  121. [INFO] --- maven-clean-plugin:2.5:clean (default-clean) @ openmrs-api ---
  122. [INFO] Deleting C:\Users\Admin\core\api\target
  123. [INFO]
  124. [INFO] --- buildnumber-maven-plugin:1.1:create (default) @ openmrs-api ---
  125. [INFO]
  126. [INFO] --- build-helper-maven-plugin:1.5:parse-version (parse-version) @ openmrs-api ---
  127. [INFO]
  128. [INFO] --- jacoco-maven-plugin:0.8.0:prepare-agent (prepare-agent) @ openmrs-api ---
  129. [INFO] argLine set to -javaagent:C:\\Users\\Admin\\.m2\\repository\\org\\jacoco\\org.jacoco.agent\\0.8.0\\org.jacoco.agent-0.8.0-runtime.jar=destfile=C:\\Users\\Admin\\core\\api\\target\\jacoco.exec,includes=org/openmrs/** -Duser.language=en -Duser.region=US -Xmx2g
  130. [INFO]
  131. [INFO] --- maven-java-formatter-plugin:0.3:format (default) @ openmrs-api ---
  132. [INFO] Using 'UTF-8' encoding to format source files.
  133. [INFO] Number of files to be formatted: 1031
  134. [INFO] Successfully formatted: 0 file(s)
  135. [INFO] Fail to format : 0 file(s)
  136. [INFO] Skipped : 1031 file(s)
  137. [INFO] Approximate time taken: 16s
  138. [INFO]
  139. [INFO] --- maven-resources-plugin:2.4:resources (default-resources) @ openmrs-api ---
  140. [INFO] Using 'UTF-8' encoding to copy filtered resources.
  141. [INFO] Copying 1 resource
  142. [INFO] Copying 132 resources
  143. [INFO]
  144. [INFO] --- maven-compiler-plugin:2.1:compile (default-compile) @ openmrs-api ---
  145. [INFO] Compiling 697 source files to C:\Users\Admin\core\api\target\classes
  146. [INFO]
  147. [INFO] --- maven-resources-plugin:2.4:testResources (default-testResources) @ openmrs-api ---
  148. [INFO] Using 'UTF-8' encoding to copy filtered resources.
  149. [INFO] Copying 141 resources
  150. [INFO]
  151. [INFO] --- maven-compiler-plugin:2.1:testCompile (default-testCompile) @ openmrs-api ---
  152. [INFO] Compiling 334 source files to C:\Users\Admin\core\api\target\test-classes
  153. [INFO]
  154. [INFO] --- maven-surefire-plugin:2.18.1:test (default-test) @ openmrs-api ---
  155. [INFO] Surefire report directory: C:\Users\Admin\core\api\target\surefire-reports
  156.  
  157. -------------------------------------------------------
  158. T E S T S
  159. -------------------------------------------------------
  160. Running org.openmrs.AllergenTest
  161. Tests run: 6, Failures: 0, Errors: 0, Skipped: 0, Time elapsed: 63.234 sec - in org.openmrs.AllergenTest
  162. Running org.openmrs.AllergiesTest
  163. Tests run: 26, Failures: 0, Errors: 0, Skipped: 0, Time elapsed: 2.052 sec - in org.openmrs.AllergiesTest
  164. Running org.openmrs.annotation.OpenmrsProfileExcludeFilterTest
  165. Tests run: 8, Failures: 0, Errors: 0, Skipped: 2, Time elapsed: 0.462 sec - in org.openmrs.annotation.OpenmrsProfileExcludeFilterTest
  166. Running org.openmrs.annotation.OpenmrsProfileExcludeFilterWithModulesTest
  167. Tests run: 1, Failures: 0, Errors: 0, Skipped: 0, Time elapsed: 19.138 sec - in org.openmrs.annotation.OpenmrsProfileExcludeFilterWithModulesTest
  168. Running org.openmrs.annotation.OpenmrsProfileIncludeFilterTest
  169. Tests run: 2, Failures: 0, Errors: 0, Skipped: 0, Time elapsed: 3.51 sec - in org.openmrs.annotation.OpenmrsProfileIncludeFilterTest
  170. Running org.openmrs.annotation.StartModuleAnnotationReuseTest
  171. Tests run: 1, Failures: 0, Errors: 0, Skipped: 0, Time elapsed: 6.799 sec - in org.openmrs.annotation.StartModuleAnnotationReuseTest
  172. Running org.openmrs.aop.AuthorizationAdviceTest
  173. Tests run: 2, Failures: 0, Errors: 0, Skipped: 0, Time elapsed: 6.838 sec - in org.openmrs.aop.AuthorizationAdviceTest
  174. Running org.openmrs.aop.RequiredDataAdviceTest
  175. Tests run: 26, Failures: 0, Errors: 0, Skipped: 0, Time elapsed: 1.405 sec - in org.openmrs.aop.RequiredDataAdviceTest
  176. Running org.openmrs.api.AdministrationServiceTest
  177. Tests run: 57, Failures: 0, Errors: 0, Skipped: 4, Time elapsed: 9.371 sec - in org.openmrs.api.AdministrationServiceTest
  178. Running org.openmrs.api.AdministrationServiceUnitTest
  179. Tests run: 5, Failures: 0, Errors: 0, Skipped: 0, Time elapsed: 0.049 sec - in org.openmrs.api.AdministrationServiceUnitTest
  180. Running org.openmrs.api.cache.CachePropertiesUtilTest
  181. Tests run: 1, Failures: 0, Errors: 0, Skipped: 0, Time elapsed: 0 sec - in org.openmrs.api.cache.CachePropertiesUtilTest
  182. Running org.openmrs.api.cache.OpenmrsCacheManagerFactoryBeanTest
  183. Tests run: 1, Failures: 0, Errors: 0, Skipped: 0, Time elapsed: 3.346 sec - in org.openmrs.api.cache.OpenmrsCacheManagerFactoryBeanTest
  184. Running org.openmrs.api.CohortServiceTest
  185. Tests run: 39, Failures: 0, Errors: 0, Skipped: 0, Time elapsed: 6.349 sec - in org.openmrs.api.CohortServiceTest
  186. Running org.openmrs.api.ConceptServiceTest
  187. Tests run: 244, Failures: 0, Errors: 0, Skipped: 1, Time elapsed: 452.985 sec - in org.openmrs.api.ConceptServiceTest
  188. Running org.openmrs.api.context.ContextTest
  189. Tests run: 17, Failures: 0, Errors: 0, Skipped: 0, Time elapsed: 2.867 sec - in org.openmrs.api.context.ContextTest
  190. Running org.openmrs.api.context.ContextWithModuleTest
  191. Tests run: 1, Failures: 0, Errors: 0, Skipped: 0, Time elapsed: 2.811 sec - in org.openmrs.api.context.ContextWithModuleTest
  192. Running org.openmrs.api.context.DaemonTest
  193. Tests run: 10, Failures: 0, Errors: 0, Skipped: 0, Time elapsed: 3.021 sec - in org.openmrs.api.context.DaemonTest
  194. Running org.openmrs.api.DatatypeServiceTest
  195. Tests run: 2, Failures: 0, Errors: 0, Skipped: 0, Time elapsed: 2.7 sec - in org.openmrs.api.DatatypeServiceTest
  196. Running org.openmrs.api.db.ConceptDAOTest
  197. Tests run: 13, Failures: 0, Errors: 0, Skipped: 2, Time elapsed: 4.078 sec - in org.openmrs.api.db.ConceptDAOTest
  198. Running org.openmrs.api.db.ContextDAOTest
  199. Tests run: 24, Failures: 0, Errors: 0, Skipped: 0, Time elapsed: 7.427 sec - in org.openmrs.api.db.ContextDAOTest
  200. Running org.openmrs.api.db.EncounterDAOTest
  201. Tests run: 4, Failures: 0, Errors: 0, Skipped: 0, Time elapsed: 3.011 sec - in org.openmrs.api.db.EncounterDAOTest
  202. Running org.openmrs.api.db.hibernate.AuditableInterceptorTest
  203. Security framework of XStream not initialized, XStream is probably vulnerable.
  204. Tests run: 15, Failures: 0, Errors: 0, Skipped: 0, Time elapsed: 2.933 sec - in org.openmrs.api.db.hibernate.AuditableInterceptorTest
  205. Running org.openmrs.api.db.hibernate.DropMillisecondsHibernateInterceptorTest
  206. Tests run: 3, Failures: 0, Errors: 0, Skipped: 0, Time elapsed: 2.549 sec - in org.openmrs.api.db.hibernate.DropMillisecondsHibernateInterceptorTest
  207. Running org.openmrs.api.db.hibernate.HibernateAdministrationDAOTest
  208. Tests run: 4, Failures: 0, Errors: 0, Skipped: 0, Time elapsed: 2.662 sec - in org.openmrs.api.db.hibernate.HibernateAdministrationDAOTest
  209. Running org.openmrs.api.db.hibernate.HibernateConceptDAOTest
  210. Tests run: 11, Failures: 0, Errors: 0, Skipped: 0, Time elapsed: 22.193 sec - in org.openmrs.api.db.hibernate.HibernateConceptDAOTest
  211. Running org.openmrs.api.db.hibernate.HibernateConditionDAOTest
  212. Tests run: 6, Failures: 0, Errors: 0, Skipped: 0, Time elapsed: 10.758 sec - in org.openmrs.api.db.hibernate.HibernateConditionDAOTest
  213. Running org.openmrs.api.db.hibernate.HibernateDiagnosisDAOTest
  214. Tests run: 9, Failures: 0, Errors: 0, Skipped: 0, Time elapsed: 3.015 sec - in org.openmrs.api.db.hibernate.HibernateDiagnosisDAOTest
  215. Running org.openmrs.api.db.hibernate.HibernateFormDAOTest
  216. Tests run: 1, Failures: 0, Errors: 0, Skipped: 0, Time elapsed: 2.82 sec - in org.openmrs.api.db.hibernate.HibernateFormDAOTest
  217. Running org.openmrs.api.db.hibernate.HibernateLocationDAOTest
  218. Tests run: 3, Failures: 0, Errors: 0, Skipped: 0, Time elapsed: 2.712 sec - in org.openmrs.api.db.hibernate.HibernateLocationDAOTest
  219. Running org.openmrs.api.db.hibernate.HibernateObsDAOTest
  220. Tests run: 1, Failures: 0, Errors: 0, Skipped: 0, Time elapsed: 2.631 sec - in org.openmrs.api.db.hibernate.HibernateObsDAOTest
  221. Running org.openmrs.api.db.hibernate.HibernateOrderDAOTest
  222. Tests run: 1, Failures: 0, Errors: 0, Skipped: 0, Time elapsed: 2.744 sec - in org.openmrs.api.db.hibernate.HibernateOrderDAOTest
  223. Running org.openmrs.api.db.hibernate.HibernatePatientDAOTest
  224. Tests run: 2, Failures: 0, Errors: 0, Skipped: 0, Time elapsed: 5.344 sec - in org.openmrs.api.db.hibernate.HibernatePatientDAOTest
  225. Running org.openmrs.api.db.hibernate.HibernatePersonDAOTest
  226. Tests run: 41, Failures: 0, Errors: 0, Skipped: 0, Time elapsed: 57.158 sec - in org.openmrs.api.db.hibernate.HibernatePersonDAOTest
  227. Running org.openmrs.api.db.hibernate.HibernateProviderDAOTest
  228. Tests run: 3, Failures: 0, Errors: 0, Skipped: 0, Time elapsed: 2.55 sec - in org.openmrs.api.db.hibernate.HibernateProviderDAOTest
  229. Running org.openmrs.api.db.hibernate.ImmutableEntityInterceptorTest
  230. Tests run: 4, Failures: 0, Errors: 0, Skipped: 0, Time elapsed: 2.498 sec - in org.openmrs.api.db.hibernate.ImmutableEntityInterceptorTest
  231. Running org.openmrs.api.db.hibernate.PatientSearchCriteriaTest
  232. Tests run: 18, Failures: 0, Errors: 0, Skipped: 0, Time elapsed: 3.169 sec - in org.openmrs.api.db.hibernate.PatientSearchCriteriaTest
  233. Running org.openmrs.api.db.hibernate.PersonAttributeHelperTest
  234. Tests run: 5, Failures: 0, Errors: 0, Skipped: 0, Time elapsed: 3.262 sec - in org.openmrs.api.db.hibernate.PersonAttributeHelperTest
  235. Running org.openmrs.api.db.hibernate.ProviderDAOTest
  236. Tests run: 3, Failures: 0, Errors: 0, Skipped: 0, Time elapsed: 2.663 sec - in org.openmrs.api.db.hibernate.ProviderDAOTest
  237. Running org.openmrs.api.db.PatientDAOTest
  238. Tests run: 157, Failures: 0, Errors: 0, Skipped: 1, Time elapsed: 279.487 sec - in org.openmrs.api.db.PatientDAOTest
  239. Running org.openmrs.api.db.PersonDAOTest
  240. Tests run: 3, Failures: 0, Errors: 0, Skipped: 0, Time elapsed: 2.739 sec - in org.openmrs.api.db.PersonDAOTest
  241. Running org.openmrs.api.db.ProgramWorkflowDAOTest
  242. Tests run: 4, Failures: 0, Errors: 0, Skipped: 0, Time elapsed: 2.486 sec - in org.openmrs.api.db.ProgramWorkflowDAOTest
  243. Running org.openmrs.api.db.SerializedObjectDAOTest
  244. Tests run: 1, Failures: 0, Errors: 0, Skipped: 1, Time elapsed: 0 sec - in org.openmrs.api.db.SerializedObjectDAOTest
  245. Running org.openmrs.api.db.UserDAOTest
  246. Tests run: 8, Failures: 0, Errors: 0, Skipped: 0, Time elapsed: 2.762 sec - in org.openmrs.api.db.UserDAOTest
  247. Running org.openmrs.api.db.VisitDAOTest
  248. Tests run: 3, Failures: 0, Errors: 0, Skipped: 0, Time elapsed: 2.812 sec - in org.openmrs.api.db.VisitDAOTest
  249. Running org.openmrs.api.EncounterServiceTest
  250. Tests run: 142, Failures: 0, Errors: 0, Skipped: 2, Time elapsed: 28.254 sec - in org.openmrs.api.EncounterServiceTest
  251. Running org.openmrs.api.FormServiceTest
  252. Tests run: 48, Failures: 0, Errors: 0, Skipped: 0, Time elapsed: 3.693 sec - in org.openmrs.api.FormServiceTest
  253. Running org.openmrs.api.handler.BaseRetireHandlerTest
  254. Tests run: 8, Failures: 0, Errors: 0, Skipped: 0, Time elapsed: 0 sec - in org.openmrs.api.handler.BaseRetireHandlerTest
  255. Running org.openmrs.api.handler.BaseUnretireHandlerTest
  256. Tests run: 6, Failures: 0, Errors: 0, Skipped: 0, Time elapsed: 0 sec - in org.openmrs.api.handler.BaseUnretireHandlerTest
  257. Running org.openmrs.api.handler.BaseUnvoidHandlerTest
  258. Tests run: 6, Failures: 0, Errors: 0, Skipped: 0, Time elapsed: 0 sec - in org.openmrs.api.handler.BaseUnvoidHandlerTest
  259. Running org.openmrs.api.handler.BaseVoidHandlerTest
  260. Tests run: 8, Failures: 0, Errors: 0, Skipped: 0, Time elapsed: 0 sec - in org.openmrs.api.handler.BaseVoidHandlerTest
  261. Running org.openmrs.api.handler.ConceptNameSaveHandlerTest
  262. Tests run: 4, Failures: 0, Errors: 0, Skipped: 0, Time elapsed: 2.912 sec - in org.openmrs.api.handler.ConceptNameSaveHandlerTest
  263. Running org.openmrs.api.handler.ExistingOrNewVisitAssignmentHandlerTest
  264. Tests run: 5, Failures: 0, Errors: 0, Skipped: 0, Time elapsed: 3.231 sec - in org.openmrs.api.handler.ExistingOrNewVisitAssignmentHandlerTest
  265. Running org.openmrs.api.handler.ExistingVisitAssignmentHandlerTest
  266. Tests run: 3, Failures: 0, Errors: 0, Skipped: 0, Time elapsed: 3.279 sec - in org.openmrs.api.handler.ExistingVisitAssignmentHandlerTest
  267. Running org.openmrs.api.handler.OpenmrsMetadataSaveHandlerTest
  268. Tests run: 2, Failures: 0, Errors: 0, Skipped: 0, Time elapsed: 0.004 sec - in org.openmrs.api.handler.OpenmrsMetadataSaveHandlerTest
  269. Running org.openmrs.api.handler.OpenmrsObjectSaveHandlerTest
  270. Tests run: 5, Failures: 0, Errors: 0, Skipped: 0, Time elapsed: 0.022 sec - in org.openmrs.api.handler.OpenmrsObjectSaveHandlerTest
  271. Running org.openmrs.api.handler.PatientDataUnvoidHandlerTest
  272. Tests run: 3, Failures: 0, Errors: 0, Skipped: 0, Time elapsed: 4.523 sec - in org.openmrs.api.handler.PatientDataUnvoidHandlerTest
  273. Running org.openmrs.api.handler.PatientDataVoidHandlerTest
  274. Tests run: 2, Failures: 0, Errors: 0, Skipped: 0, Time elapsed: 2.551 sec - in org.openmrs.api.handler.PatientDataVoidHandlerTest
  275. Running org.openmrs.api.handler.PersonSaveHandlerTest
  276. Tests run: 1, Failures: 0, Errors: 0, Skipped: 0, Time elapsed: 2.706 sec - in org.openmrs.api.handler.PersonSaveHandlerTest
  277. Running org.openmrs.api.handler.PersonUnvoidHandlerTest
  278. Tests run: 6, Failures: 0, Errors: 0, Skipped: 0, Time elapsed: 0 sec - in org.openmrs.api.handler.PersonUnvoidHandlerTest
  279. Running org.openmrs.api.handler.PersonVoidHandlerTest
  280. Tests run: 8, Failures: 0, Errors: 0, Skipped: 0, Time elapsed: 2.863 sec - in org.openmrs.api.handler.PersonVoidHandlerTest
  281. Running org.openmrs.api.handler.RequiredReasonVoidSaveHandlerTest
  282. Tests run: 5, Failures: 0, Errors: 0, Skipped: 0, Time elapsed: 3.78 sec - in org.openmrs.api.handler.RequiredReasonVoidSaveHandlerTest
  283. Running org.openmrs.api.handler.RequireVoidReasonVoidHandlerTest
  284. Tests run: 5, Failures: 0, Errors: 0, Skipped: 0, Time elapsed: 3.629 sec - in org.openmrs.api.handler.RequireVoidReasonVoidHandlerTest
  285. Running org.openmrs.api.impl.ConceptServiceImplTest
  286. Tests run: 55, Failures: 0, Errors: 0, Skipped: 0, Time elapsed: 6.916 sec - in org.openmrs.api.impl.ConceptServiceImplTest
  287. Running org.openmrs.api.impl.ConditionServiceImplTest
  288. Tests run: 8, Failures: 0, Errors: 0, Skipped: 0, Time elapsed: 3.669 sec - in org.openmrs.api.impl.ConditionServiceImplTest
  289. Running org.openmrs.api.impl.DiagnosisServiceImplTest
  290. Tests run: 11, Failures: 0, Errors: 0, Skipped: 0, Time elapsed: 3.127 sec - in org.openmrs.api.impl.DiagnosisServiceImplTest
  291. Running org.openmrs.api.impl.GlobalLocaleListTest
  292. Tests run: 2, Failures: 0, Errors: 0, Skipped: 0, Time elapsed: 0 sec - in org.openmrs.api.impl.GlobalLocaleListTest
  293. Running org.openmrs.api.impl.PatientServiceImplTest
  294. Tests run: 14, Failures: 0, Errors: 0, Skipped: 0, Time elapsed: 0.552 sec - in org.openmrs.api.impl.PatientServiceImplTest
  295. Running org.openmrs.api.impl.SerializationServiceImplTest
  296. Tests run: 1, Failures: 0, Errors: 0, Skipped: 0, Time elapsed: 0.016 sec - in org.openmrs.api.impl.SerializationServiceImplTest
  297. Running org.openmrs.api.LocationServiceTest
  298. Tests run: 70, Failures: 0, Errors: 0, Skipped: 0, Time elapsed: 7.974 sec - in org.openmrs.api.LocationServiceTest
  299. Running org.openmrs.api.ObsServiceTest
  300. Tests run: 80, Failures: 0, Errors: 0, Skipped: 0, Time elapsed: 7.352 sec - in org.openmrs.api.ObsServiceTest
  301. Running org.openmrs.api.OpenmrsServiceTest
  302. Tests run: 1, Failures: 0, Errors: 0, Skipped: 1, Time elapsed: 0 sec - in org.openmrs.api.OpenmrsServiceTest
  303. Running org.openmrs.api.OrderServiceTest
  304. Tests run: 174, Failures: 0, Errors: 0, Skipped: 3, Time elapsed: 7.581 sec - in org.openmrs.api.OrderServiceTest
  305. Running org.openmrs.api.OrderSetServiceTest
  306. Tests run: 12, Failures: 0, Errors: 0, Skipped: 0, Time elapsed: 3.656 sec - in org.openmrs.api.OrderSetServiceTest
  307. Running org.openmrs.api.PatientServiceAllergyTest
  308. Tests run: 16, Failures: 0, Errors: 0, Skipped: 0, Time elapsed: 3.78 sec - in org.openmrs.api.PatientServiceAllergyTest
  309. Running org.openmrs.api.PatientServiceTest
  310. Tests run: 167, Failures: 0, Errors: 0, Skipped: 1, Time elapsed: 316.257 sec - in org.openmrs.api.PatientServiceTest
  311. Running org.openmrs.api.PersonServiceTest
  312. Tests run: 143, Failures: 0, Errors: 0, Skipped: 0, Time elapsed: 9.587 sec - in org.openmrs.api.PersonServiceTest
  313. Running org.openmrs.api.ProgramWorkflowServiceTest
  314. Tests run: 36, Failures: 0, Errors: 0, Skipped: 0, Time elapsed: 7.356 sec - in org.openmrs.api.ProgramWorkflowServiceTest
  315. Running org.openmrs.api.ProgramWorkflowServiceUnitTest
  316. Tests run: 12, Failures: 0, Errors: 0, Skipped: 0, Time elapsed: 0.019 sec - in org.openmrs.api.ProgramWorkflowServiceUnitTest
  317. Running org.openmrs.api.ProviderServiceTest
  318. Tests run: 40, Failures: 0, Errors: 0, Skipped: 0, Time elapsed: 6.273 sec - in org.openmrs.api.ProviderServiceTest
  319. Running org.openmrs.api.UserServiceTest
  320. Tests run: 103, Failures: 0, Errors: 0, Skipped: 1, Time elapsed: 43.492 sec - in org.openmrs.api.UserServiceTest
  321. Running org.openmrs.api.VisitServiceTest
  322. Tests run: 68, Failures: 0, Errors: 0, Skipped: 0, Time elapsed: 5.407 sec - in org.openmrs.api.VisitServiceTest
  323. Running org.openmrs.attribute.AttributeIntegrationTest
  324. Tests run: 1, Failures: 0, Errors: 0, Skipped: 0, Time elapsed: 3.447 sec - in org.openmrs.attribute.AttributeIntegrationTest
  325. Running org.openmrs.BaseCustomizableMetadataTest
  326. Tests run: 2, Failures: 0, Errors: 0, Skipped: 0, Time elapsed: 3.477 sec - in org.openmrs.BaseCustomizableMetadataTest
  327. Running org.openmrs.BaseOpenmrsObjectTest
  328. Tests run: 20, Failures: 0, Errors: 0, Skipped: 0, Time elapsed: 3.339 sec - in org.openmrs.BaseOpenmrsObjectTest
  329. Running org.openmrs.CohortMembershipTest
  330. Tests run: 21, Failures: 0, Errors: 0, Skipped: 0, Time elapsed: 0.022 sec - in org.openmrs.CohortMembershipTest
  331. Running org.openmrs.CohortTest
  332. Tests run: 15, Failures: 0, Errors: 0, Skipped: 0, Time elapsed: 0.489 sec - in org.openmrs.CohortTest
  333. Running org.openmrs.comparator.PatientIdentifierTypeDefaultComparatorTest
  334. Tests run: 1, Failures: 0, Errors: 0, Skipped: 0, Time elapsed: 0 sec - in org.openmrs.comparator.PatientIdentifierTypeDefaultComparatorTest
  335. Running org.openmrs.ConceptComponentTest
  336. Tests run: 1, Failures: 0, Errors: 0, Skipped: 0, Time elapsed: 3.618 sec - in org.openmrs.ConceptComponentTest
  337. Running org.openmrs.ConceptNumericTest
  338. Tests run: 8, Failures: 0, Errors: 0, Skipped: 0, Time elapsed: 3.031 sec - in org.openmrs.ConceptNumericTest
  339. Running org.openmrs.ConceptReferenceTermTest
  340. Tests run: 3, Failures: 0, Errors: 0, Skipped: 0, Time elapsed: 0.005 sec - in org.openmrs.ConceptReferenceTermTest
  341. Running org.openmrs.ConceptTest
  342. Tests run: 72, Failures: 0, Errors: 0, Skipped: 0, Time elapsed: 4.375 sec - in org.openmrs.ConceptTest
  343. Running org.openmrs.customdatatype.CustomDatatypeUtilTest
  344. Tests run: 1, Failures: 0, Errors: 0, Skipped: 0, Time elapsed: 3.212 sec - in org.openmrs.customdatatype.CustomDatatypeUtilTest
  345. Running org.openmrs.customdatatype.datatype.BaseMetadataDatatypeTest
  346. Tests run: 1, Failures: 0, Errors: 0, Skipped: 0, Time elapsed: 0 sec - in org.openmrs.customdatatype.datatype.BaseMetadataDatatypeTest
  347. Running org.openmrs.customdatatype.datatype.BaseOpenmrsDatatypeTest
  348. Tests run: 1, Failures: 0, Errors: 0, Skipped: 0, Time elapsed: 0 sec - in org.openmrs.customdatatype.datatype.BaseOpenmrsDatatypeTest
  349. Running org.openmrs.customdatatype.datatype.DateDatatypeTest
  350. Tests run: 2, Failures: 0, Errors: 0, Skipped: 0, Time elapsed: 0 sec - in org.openmrs.customdatatype.datatype.DateDatatypeTest
  351. Running org.openmrs.customdatatype.datatype.RegexValidatedTextTest
  352. Tests run: 3, Failures: 0, Errors: 0, Skipped: 0, Time elapsed: 0 sec - in org.openmrs.customdatatype.datatype.RegexValidatedTextTest
  353. Running org.openmrs.DrugOrderTest
  354. Tests run: 22, Failures: 0, Errors: 0, Skipped: 0, Time elapsed: 0.071 sec - in org.openmrs.DrugOrderTest
  355. Running org.openmrs.DrugTest
  356. Tests run: 2, Failures: 0, Errors: 0, Skipped: 0, Time elapsed: 3.381 sec - in org.openmrs.DrugTest
  357. Running org.openmrs.DurationTest
  358. Tests run: 11, Failures: 0, Errors: 0, Skipped: 0, Time elapsed: 3.748 sec - in org.openmrs.DurationTest
  359. Running org.openmrs.EncounterProviderTest
  360. Tests run: 1, Failures: 0, Errors: 0, Skipped: 0, Time elapsed: 0 sec - in org.openmrs.EncounterProviderTest
  361. Running org.openmrs.EncounterRoleTest
  362. Tests run: 1, Failures: 0, Errors: 0, Skipped: 0, Time elapsed: 0 sec - in org.openmrs.EncounterRoleTest
  363. Running org.openmrs.EncounterTest
  364. Tests run: 59, Failures: 0, Errors: 0, Skipped: 0, Time elapsed: 4.454 sec - in org.openmrs.EncounterTest
  365. Running org.openmrs.EncounterTypeTest
  366. Tests run: 1, Failures: 0, Errors: 0, Skipped: 0, Time elapsed: 0 sec - in org.openmrs.EncounterTypeTest
  367. Running org.openmrs.FormTest
  368. Tests run: 1, Failures: 0, Errors: 0, Skipped: 0, Time elapsed: 0 sec - in org.openmrs.FormTest
  369. Running org.openmrs.hl7.handler.ORUR01HandlerTest
  370. Tests run: 39, Failures: 0, Errors: 0, Skipped: 0, Time elapsed: 10.508 sec - in org.openmrs.hl7.handler.ORUR01HandlerTest
  371. Running org.openmrs.hl7.HL7ServiceTest
  372. Tests run: 29, Failures: 0, Errors: 0, Skipped: 2, Time elapsed: 5.821 sec - in org.openmrs.hl7.HL7ServiceTest
  373. Running org.openmrs.hl7.HL7UtilTest
  374. Tests run: 5, Failures: 0, Errors: 0, Skipped: 0, Time elapsed: 0 sec - in org.openmrs.hl7.HL7UtilTest
  375. Running org.openmrs.layout.name.NameTemplateTest
  376. Tests run: 2, Failures: 0, Errors: 0, Skipped: 0, Time elapsed: 2.77 sec - in org.openmrs.layout.name.NameTemplateTest
  377. Running org.openmrs.LocationTest
  378. Tests run: 3, Failures: 0, Errors: 0, Skipped: 0, Time elapsed: 0 sec - in org.openmrs.LocationTest
  379. Running org.openmrs.logic.result.EmptyResultTest
  380. Tests run: 2, Failures: 0, Errors: 0, Skipped: 0, Time elapsed: 0 sec - in org.openmrs.logic.result.EmptyResultTest
  381. Running org.openmrs.logic.result.ResultTest
  382. Tests run: 17, Failures: 0, Errors: 0, Skipped: 0, Time elapsed: 0.031 sec - in org.openmrs.logic.result.ResultTest
  383. Running org.openmrs.messagesource.impl.CachedMessageSourceTest
  384. Tests run: 2, Failures: 0, Errors: 0, Skipped: 0, Time elapsed: 0 sec - in org.openmrs.messagesource.impl.CachedMessageSourceTest
  385. Running org.openmrs.messagesource.impl.DefaultMessageSourceServiceImplTest
  386. Tests run: 1, Failures: 0, Errors: 0, Skipped: 0, Time elapsed: 0 sec - in org.openmrs.messagesource.impl.DefaultMessageSourceServiceImplTest
  387. Running org.openmrs.messagesource.MessageSourceServiceTest
  388. Tests run: 1, Failures: 0, Errors: 0, Skipped: 0, Time elapsed: 3.105 sec - in org.openmrs.messagesource.MessageSourceServiceTest
  389. Running org.openmrs.messagesource.PresentationMessageMapTest
  390. Tests run: 2, Failures: 0, Errors: 0, Skipped: 0, Time elapsed: 0 sec - in org.openmrs.messagesource.PresentationMessageMapTest
  391. Running org.openmrs.module.ModuleActivatorTest
  392. Tests run: 11, Failures: 0, Errors: 0, Skipped: 0, Time elapsed: 9.13 sec - in org.openmrs.module.ModuleActivatorTest
  393. Running org.openmrs.module.ModuleClassLoaderTest
  394. Tests run: 10, Failures: 0, Errors: 0, Skipped: 0, Time elapsed: 4.042 sec - in org.openmrs.module.ModuleClassLoaderTest
  395. Running org.openmrs.module.ModuleExtensionsTest
  396. Tests run: 10, Failures: 0, Errors: 0, Skipped: 0, Time elapsed: 0.25 sec - in org.openmrs.module.ModuleExtensionsTest
  397. Running org.openmrs.module.ModuleFactoryTest
  398. Tests run: 9, Failures: 0, Errors: 0, Skipped: 0, Time elapsed: 8.964 sec - in org.openmrs.module.ModuleFactoryTest
  399. Running org.openmrs.module.ModuleFileParserTest
  400. Tests run: 6, Failures: 0, Errors: 0, Skipped: 0, Time elapsed: 4.801 sec - in org.openmrs.module.ModuleFileParserTest
  401. Running org.openmrs.module.ModuleFileParserUnitTest
  402. [Fatal Error] :1:67: XML document structures must start and end within the same entity.
  403. [Fatal Error] :-1:-1: Premature end of file.
  404. Tests run: 73, Failures: 0, Errors: 0, Skipped: 0, Time elapsed: 2.222 sec - in org.openmrs.module.ModuleFileParserUnitTest
  405. Running org.openmrs.module.ModuleInteroperabilityTest
  406. Tests run: 1, Failures: 0, Errors: 0, Skipped: 0, Time elapsed: 3.179 sec - in org.openmrs.module.ModuleInteroperabilityTest
  407. Running org.openmrs.module.ModuleTest
  408. Tests run: 9, Failures: 0, Errors: 0, Skipped: 0, Time elapsed: 0 sec - in org.openmrs.module.ModuleTest
  409. Running org.openmrs.module.ModuleUtilTest
  410. Tests run: 56, Failures: 0, Errors: 0, Skipped: 0, Time elapsed: 5.022 sec - in org.openmrs.module.ModuleUtilTest
  411. Running org.openmrs.module.UpdateFileParserTest
  412. Tests run: 3, Failures: 0, Errors: 0, Skipped: 0, Time elapsed: 0 sec - in org.openmrs.module.UpdateFileParserTest
  413. Running org.openmrs.module.VersionComparatorTest
  414. Tests run: 1, Failures: 0, Errors: 0, Skipped: 0, Time elapsed: 0 sec - in org.openmrs.module.VersionComparatorTest
  415. Running org.openmrs.notification.AlertServiceTest
  416. Tests run: 3, Failures: 0, Errors: 0, Skipped: 0, Time elapsed: 3.793 sec - in org.openmrs.notification.AlertServiceTest
  417. Running org.openmrs.notification.db.hibernate.HibernateAlertDAOTest
  418. Tests run: 1, Failures: 0, Errors: 0, Skipped: 0, Time elapsed: 4.057 sec - in org.openmrs.notification.db.hibernate.HibernateAlertDAOTest
  419. Running org.openmrs.notification.MessageTest
  420. Tests run: 4, Failures: 0, Errors: 0, Skipped: 0, Time elapsed: 0 sec - in org.openmrs.notification.MessageTest
  421. Running org.openmrs.obs.AbstractHandlerTest
  422. Tests run: 4, Failures: 0, Errors: 0, Skipped: 0, Time elapsed: 5.496 sec - in org.openmrs.obs.AbstractHandlerTest
  423. Running org.openmrs.obs.BinaryDataHandlerTest
  424. Tests run: 4, Failures: 0, Errors: 0, Skipped: 0, Time elapsed: 2.737 sec - in org.openmrs.obs.BinaryDataHandlerTest
  425. Running org.openmrs.obs.BinaryStreamHandlerTest
  426. Tests run: 4, Failures: 0, Errors: 0, Skipped: 0, Time elapsed: 2.62 sec - in org.openmrs.obs.BinaryStreamHandlerTest
  427. Running org.openmrs.obs.ImageHandlerTest
  428. Tests run: 4, Failures: 0, Errors: 0, Skipped: 0, Time elapsed: 3.439 sec - in org.openmrs.obs.ImageHandlerTest
  429. Running org.openmrs.obs.MediaHandlerTest
  430. Tests run: 4, Failures: 0, Errors: 0, Skipped: 0, Time elapsed: 2.498 sec - in org.openmrs.obs.MediaHandlerTest
  431. Running org.openmrs.obs.TextHandlerTest
  432. Tests run: 4, Failures: 0, Errors: 0, Skipped: 0, Time elapsed: 2.33 sec - in org.openmrs.obs.TextHandlerTest
  433. Running org.openmrs.ObsBehaviorTest
  434. Tests run: 3, Failures: 0, Errors: 0, Skipped: 1, Time elapsed: 3.355 sec - in org.openmrs.ObsBehaviorTest
  435. Running org.openmrs.ObsTest
  436. Tests run: 58, Failures: 0, Errors: 0, Skipped: 0, Time elapsed: 0.132 sec - in org.openmrs.ObsTest
  437. Running org.openmrs.OpenmrsTestAnnotationsTest
  438. Tests run: 2, Failures: 0, Errors: 0, Skipped: 0, Time elapsed: 4.17 sec - in org.openmrs.OpenmrsTestAnnotationsTest
  439. Running org.openmrs.OpenmrsTestsTest
  440. Tests run: 4, Failures: 0, Errors: 0, Skipped: 0, Time elapsed: 1.37 sec - in org.openmrs.OpenmrsTestsTest
  441. Running org.openmrs.order.OrderUtilTest
  442. Tests run: 15, Failures: 0, Errors: 0, Skipped: 0, Time elapsed: 0 sec - in org.openmrs.order.OrderUtilTest
  443. Running org.openmrs.OrderEntryIntegrationTest
  444. Tests run: 15, Failures: 0, Errors: 0, Skipped: 0, Time elapsed: 4.137 sec - in org.openmrs.OrderEntryIntegrationTest
  445. Running org.openmrs.OrderGroupTest
  446. Tests run: 1, Failures: 0, Errors: 0, Skipped: 0, Time elapsed: 0 sec - in org.openmrs.OrderGroupTest
  447. Running org.openmrs.OrderTest
  448. Tests run: 64, Failures: 0, Errors: 0, Skipped: 0, Time elapsed: 3.514 sec - in org.openmrs.OrderTest
  449. Running org.openmrs.OrderTypeTest
  450. Tests run: 3, Failures: 0, Errors: 0, Skipped: 0, Time elapsed: 0 sec - in org.openmrs.OrderTypeTest
  451. Running org.openmrs.patient.impl.LuhnIdentifierValidatorTest
  452. Tests run: 3, Failures: 0, Errors: 0, Skipped: 0, Time elapsed: 0 sec - in org.openmrs.patient.impl.LuhnIdentifierValidatorTest
  453. Running org.openmrs.patient.impl.VerhoeffIdentifierValidatorTest
  454. Tests run: 8, Failures: 0, Errors: 0, Skipped: 0, Time elapsed: 0 sec - in org.openmrs.patient.impl.VerhoeffIdentifierValidatorTest
  455. Running org.openmrs.PatientProgramTest
  456. Tests run: 5, Failures: 0, Errors: 0, Skipped: 0, Time elapsed: 0 sec - in org.openmrs.PatientProgramTest
  457. Running org.openmrs.PatientStateTest
  458. Tests run: 13, Failures: 0, Errors: 0, Skipped: 0, Time elapsed: 0 sec - in org.openmrs.PatientStateTest
  459. Running org.openmrs.PatientTest
  460. Tests run: 9, Failures: 0, Errors: 0, Skipped: 0, Time elapsed: 0 sec - in org.openmrs.PatientTest
  461. Running org.openmrs.PersonAddressTest
  462. Tests run: 15, Failures: 0, Errors: 0, Skipped: 0, Time elapsed: 0 sec - in org.openmrs.PersonAddressTest
  463. Running org.openmrs.PersonAttributeTest
  464. Tests run: 6, Failures: 0, Errors: 0, Skipped: 0, Time elapsed: 3.419 sec - in org.openmrs.PersonAttributeTest
  465. Running org.openmrs.PersonNameTest
  466. Tests run: 19, Failures: 0, Errors: 0, Skipped: 0, Time elapsed: 0.014 sec - in org.openmrs.PersonNameTest
  467. Running org.openmrs.PersonTest
  468. Tests run: 36, Failures: 0, Errors: 0, Skipped: 0, Time elapsed: 3.349 sec - in org.openmrs.PersonTest
  469. Running org.openmrs.propertyeditor.CohortEditorTest
  470. Tests run: 8, Failures: 0, Errors: 0, Skipped: 0, Time elapsed: 3.779 sec - in org.openmrs.propertyeditor.CohortEditorTest
  471. Running org.openmrs.propertyeditor.ConceptAnswerEditorTest
  472. Tests run: 8, Failures: 0, Errors: 0, Skipped: 0, Time elapsed: 3.289 sec - in org.openmrs.propertyeditor.ConceptAnswerEditorTest
  473. Running org.openmrs.propertyeditor.ConceptAnswersEditorTest
  474. Tests run: 1, Failures: 0, Errors: 0, Skipped: 0, Time elapsed: 3.168 sec - in org.openmrs.propertyeditor.ConceptAnswersEditorTest
  475. Running org.openmrs.propertyeditor.ConceptAttributeTypeEditorTest
  476. Tests run: 8, Failures: 0, Errors: 0, Skipped: 0, Time elapsed: 3.443 sec - in org.openmrs.propertyeditor.ConceptAttributeTypeEditorTest
  477. Running org.openmrs.propertyeditor.ConceptClassEditorTest
  478. Tests run: 8, Failures: 0, Errors: 0, Skipped: 0, Time elapsed: 2.998 sec - in org.openmrs.propertyeditor.ConceptClassEditorTest
  479. Running org.openmrs.propertyeditor.ConceptDatatypeEditorTest
  480. Tests run: 8, Failures: 0, Errors: 0, Skipped: 0, Time elapsed: 3.052 sec - in org.openmrs.propertyeditor.ConceptDatatypeEditorTest
  481. Running org.openmrs.propertyeditor.ConceptEditorTest
  482. Tests run: 8, Failures: 0, Errors: 0, Skipped: 0, Time elapsed: 3.322 sec - in org.openmrs.propertyeditor.ConceptEditorTest
  483. Running org.openmrs.propertyeditor.ConceptMapTypeEditorTest
  484. Tests run: 8, Failures: 0, Errors: 0, Skipped: 0, Time elapsed: 3.231 sec - in org.openmrs.propertyeditor.ConceptMapTypeEditorTest
  485. Running org.openmrs.propertyeditor.ConceptNameEditorTest
  486. Tests run: 8, Failures: 0, Errors: 0, Skipped: 0, Time elapsed: 3.81 sec - in org.openmrs.propertyeditor.ConceptNameEditorTest
  487. Running org.openmrs.propertyeditor.ConceptNumericEditorTest
  488. Tests run: 8, Failures: 0, Errors: 0, Skipped: 0, Time elapsed: 3.308 sec - in org.openmrs.propertyeditor.ConceptNumericEditorTest
  489. Running org.openmrs.propertyeditor.ConceptReferenceTermEditorTest
  490. Tests run: 8, Failures: 0, Errors: 0, Skipped: 0, Time elapsed: 3.36 sec - in org.openmrs.propertyeditor.ConceptReferenceTermEditorTest
  491. Running org.openmrs.propertyeditor.ConceptSourceEditorTest
  492. Tests run: 8, Failures: 0, Errors: 0, Skipped: 0, Time elapsed: 3.383 sec - in org.openmrs.propertyeditor.ConceptSourceEditorTest
  493. Running org.openmrs.propertyeditor.DateOrDatetimeEditorTest
  494. Tests run: 6, Failures: 0, Errors: 0, Skipped: 0, Time elapsed: 0.003 sec - in org.openmrs.propertyeditor.DateOrDatetimeEditorTest
  495. Running org.openmrs.propertyeditor.DrugEditorTest
  496. Tests run: 8, Failures: 0, Errors: 0, Skipped: 0, Time elapsed: 2.94 sec - in org.openmrs.propertyeditor.DrugEditorTest
  497. Running org.openmrs.propertyeditor.EncounterEditorTest
  498. Tests run: 8, Failures: 0, Errors: 0, Skipped: 0, Time elapsed: 3.073 sec - in org.openmrs.propertyeditor.EncounterEditorTest
  499. Running org.openmrs.propertyeditor.EncounterTypeEditorTest
  500. Tests run: 8, Failures: 0, Errors: 0, Skipped: 0, Time elapsed: 3.413 sec - in org.openmrs.propertyeditor.EncounterTypeEditorTest
  501. Running org.openmrs.propertyeditor.FormEditorTest
  502. Tests run: 8, Failures: 0, Errors: 0, Skipped: 0, Time elapsed: 3.228 sec - in org.openmrs.propertyeditor.FormEditorTest
  503. Running org.openmrs.propertyeditor.LocationAttributeTypeEditorTest
  504. Tests run: 8, Failures: 0, Errors: 0, Skipped: 0, Time elapsed: 3.269 sec - in org.openmrs.propertyeditor.LocationAttributeTypeEditorTest
  505. Running org.openmrs.propertyeditor.LocationEditorTest
  506. Tests run: 8, Failures: 0, Errors: 0, Skipped: 0, Time elapsed: 3.756 sec - in org.openmrs.propertyeditor.LocationEditorTest
  507. Running org.openmrs.propertyeditor.LocationTagEditorTest
  508. Tests run: 8, Failures: 0, Errors: 0, Skipped: 0, Time elapsed: 3.421 sec - in org.openmrs.propertyeditor.LocationTagEditorTest
  509. Running org.openmrs.propertyeditor.OrderEditorTest
  510. Tests run: 8, Failures: 0, Errors: 0, Skipped: 0, Time elapsed: 3.238 sec - in org.openmrs.propertyeditor.OrderEditorTest
  511. Running org.openmrs.propertyeditor.PatientEditorTest
  512. Tests run: 8, Failures: 0, Errors: 0, Skipped: 0, Time elapsed: 3.544 sec - in org.openmrs.propertyeditor.PatientEditorTest
  513. Running org.openmrs.propertyeditor.PatientIdentifierTypeEditorTest
  514. Tests run: 8, Failures: 0, Errors: 0, Skipped: 0, Time elapsed: 3.166 sec - in org.openmrs.propertyeditor.PatientIdentifierTypeEditorTest
  515. Running org.openmrs.propertyeditor.PersonAttributeEditorTest
  516. Tests run: 8, Failures: 0, Errors: 0, Skipped: 0, Time elapsed: 3.107 sec - in org.openmrs.propertyeditor.PersonAttributeEditorTest
  517. Running org.openmrs.propertyeditor.PersonAttributeTypeEditorTest
  518. Tests run: 8, Failures: 0, Errors: 0, Skipped: 0, Time elapsed: 3.101 sec - in org.openmrs.propertyeditor.PersonAttributeTypeEditorTest
  519. Running org.openmrs.propertyeditor.PersonEditorTest
  520. Tests run: 8, Failures: 0, Errors: 0, Skipped: 0, Time elapsed: 3.383 sec - in org.openmrs.propertyeditor.PersonEditorTest
  521. Running org.openmrs.propertyeditor.PrivilegeEditorTest
  522. Tests run: 2, Failures: 0, Errors: 0, Skipped: 0, Time elapsed: 3.292 sec - in org.openmrs.propertyeditor.PrivilegeEditorTest
  523. Running org.openmrs.propertyeditor.ProgramEditorTest
  524. Tests run: 4, Failures: 0, Errors: 0, Skipped: 0, Time elapsed: 3.172 sec - in org.openmrs.propertyeditor.ProgramEditorTest
  525. Running org.openmrs.propertyeditor.ProgramWorkflowEditorTest
  526. Tests run: 8, Failures: 0, Errors: 0, Skipped: 0, Time elapsed: 3.053 sec - in org.openmrs.propertyeditor.ProgramWorkflowEditorTest
  527. Running org.openmrs.propertyeditor.ProgramWorkflowStateEditorTest
  528. Tests run: 8, Failures: 0, Errors: 0, Skipped: 0, Time elapsed: 3.269 sec - in org.openmrs.propertyeditor.ProgramWorkflowStateEditorTest
  529. Running org.openmrs.propertyeditor.ProviderEditorTest
  530. Tests run: 8, Failures: 0, Errors: 0, Skipped: 1, Time elapsed: 2.914 sec - in org.openmrs.propertyeditor.ProviderEditorTest
  531. Running org.openmrs.propertyeditor.RoleEditorTest
  532. Tests run: 2, Failures: 0, Errors: 0, Skipped: 0, Time elapsed: 3.032 sec - in org.openmrs.propertyeditor.RoleEditorTest
  533. Running org.openmrs.propertyeditor.UserEditorTest
  534. Tests run: 8, Failures: 0, Errors: 0, Skipped: 0, Time elapsed: 3.102 sec - in org.openmrs.propertyeditor.UserEditorTest
  535. Running org.openmrs.propertyeditor.VisitEditorTest
  536. Tests run: 8, Failures: 0, Errors: 0, Skipped: 0, Time elapsed: 3.239 sec - in org.openmrs.propertyeditor.VisitEditorTest
  537. Running org.openmrs.propertyeditor.VisitTypeEditorTest
  538. Tests run: 8, Failures: 0, Errors: 0, Skipped: 0, Time elapsed: 3.03 sec - in org.openmrs.propertyeditor.VisitTypeEditorTest
  539. Running org.openmrs.propertyeditor.WorkflowCollectionEditorTest
  540. Tests run: 1, Failures: 0, Errors: 0, Skipped: 0, Time elapsed: 2.944 sec - in org.openmrs.propertyeditor.WorkflowCollectionEditorTest
  541. Running org.openmrs.ProviderTest
  542. Tests run: 2, Failures: 0, Errors: 0, Skipped: 0, Time elapsed: 0 sec - in org.openmrs.ProviderTest
  543. Running org.openmrs.RoleTest
  544. Tests run: 8, Failures: 0, Errors: 0, Skipped: 0, Time elapsed: 0 sec - in org.openmrs.RoleTest
  545. Running org.openmrs.scheduler.SchedulerServiceTest
  546. Tests run: 1, Failures: 0, Errors: 0, Skipped: 1, Time elapsed: 0 sec - in org.openmrs.scheduler.SchedulerServiceTest
  547. Running org.openmrs.scheduler.SchedulerUtilTest
  548. Tests run: 1, Failures: 0, Errors: 0, Skipped: 0, Time elapsed: 0 sec - in org.openmrs.scheduler.SchedulerUtilTest
  549. Running org.openmrs.scheduler.timer.TimerSchedulerServiceImplTest
  550. Tests run: 1, Failures: 0, Errors: 0, Skipped: 0, Time elapsed: 3.186 sec - in org.openmrs.scheduler.timer.TimerSchedulerServiceImplTest
  551. Running org.openmrs.serialization.JavaSerializationTest
  552. Tests run: 2, Failures: 0, Errors: 0, Skipped: 0, Time elapsed: 0.105 sec - in org.openmrs.serialization.JavaSerializationTest
  553. Running org.openmrs.serialization.SimpleXStreamSerializerTest
  554. Security framework of XStream not initialized, XStream is probably vulnerable.
  555. Security framework of XStream not initialized, XStream is probably vulnerable.
  556. Security framework of XStream not initialized, XStream is probably vulnerable.
  557. Tests run: 5, Failures: 0, Errors: 0, Skipped: 0, Time elapsed: 0.067 sec - in org.openmrs.serialization.SimpleXStreamSerializerTest
  558. Running org.openmrs.SimpleDosingInstructionsTest
  559. Tests run: 10, Failures: 0, Errors: 0, Skipped: 0, Time elapsed: 3.214 sec - in org.openmrs.SimpleDosingInstructionsTest
  560. Running org.openmrs.test.matchers.HasFieldErrorsTest
  561. Tests run: 13, Failures: 0, Errors: 0, Skipped: 0, Time elapsed: 0.011 sec - in org.openmrs.test.matchers.HasFieldErrorsTest
  562. Running org.openmrs.test.matchers.HasGlobalErrorsTest
  563. Tests run: 7, Failures: 0, Errors: 0, Skipped: 0, Time elapsed: 0.011 sec - in org.openmrs.test.matchers.HasGlobalErrorsTest
  564. Running org.openmrs.TestOrderTest
  565. Tests run: 4, Failures: 0, Errors: 0, Skipped: 0, Time elapsed: 0 sec - in org.openmrs.TestOrderTest
  566. Running org.openmrs.UserTest
  567. Tests run: 9, Failures: 0, Errors: 0, Skipped: 0, Time elapsed: 0 sec - in org.openmrs.UserTest
  568. Running org.openmrs.util.DatabaseUpdaterTest
  569. INFO 7/14/19 9:58 PM:liquibase: Creating database history table with name: LIQUIBASECHANGELOG
  570. INFO 7/14/19 9:58 PM:liquibase: Reading from LIQUIBASECHANGELOG
  571. Tests run: 1, Failures: 0, Errors: 0, Skipped: 0, Time elapsed: 6.874 sec - in org.openmrs.util.DatabaseUpdaterTest
  572. Running org.openmrs.util.DateUtilTest
  573. Tests run: 1, Failures: 0, Errors: 0, Skipped: 0, Time elapsed: 0.003 sec - in org.openmrs.util.DateUtilTest
  574. Running org.openmrs.util.DoubleRangeTest
  575. Tests run: 28, Failures: 0, Errors: 0, Skipped: 0, Time elapsed: 0.052 sec - in org.openmrs.util.DoubleRangeTest
  576. Running org.openmrs.util.DrugsByNameComparatorTest
  577. Tests run: 4, Failures: 0, Errors: 0, Skipped: 0, Time elapsed: 0.016 sec - in org.openmrs.util.DrugsByNameComparatorTest
  578. Running org.openmrs.util.ExceptionUtilTest
  579. Tests run: 1, Failures: 0, Errors: 0, Skipped: 0, Time elapsed: 0 sec - in org.openmrs.util.ExceptionUtilTest
  580. Running org.openmrs.util.FormatTest
  581. Tests run: 8, Failures: 0, Errors: 0, Skipped: 0, Time elapsed: 0.031 sec - in org.openmrs.util.FormatTest
  582. Running org.openmrs.util.GraphTest
  583. Tests run: 2, Failures: 0, Errors: 0, Skipped: 0, Time elapsed: 0.038 sec - in org.openmrs.util.GraphTest
  584. Running org.openmrs.util.HandlerUtilTest
  585. Tests run: 6, Failures: 0, Errors: 0, Skipped: 0, Time elapsed: 3.057 sec - in org.openmrs.util.HandlerUtilTest
  586. Running org.openmrs.util.HttpClientTest
  587. Tests run: 1, Failures: 0, Errors: 0, Skipped: 0, Time elapsed: 0.047 sec - in org.openmrs.util.HttpClientTest
  588. Running org.openmrs.util.HttpUrlTest
  589. Tests run: 6, Failures: 0, Errors: 0, Skipped: 0, Time elapsed: 0 sec - in org.openmrs.util.HttpUrlTest
  590. Running org.openmrs.util.JavaVersionTest
  591. Tests run: 2, Failures: 0, Errors: 0, Skipped: 0, Time elapsed: 1.108 sec - in org.openmrs.util.JavaVersionTest
  592. Running org.openmrs.util.LocaleUtilityTest
  593. Tests run: 21, Failures: 0, Errors: 0, Skipped: 0, Time elapsed: 3.279 sec - in org.openmrs.util.LocaleUtilityTest
  594. Running org.openmrs.util.LocationUtilityTest
  595. Tests run: 2, Failures: 0, Errors: 0, Skipped: 0, Time elapsed: 3.186 sec - in org.openmrs.util.LocationUtilityTest
  596. Running org.openmrs.util.NaturalStringsTest
  597. Tests run: 40, Failures: 0, Errors: 0, Skipped: 0, Time elapsed: 0.025 sec - in org.openmrs.util.NaturalStringsTest
  598. Running org.openmrs.util.OpenmrsSecurityManagerTest
  599. Tests run: 2, Failures: 0, Errors: 0, Skipped: 0, Time elapsed: 0 sec - in org.openmrs.util.OpenmrsSecurityManagerTest
  600. Running org.openmrs.util.OpenmrsUtilTest
  601. Tests run: 47, Failures: 0, Errors: 0, Skipped: 0, Time elapsed: 6.547 sec - in org.openmrs.util.OpenmrsUtilTest
  602. Running org.openmrs.util.OpenmrsUtilUnitTest
  603. Tests run: 49, Failures: 0, Errors: 0, Skipped: 0, Time elapsed: 0.022 sec - in org.openmrs.util.OpenmrsUtilUnitTest
  604. Running org.openmrs.util.PersonByNameComparatorTest
  605. Tests run: 4, Failures: 0, Errors: 0, Skipped: 0, Time elapsed: 0 sec - in org.openmrs.util.PersonByNameComparatorTest
  606. Running org.openmrs.util.ProviderByPersonNameComparatorTest
  607. Tests run: 6, Failures: 0, Errors: 0, Skipped: 0, Time elapsed: 0 sec - in org.openmrs.util.ProviderByPersonNameComparatorTest
  608. Running org.openmrs.util.ReflectTest
  609. Tests run: 18, Failures: 0, Errors: 0, Skipped: 0, Time elapsed: 0.006 sec - in org.openmrs.util.ReflectTest
  610. Running org.openmrs.util.SecurityTest
  611. Tests run: 7, Failures: 0, Errors: 0, Skipped: 0, Time elapsed: 6.036 sec - in org.openmrs.util.SecurityTest
  612. Running org.openmrs.util.UpgradeUtilTest
  613. Tests run: 2, Failures: 0, Errors: 0, Skipped: 0, Time elapsed: 3.121 sec - in org.openmrs.util.UpgradeUtilTest
  614. Running org.openmrs.util.UserByNameComparatorTest
  615. Tests run: 1, Failures: 0, Errors: 0, Skipped: 0, Time elapsed: 0.001 sec - in org.openmrs.util.UserByNameComparatorTest
  616. Running org.openmrs.validator.AlertValidatorTest
  617. Tests run: 5, Failures: 0, Errors: 0, Skipped: 0, Time elapsed: 3.234 sec - in org.openmrs.validator.AlertValidatorTest
  618. Running org.openmrs.validator.AllergyValidatorTest
  619. Tests run: 9, Failures: 0, Errors: 0, Skipped: 0, Time elapsed: 2.693 sec - in org.openmrs.validator.AllergyValidatorTest
  620. Running org.openmrs.validator.BaseAttributeTypeValidatorTest
  621. Tests run: 16, Failures: 0, Errors: 0, Skipped: 0, Time elapsed: 7.53 sec - in org.openmrs.validator.BaseAttributeTypeValidatorTest
  622. Running org.openmrs.validator.CohortValidatorTest
  623. Tests run: 7, Failures: 0, Errors: 0, Skipped: 0, Time elapsed: 3.535 sec - in org.openmrs.validator.CohortValidatorTest
  624. Running org.openmrs.validator.ConceptAttributeTypeValidatorTest
  625. Tests run: 8, Failures: 0, Errors: 0, Skipped: 0, Time elapsed: 3.372 sec - in org.openmrs.validator.ConceptAttributeTypeValidatorTest
  626. Running org.openmrs.validator.ConceptClassValidatorTest
  627. Tests run: 6, Failures: 0, Errors: 0, Skipped: 0, Time elapsed: 3.473 sec - in org.openmrs.validator.ConceptClassValidatorTest
  628. Running org.openmrs.validator.ConceptDatatypeValidatorTest
  629. Tests run: 5, Failures: 0, Errors: 0, Skipped: 0, Time elapsed: 3.12 sec - in org.openmrs.validator.ConceptDatatypeValidatorTest
  630. Running org.openmrs.validator.ConceptDrugValidatorTest
  631. Tests run: 3, Failures: 0, Errors: 0, Skipped: 0, Time elapsed: 0 sec - in org.openmrs.validator.ConceptDrugValidatorTest
  632. Running org.openmrs.validator.ConceptMapTypeValidatorTest
  633. Tests run: 8, Failures: 0, Errors: 0, Skipped: 0, Time elapsed: 3.127 sec - in org.openmrs.validator.ConceptMapTypeValidatorTest
  634. Running org.openmrs.validator.ConceptNameTagValidatorTest
  635. Tests run: 7, Failures: 0, Errors: 0, Skipped: 0, Time elapsed: 3.154 sec - in org.openmrs.validator.ConceptNameTagValidatorTest
  636. Running org.openmrs.validator.ConceptReferenceTermValidatorTest
  637. [Field error in object 'term' on field 'conceptReferenceTermMaps[1].termB': rejected value [weight term(WGT234)]; codes [ConceptReferenceTerm.termToTerm.alreadyMapped.term.conceptReferenceTermMaps[1].termB,ConceptReferenceTerm.termToTerm.alreadyMapped.term.conceptReferenceTermMaps.termB,ConceptReferenceTerm.termToTerm.alreadyMapped.conceptReferenceTermMaps[1].termB,ConceptReferenceTerm.termToTerm.alreadyMapped.conceptReferenceTermMaps.termB,ConceptReferenceTerm.termToTerm.alreadyMapped.termB,ConceptReferenceTerm.termToTerm.alreadyMapped.org.openmrs.ConceptReferenceTerm,ConceptReferenceTerm.termToTerm.alreadyMapped]; arguments []; default message [Cannot map a reference term multiple times to the same concept reference term]]
  638. Tests run: 18, Failures: 0, Errors: 0, Skipped: 3, Time elapsed: 3.284 sec - in org.openmrs.validator.ConceptReferenceTermValidatorTest
  639. Running org.openmrs.validator.ConceptSourceValidatorTest
  640. Tests run: 6, Failures: 0, Errors: 0, Skipped: 0, Time elapsed: 3.063 sec - in org.openmrs.validator.ConceptSourceValidatorTest
  641. Running org.openmrs.validator.ConceptValidatorTest
  642. Tests run: 31, Failures: 0, Errors: 0, Skipped: 0, Time elapsed: 3.464 sec - in org.openmrs.validator.ConceptValidatorTest
  643. Running org.openmrs.validator.ConditionValidatorTest
  644. Tests run: 4, Failures: 0, Errors: 0, Skipped: 0, Time elapsed: 0.002 sec - in org.openmrs.validator.ConditionValidatorTest
  645. Running org.openmrs.validator.DiagnosisValidatorTest
  646. Tests run: 6, Failures: 0, Errors: 0, Skipped: 0, Time elapsed: 2.959 sec - in org.openmrs.validator.DiagnosisValidatorTest
  647. Running org.openmrs.validator.DrugOrderValidatorTest
  648. Tests run: 36, Failures: 0, Errors: 0, Skipped: 0, Time elapsed: 6.832 sec - in org.openmrs.validator.DrugOrderValidatorTest
  649. Running org.openmrs.validator.DrugValidatorTest
  650. Tests run: 9, Failures: 0, Errors: 0, Skipped: 0, Time elapsed: 3.432 sec - in org.openmrs.validator.DrugValidatorTest
  651. Running org.openmrs.validator.EncounterRoleValidatorTest
  652. Tests run: 5, Failures: 0, Errors: 0, Skipped: 0, Time elapsed: 3.285 sec - in org.openmrs.validator.EncounterRoleValidatorTest
  653. Running org.openmrs.validator.EncounterTypeValidatorTest
  654. Tests run: 7, Failures: 0, Errors: 0, Skipped: 0, Time elapsed: 3.214 sec - in org.openmrs.validator.EncounterTypeValidatorTest
  655. Running org.openmrs.validator.EncounterValidatorTest
  656. Tests run: 12, Failures: 0, Errors: 0, Skipped: 0, Time elapsed: 3.162 sec - in org.openmrs.validator.EncounterValidatorTest
  657. Running org.openmrs.validator.FieldTypeValidatorTest
  658. Tests run: 5, Failures: 0, Errors: 0, Skipped: 0, Time elapsed: 3.087 sec - in org.openmrs.validator.FieldTypeValidatorTest
  659. Running org.openmrs.validator.FieldValidatorTest
  660. Tests run: 8, Failures: 0, Errors: 0, Skipped: 0, Time elapsed: 3.421 sec - in org.openmrs.validator.FieldValidatorTest
  661. Running org.openmrs.validator.FormValidatorTest
  662. Tests run: 8, Failures: 0, Errors: 0, Skipped: 0, Time elapsed: 3.221 sec - in org.openmrs.validator.FormValidatorTest
  663. Running org.openmrs.validator.HL7SourceValidatorTest
  664. Tests run: 2, Failures: 0, Errors: 0, Skipped: 0, Time elapsed: 3.044 sec - in org.openmrs.validator.HL7SourceValidatorTest
  665. Running org.openmrs.validator.ImplementationIdValidatorTest
  666. Tests run: 8, Failures: 0, Errors: 0, Skipped: 0, Time elapsed: 2.962 sec - in org.openmrs.validator.ImplementationIdValidatorTest
  667. Running org.openmrs.validator.LocationAttributeTypeValidatorTest
  668. Tests run: 6, Failures: 0, Errors: 0, Skipped: 0, Time elapsed: 3.247 sec - in org.openmrs.validator.LocationAttributeTypeValidatorTest
  669. Running org.openmrs.validator.LocationTagValidatorTest
  670. Tests run: 2, Failures: 0, Errors: 0, Skipped: 0, Time elapsed: 8.581 sec - in org.openmrs.validator.LocationTagValidatorTest
  671. Running org.openmrs.validator.LocationValidatorTest
  672. Tests run: 9, Failures: 0, Errors: 0, Skipped: 0, Time elapsed: 3.061 sec - in org.openmrs.validator.LocationValidatorTest
  673. Running org.openmrs.validator.ObsValidatorTest
  674. Tests run: 22, Failures: 0, Errors: 0, Skipped: 0, Time elapsed: 3.356 sec - in org.openmrs.validator.ObsValidatorTest
  675. Running org.openmrs.validator.OrderFrequencyValidatorTest
  676. Tests run: 9, Failures: 0, Errors: 0, Skipped: 0, Time elapsed: 3.311 sec - in org.openmrs.validator.OrderFrequencyValidatorTest
  677. Running org.openmrs.validator.OrderTypeValidatorTest
  678. Tests run: 14, Failures: 0, Errors: 0, Skipped: 0, Time elapsed: 3.331 sec - in org.openmrs.validator.OrderTypeValidatorTest
  679. Running org.openmrs.validator.OrderValidatorTest
  680. Tests run: 22, Failures: 0, Errors: 0, Skipped: 0, Time elapsed: 3.629 sec - in org.openmrs.validator.OrderValidatorTest
  681. Running org.openmrs.validator.PatientIdentifierTypeValidatorTest
  682. Tests run: 9, Failures: 0, Errors: 0, Skipped: 0, Time elapsed: 3.122 sec - in org.openmrs.validator.PatientIdentifierTypeValidatorTest
  683. Running org.openmrs.validator.PatientIdentifierValidatorTest
  684. Tests run: 20, Failures: 0, Errors: 0, Skipped: 0, Time elapsed: 3.723 sec - in org.openmrs.validator.PatientIdentifierValidatorTest
  685. Running org.openmrs.validator.PatientProgramValidatorTest
  686. Tests run: 22, Failures: 0, Errors: 0, Skipped: 0, Time elapsed: 3.556 sec - in org.openmrs.validator.PatientProgramValidatorTest
  687. Running org.openmrs.validator.PatientValidatorTest
  688. Tests run: 16, Failures: 0, Errors: 0, Skipped: 0, Time elapsed: 3.367 sec - in org.openmrs.validator.PatientValidatorTest
  689. Running org.openmrs.validator.PersonAddressValidatorTest
  690. Tests run: 10, Failures: 0, Errors: 0, Skipped: 0, Time elapsed: 3.246 sec - in org.openmrs.validator.PersonAddressValidatorTest
  691. Running org.openmrs.validator.PersonAttributeTypeValidatorTest
  692. Tests run: 7, Failures: 0, Errors: 0, Skipped: 0, Time elapsed: 3.183 sec - in org.openmrs.validator.PersonAttributeTypeValidatorTest
  693. Running org.openmrs.validator.PersonMergeLogValidatorTest
  694. Tests run: 6, Failures: 0, Errors: 0, Skipped: 0, Time elapsed: 3.13 sec - in org.openmrs.validator.PersonMergeLogValidatorTest
  695. Running org.openmrs.validator.PersonNameValidatorTest
  696. Tests run: 59, Failures: 0, Errors: 0, Skipped: 8, Time elapsed: 3.807 sec - in org.openmrs.validator.PersonNameValidatorTest
  697. Running org.openmrs.validator.PersonValidatorTest
  698. Tests run: 12, Failures: 0, Errors: 0, Skipped: 0, Time elapsed: 3.035 sec - in org.openmrs.validator.PersonValidatorTest
  699. Running org.openmrs.validator.PrivilegeValidatorTest
  700. Tests run: 5, Failures: 0, Errors: 0, Skipped: 0, Time elapsed: 3.13 sec - in org.openmrs.validator.PrivilegeValidatorTest
  701. Running org.openmrs.validator.ProgramValidatorTest
  702. Tests run: 8, Failures: 0, Errors: 0, Skipped: 0, Time elapsed: 2.985 sec - in org.openmrs.validator.ProgramValidatorTest
  703. Running org.openmrs.validator.ProviderAttributeTypeValidatorTest
  704. Tests run: 2, Failures: 0, Errors: 0, Skipped: 0, Time elapsed: 2.996 sec - in org.openmrs.validator.ProviderAttributeTypeValidatorTest
  705. Running org.openmrs.validator.ProviderValidatorTest
  706. Tests run: 13, Failures: 0, Errors: 0, Skipped: 0, Time elapsed: 3.334 sec - in org.openmrs.validator.ProviderValidatorTest
  707. Running org.openmrs.validator.RelationshipTypeValidatorTest
  708. Tests run: 7, Failures: 0, Errors: 0, Skipped: 0, Time elapsed: 3.39 sec - in org.openmrs.validator.RelationshipTypeValidatorTest
  709. Running org.openmrs.validator.RelationshipValidatorTest
  710. Tests run: 7, Failures: 0, Errors: 0, Skipped: 0, Time elapsed: 3.157 sec - in org.openmrs.validator.RelationshipValidatorTest
  711. Running org.openmrs.validator.RequireNameValidatorTest
  712. Tests run: 2, Failures: 0, Errors: 0, Skipped: 0, Time elapsed: 0.004 sec - in org.openmrs.validator.RequireNameValidatorTest
  713. Running org.openmrs.validator.RoleValidatorTest
  714. Tests run: 6, Failures: 0, Errors: 0, Skipped: 0, Time elapsed: 3.109 sec - in org.openmrs.validator.RoleValidatorTest
  715. Running org.openmrs.validator.SchedulerFormValidatorTest
  716. Tests run: 10, Failures: 0, Errors: 0, Skipped: 0, Time elapsed: 3.179 sec - in org.openmrs.validator.SchedulerFormValidatorTest
  717. Running org.openmrs.validator.StateConversionValidatorTest
  718. Tests run: 4, Failures: 0, Errors: 0, Skipped: 0, Time elapsed: 3.054 sec - in org.openmrs.validator.StateConversionValidatorTest
  719. Running org.openmrs.validator.TestOrderValidatorTest
  720. Tests run: 2, Failures: 0, Errors: 0, Skipped: 0, Time elapsed: 3.054 sec - in org.openmrs.validator.TestOrderValidatorTest
  721. Running org.openmrs.validator.UserValidatorTest
  722. Tests run: 23, Failures: 0, Errors: 0, Skipped: 0, Time elapsed: 3.342 sec - in org.openmrs.validator.UserValidatorTest
  723. Running org.openmrs.validator.ValidateUtilTest
  724. Tests run: 8, Failures: 0, Errors: 0, Skipped: 0, Time elapsed: 3.336 sec - in org.openmrs.validator.ValidateUtilTest
  725. Running org.openmrs.validator.VisitAttributeTypeValidatorTest
  726. Tests run: 2, Failures: 0, Errors: 0, Skipped: 0, Time elapsed: 3.196 sec - in org.openmrs.validator.VisitAttributeTypeValidatorTest
  727. Running org.openmrs.validator.VisitTypeValidatorTest
  728. Tests run: 2, Failures: 0, Errors: 0, Skipped: 0, Time elapsed: 2.873 sec - in org.openmrs.validator.VisitTypeValidatorTest
  729. Running org.openmrs.validator.VisitValidatorTest
  730. Tests run: 27, Failures: 0, Errors: 0, Skipped: 1, Time elapsed: 5.102 sec - in org.openmrs.validator.VisitValidatorTest
  731.  
  732. Results :
  733.  
  734. Tests run: 4119, Failures: 0, Errors: 0, Skipped: 36
  735.  
  736. [INFO]
  737. [INFO] --- maven-jar-plugin:2.3.2:jar (default-jar) @ openmrs-api ---
  738. [INFO] Building jar: C:\Users\Admin\core\api\target\openmrs-api-2.3.0-SNAPSHOT.jar
  739. [INFO]
  740. [INFO] --- maven-jar-plugin:2.3.2:test-jar (default) @ openmrs-api ---
  741. [INFO] Building jar: C:\Users\Admin\core\api\target\openmrs-api-2.3.0-SNAPSHOT-tests.jar
  742. [INFO]
  743. [INFO] --- license-maven-plugin:3.0:check (default) @ openmrs-api ---
  744. [INFO] Checking licenses...
  745. [INFO]
  746. [INFO] --- maven-install-plugin:2.4:install (default-install) @ openmrs-api ---
  747. [INFO] Installing C:\Users\Admin\core\api\target\openmrs-api-2.3.0-SNAPSHOT.jar to C:\Users\Admin\.m2\repository\org\openmrs\api\openmrs-api\2.3.0-SNAPSHOT\openmrs-api-2.3.0-SNAPSHOT.jar
  748. [INFO] Installing C:\Users\Admin\core\api\pom.xml to C:\Users\Admin\.m2\repository\org\openmrs\api\openmrs-api\2.3.0-SNAPSHOT\openmrs-api-2.3.0-SNAPSHOT.pom
  749. [INFO] Installing C:\Users\Admin\core\api\target\openmrs-api-2.3.0-SNAPSHOT-tests.jar to C:\Users\Admin\.m2\repository\org\openmrs\api\openmrs-api\2.3.0-SNAPSHOT\openmrs-api-2.3.0-SNAPSHOT-tests.jar
  750. [INFO]
  751. [INFO] --------------------< org.openmrs.web:openmrs-web >---------------------
  752. [INFO] Building openmrs-web 2.3.0-SNAPSHOT [5/6]
  753. [INFO] --------------------------------[ jar ]---------------------------------
  754. [INFO]
  755. [INFO] --- maven-clean-plugin:2.5:clean (default-clean) @ openmrs-web ---
  756. [INFO] Deleting C:\Users\Admin\core\web\target
  757. [INFO]
  758. [INFO] --- buildnumber-maven-plugin:1.1:create (default) @ openmrs-web ---
  759. [INFO]
  760. [INFO] --- build-helper-maven-plugin:1.5:parse-version (parse-version) @ openmrs-web ---
  761. [INFO]
  762. [INFO] --- jacoco-maven-plugin:0.8.0:prepare-agent (prepare-agent) @ openmrs-web ---
  763. [INFO] argLine set to -javaagent:C:\\Users\\Admin\\.m2\\repository\\org\\jacoco\\org.jacoco.agent\\0.8.0\\org.jacoco.agent-0.8.0-runtime.jar=destfile=C:\\Users\\Admin\\core\\web\\target\\jacoco.exec,includes=org/openmrs/** -Duser.language=en -Duser.region=US -Xmx2g
  764. [INFO]
  765. [INFO] --- maven-java-formatter-plugin:0.3:format (default) @ openmrs-web ---
  766. [INFO] Using 'UTF-8' encoding to format source files.
  767. [INFO] Number of files to be formatted: 55
  768. [INFO] Successfully formatted: 0 file(s)
  769. [INFO] Fail to format : 0 file(s)
  770. [INFO] Skipped : 55 file(s)
  771. [INFO] Approximate time taken: 2s
  772. [INFO]
  773. [INFO] --- maven-resources-plugin:2.4:resources (default-resources) @ openmrs-web ---
  774. [INFO] Using 'UTF-8' encoding to copy filtered resources.
  775. [INFO] Copying 22 resources
  776. [INFO]
  777. [INFO] --- maven-compiler-plugin:2.1:compile (default-compile) @ openmrs-web ---
  778. [INFO] Compiling 39 source files to C:\Users\Admin\core\web\target\classes
  779. [INFO]
  780. [INFO] --- maven-resources-plugin:2.4:testResources (default-testResources) @ openmrs-web ---
  781. [INFO] Using 'UTF-8' encoding to copy filtered resources.
  782. [INFO] Copying 1 resource
  783. [INFO]
  784. [INFO] --- maven-compiler-plugin:2.1:testCompile (default-testCompile) @ openmrs-web ---
  785. [INFO] Compiling 16 source files to C:\Users\Admin\core\web\target\test-classes
  786. [INFO]
  787. [INFO] --- maven-surefire-plugin:2.18.1:test (default-test) @ openmrs-web ---
  788. [INFO] Surefire report directory: C:\Users\Admin\core\web\target\surefire-reports
  789.  
  790. -------------------------------------------------------
  791. T E S T S
  792. -------------------------------------------------------
  793. Running org.openmrs.module.filter.ModuleFilterDefinitionTest
  794. Tests run: 4, Failures: 0, Errors: 0, Skipped: 0, Time elapsed: 0.086 sec - in org.openmrs.module.filter.ModuleFilterDefinitionTest
  795. Running org.openmrs.module.web.WebModuleUtilTest
  796. Tests run: 9, Failures: 0, Errors: 0, Skipped: 0, Time elapsed: 4.163 sec - in org.openmrs.module.web.WebModuleUtilTest
  797. Running org.openmrs.web.context.AltAuthSchemeContextTest
  798. Tests run: 1, Failures: 0, Errors: 0, Skipped: 0, Time elapsed: 34.49 sec - in org.openmrs.web.context.AltAuthSchemeContextTest
  799. Running org.openmrs.web.filter.startuperror.StartupErrorFilterTest
  800. Tests run: 3, Failures: 0, Errors: 0, Skipped: 0, Time elapsed: 2.495 sec - in org.openmrs.web.filter.startuperror.StartupErrorFilterTest
  801. Running org.openmrs.web.filter.update.GZIPFilterTest
  802. Tests run: 1, Failures: 0, Errors: 0, Skipped: 0, Time elapsed: 1.988 sec - in org.openmrs.web.filter.update.GZIPFilterTest
  803. Running org.openmrs.web.filter.update.UpdateFilterModelTest
  804. Tests run: 6, Failures: 0, Errors: 0, Skipped: 0, Time elapsed: 1.803 sec - in org.openmrs.web.filter.update.UpdateFilterModelTest
  805. Running org.openmrs.web.filter.update.UpdateFilterTest
  806. Tests run: 5, Failures: 0, Errors: 0, Skipped: 0, Time elapsed: 0.507 sec - in org.openmrs.web.filter.update.UpdateFilterTest
  807. Running org.openmrs.web.filter.update.util.FilterUtilTest
  808. Tests run: 2, Failures: 0, Errors: 0, Skipped: 2, Time elapsed: 0 sec - in org.openmrs.web.filter.update.util.FilterUtilTest
  809. Running org.openmrs.web.WebDaemonTest
  810. Tests run: 1, Failures: 0, Errors: 0, Skipped: 0, Time elapsed: 0.002 sec - in org.openmrs.web.WebDaemonTest
  811. Running org.openmrs.web.WebUtilTest
  812. Tests run: 14, Failures: 0, Errors: 0, Skipped: 0, Time elapsed: 0 sec - in org.openmrs.web.WebUtilTest
  813.  
  814. Results :
  815.  
  816. Tests run: 46, Failures: 0, Errors: 0, Skipped: 2
  817.  
  818. [INFO]
  819. [INFO] --- maven-jar-plugin:2.3.2:jar (default-jar) @ openmrs-web ---
  820. [INFO] Building jar: C:\Users\Admin\core\web\target\openmrs-web-2.3.0-SNAPSHOT.jar
  821. [INFO]
  822. [INFO] --- maven-jar-plugin:2.3.2:test-jar (default) @ openmrs-web ---
  823. [INFO] Building jar: C:\Users\Admin\core\web\target\openmrs-web-2.3.0-SNAPSHOT-tests.jar
  824. [INFO]
  825. [INFO] --- license-maven-plugin:3.0:check (default) @ openmrs-web ---
  826. [INFO] Checking licenses...
  827. [INFO]
  828. [INFO] --- maven-install-plugin:2.4:install (default-install) @ openmrs-web ---
  829. [INFO] Installing C:\Users\Admin\core\web\target\openmrs-web-2.3.0-SNAPSHOT.jar to C:\Users\Admin\.m2\repository\org\openmrs\web\openmrs-web\2.3.0-SNAPSHOT\openmrs-web-2.3.0-SNAPSHOT.jar
  830. [INFO] Installing C:\Users\Admin\core\web\pom.xml to C:\Users\Admin\.m2\repository\org\openmrs\web\openmrs-web\2.3.0-SNAPSHOT\openmrs-web-2.3.0-SNAPSHOT.pom
  831. [INFO] Installing C:\Users\Admin\core\web\target\openmrs-web-2.3.0-SNAPSHOT-tests.jar to C:\Users\Admin\.m2\repository\org\openmrs\web\openmrs-web\2.3.0-SNAPSHOT\openmrs-web-2.3.0-SNAPSHOT-tests.jar
  832. [INFO]
  833. [INFO] -------------------< org.openmrs.web:openmrs-webapp >-------------------
  834. [INFO] Building openmrs-webapp 2.3.0-SNAPSHOT [6/6]
  835. [INFO] --------------------------------[ war ]---------------------------------
  836. [INFO]
  837. [INFO] --- maven-clean-plugin:2.5:clean (default-clean) @ openmrs-webapp ---
  838. [INFO] Deleting C:\Users\Admin\core\webapp\target
  839. [INFO]
  840. [INFO] --- buildnumber-maven-plugin:1.1:create (default) @ openmrs-webapp ---
  841. [INFO]
  842. [INFO] --- build-helper-maven-plugin:1.5:parse-version (parse-version) @ openmrs-webapp ---
  843. [INFO]
  844. [INFO] --- maven-resources-plugin:2.4:resources (default-resources) @ openmrs-webapp ---
  845. [INFO] Using 'UTF-8' encoding to copy filtered resources.
  846. [INFO] Copying 2 resources
  847. [INFO] Copying 1 resource to ../jetty
  848. [INFO]
  849. [INFO] --- maven-antrun-plugin:1.4:run (default) @ openmrs-webapp ---
  850. project.artifactId
  851. [INFO] Executing tasks
  852. [unzip] Expanding: C:\Users\Admin\core\webapp\src\main\resources\liquibase-demo-data.zip into C:\Users\Admin\core\webapp\target\classes
  853. [INFO] Executed tasks
  854. [INFO]
  855. [INFO] --- maven-compiler-plugin:2.1:compile (default-compile) @ openmrs-webapp ---
  856. [INFO] No sources to compile
  857. [INFO]
  858. [INFO] --- maven-resources-plugin:2.4:testResources (default-testResources) @ openmrs-webapp ---
  859. [INFO] Using 'UTF-8' encoding to copy filtered resources.
  860. [INFO] Copying 1 resource
  861. [INFO]
  862. [INFO] --- maven-compiler-plugin:2.1:testCompile (default-testCompile) @ openmrs-webapp ---
  863. [INFO] Compiling 3 source files to C:\Users\Admin\core\webapp\target\test-classes
  864. [INFO]
  865. [INFO] --- maven-surefire-plugin:2.18.1:test (default-test) @ openmrs-webapp ---
  866. [INFO] Surefire report directory: C:\Users\Admin\core\webapp\target\surefire-reports
  867.  
  868. -------------------------------------------------------
  869. T E S T S
  870. -------------------------------------------------------
  871. Running org.openmrs.MessagePropertiesFilesTest
  872. Tests run: 0, Failures: 0, Errors: 0, Skipped: 0, Time elapsed: 0.003 sec - in org.openmrs.MessagePropertiesFilesTest
  873.  
  874. Results :
  875.  
  876. Tests run: 0, Failures: 0, Errors: 0, Skipped: 0
  877.  
  878. [INFO]
  879. [INFO] --- maven-war-plugin:2.4:war (default-war) @ openmrs-webapp ---
  880. [INFO] Packaging webapp
  881. [INFO] Assembling webapp [openmrs-webapp] in [C:\Users\Admin\core\webapp\target\openmrs]
  882. [INFO] Processing war project
  883. [INFO] Copying webapp webResources [C:\Users\Admin\core\webapp\src/main/webapp] to [C:\Users\Admin\core\webapp\target\openmrs]
  884. [INFO] Copying webapp resources [C:\Users\Admin\core\webapp\src\main\webapp]
  885. [INFO] Webapp assembled in [6854 msecs]
  886. [INFO] Building war: C:\Users\Admin\core\webapp\target\openmrs.war
  887. [INFO]
  888. [INFO] --- maven-jar-plugin:2.3.2:test-jar (default) @ openmrs-webapp ---
  889. [INFO] Building jar: C:\Users\Admin\core\webapp\target\openmrs-tests.jar
  890. [INFO]
  891. [INFO] --- license-maven-plugin:3.0:check (default) @ openmrs-webapp ---
  892. [INFO] Checking licenses...
  893. [INFO]
  894. [INFO] --- maven-install-plugin:2.4:install (default-install) @ openmrs-webapp ---
  895. [INFO] Installing C:\Users\Admin\core\webapp\target\openmrs.war to C:\Users\Admin\.m2\repository\org\openmrs\web\openmrs-webapp\2.3.0-SNAPSHOT\openmrs-webapp-2.3.0-SNAPSHOT.war
  896. [INFO] Installing C:\Users\Admin\core\webapp\pom.xml to C:\Users\Admin\.m2\repository\org\openmrs\web\openmrs-webapp\2.3.0-SNAPSHOT\openmrs-webapp-2.3.0-SNAPSHOT.pom
  897. [INFO] Installing C:\Users\Admin\core\webapp\target\openmrs-tests.jar to C:\Users\Admin\.m2\repository\org\openmrs\web\openmrs-webapp\2.3.0-SNAPSHOT\openmrs-webapp-2.3.0-SNAPSHOT-tests.jar
  898. [INFO]
  899. [INFO] ------------------------< org.openmrs:openmrs >-------------------------
  900. [INFO] Building OpenMRS 2.3.0-SNAPSHOT [7/6]
  901. [INFO] --------------------------------[ pom ]---------------------------------
  902. [WARNING] The POM for org.eclipse.m2e:lifecycle-mapping:jar:1.0.0 is missing, no dependency information available
  903. [WARNING] Failed to retrieve plugin descriptor for org.eclipse.m2e:lifecycle-mapping:1.0.0: Plugin org.eclipse.m2e:lifecycle-mapping:1.0.0 or one of its dependencies could not be resolved: Failure to find org.eclipse.m2e:lifecycle-mapping:jar:1.0.0 in http://mavenrepo.openmrs.org/nexus/content/repositories/public was cached in the local repository, resolution will not be reattempted until the update interval of openmrs-repo has elapsed or updates are forced
  904. [INFO]
  905. [INFO] --- openmrs-sdk-maven-plugin:3.13.2:run (default-cli) @ openmrs ---
  906.  
  907. Checking if port 8080 is in use... [free]
  908.  
  909. Forking a new process... (use -Dfork=false to prevent forking)
  910.  
  911. [INFO] ------------------------------------------------------------------------
  912. [INFO] Reactor Summary:
  913. [INFO]
  914. [INFO] OpenMRS 2.3.0-SNAPSHOT ............................. FAILURE [ 16.521 s]
  915. [INFO] openmrs-tools ...................................... SUCCESS [ 5.529 s]
  916. [INFO] openmrs-test ....................................... SUCCESS [ 2.119 s]
  917. [INFO] openmrs-api ........................................ SUCCESS [36:12 min]
  918. [INFO] openmrs-web ........................................ SUCCESS [01:11 min]
  919. [INFO] openmrs-webapp 2.3.0-SNAPSHOT ...................... SUCCESS [ 25.576 s]
  920. [INFO] ------------------------------------------------------------------------
  921. [INFO] BUILD FAILURE
  922. [INFO] ------------------------------------------------------------------------
  923. [INFO] Total time: 39:30 min
  924. [INFO] Finished at: 2019-07-14T22:04:47+03:00
  925. [INFO] ------------------------------------------------------------------------
  926. [ERROR] Failed to execute goal org.openmrs.maven.plugins:openmrs-sdk-maven-plugin:3.13.2:run (default-cli) on project openmrs: Execution default-cli of goal org.openmrs.maven.plugins:openmrs-sdk-maven-plugin:3.13.2:run failed: ${maven.home} is not specified as a directory: 'C:\Users\Admin\core\EMBEDDED'. -> [Help 1]
  927. [ERROR]
  928. [ERROR] To see the full stack trace of the errors, re-run Maven with the -e switch.
  929. [ERROR] Re-run Maven using the -X switch to enable full debug logging.
  930. [ERROR]
  931. [ERROR] For more information about the errors and possible solutions, please read the following articles:
  932. [ERROR] [Help 1] http://cwiki.apache.org/confluence/display/MAVEN/PluginExecutionException
  933. 
Advertisement
RAW Paste Data Copied
Advertisement