Guest User

Untitled

a guest
Jun 16th, 2026
12
0
Never
Not a member of Pastebin yet? Sign Up, it unlocks many cool features!
text 38.50 KB | None | 0 0
  1. [451/689] desktop_gigabyte_technology_b550m_b550m_s2h_a1360 FAILED in 2.01s
  2. STDOUT FOR desktop_gigabyte_technology_b550m_b550m_s2h_a1360:
  3.  
  4. STDERR FOR desktop_gigabyte_technology_b550m_b550m_s2h_a1360:
  5. /home/d-tatianin/Projects/uACPI/source/interpreter.c:4127:48: runtime error: member access within null pointer of type 'struct code_block'
  6. AddressSanitizer:DEADLYSIGNAL
  7. =================================================================
  8. ==312923==ERROR: AddressSanitizer: SEGV on unknown address 0x000000000008 (pc 0x5cd3a74b1b8a bp 0x7fffc2ac1960 sp 0x7fffc2ac1930 T0)
  9. ==312923==The signal is caused by a READ memory access.
  10. ==312923==Hint: address points to the zero page.
  11. #0 0x5cd3a74b1b8a in handle_control_flow /home/d-tatianin/Projects/uACPI/source/interpreter.c:4127
  12. #1 0x5cd3a74bfb21 in exec_op /home/d-tatianin/Projects/uACPI/source/interpreter.c:5727
  13. #2 0x5cd3a74c3a8c in uacpi_execute_control_method /home/d-tatianin/Projects/uACPI/source/interpreter.c:6136
  14. #3 0x5cd3a74722d6 in uacpi_eval /home/d-tatianin/Projects/uACPI/source/uacpi.c:779
  15. #4 0x5cd3a74e9105 in eval_sleep_helper /home/d-tatianin/Projects/uACPI/source/sleep.c:290
  16. #5 0x5cd3a74e924c in eval_pts /home/d-tatianin/Projects/uACPI/source/sleep.c:309
  17. #6 0x5cd3a74e9632 in uacpi_prepare_for_sleep_state /home/d-tatianin/Projects/uACPI/source/sleep.c:386
  18. #7 0x5cd3a7443dc0 in enumerate_namespace /home/d-tatianin/Projects/uACPI/tests/runner/test_runner.c:212
  19. #8 0x5cd3a744482e in run_test /home/d-tatianin/Projects/uACPI/tests/runner/test_runner.c:436
  20. #9 0x5cd3a7444feb in main /home/d-tatianin/Projects/uACPI/tests/runner/test_runner.c:569
  21. #10 0x7b817b42a600 in __libc_start_call_main ../sysdeps/nptl/libc_start_call_main.h:59
  22. #11 0x7b817b42a717 in __libc_start_main_impl ../csu/libc-start.c:360
  23. #12 0x5cd3a743f9e4 in _start (/home/d-tatianin/Projects/uACPI/tests/runner/build-linux-64bits/test-runner+0x12a9e4) (BuildId: a922e1b1b07e47fceddb7bc4400d9309e5299a0d)
  24.  
  25. ==312923==Register values:
  26. rax = 0x0000000000000000 rbx = 0x0000000000000000 rcx = 0x00007b817b81d900 rdx = 0x0000000000000008
  27. rdi = 0x00005cd3a74b1b39 rsi = 0x00007fffc2ac1920 rbp = 0x00007fffc2ac1960 rsp = 0x00007fffc2ac1930
  28. r8 = 0x00007fffc2ac136b r9 = 0x000000000000008b r10 = 0x0000000000000000 r11 = 0x0000000000000206
  29. r12 = 0x00007781790b3100 r13 = 0x0000000000000005 r14 = 0x00000ef02f216620 r15 = 0x0000000000000003
  30. AddressSanitizer can not provide additional info.
  31. SUMMARY: AddressSanitizer: SEGV /home/d-tatianin/Projects/uACPI/source/interpreter.c:4127 in handle_control_flow
  32. ==312923==ABORTING
  33.  
  34. [452/689] desktop_lenovo_thinkcentre_thinkcentre_m58p_6137au8_d3a67f9dbf3c OK in 0.12s
  35. [453/689] desktop_asrock_b365m_b365m_pro4-f_3ed58ab6f5a2 OK in 0.63s
  36. [454/689] desktop_asrock_x600_x600m-stx_f7eb1079bc08 OK in 0.73s
  37. [455/689] desktop_asrock_x570_x570_taichi_b565ca745aaf OK in 0.75s
  38. [456/689] desktop_lenovo_thinkcentre_thinkcentre_e73_10ds000tuk_cb64eedf666a OK in 0.44s
  39. [457/689] desktop_gigabyte_technology_z370m_z370m_ds3h_79b65581f6fa OK in 9.49s
  40. [458/689] notebook_hewlett-packard_omen_omen_laptop_15-ek0xxx_99fda76a13ea OK in 1.21s
  41. [459/689] desktop_asrock_970m_970m_pro3_75a2db3f503a OK in 0.57s
  42. [460/689] desktop_gigabyte_technology_ex58_ex58-ud5_df2f64a5d6ca OK in 0.15s
  43. [461/689] desktop_asrock_x370_x370_gaming_x_fd61edf83841 OK in 0.75s
  44. [462/689] desktop_asrock_conroe1333_conroe1333-glan_7defd46b4817 OK in 0.14s
  45. [463/689] desktop_gigabyte_technology_m68_m68m-s2p_aa9f6580690e OK in 0.14s
  46. [464/689] desktop_asrock_x370_x370_killer_sli_4c483d36d3e6 OK in 0.15s
  47. [465/689] desktop_lenovo_thinkstation_thinkstation_p520_30bfs44d00_0f7d6ab70f4c OK in 0.69s
  48. [466/689] desktop_asrock_x570_x570_steel_legend_bdef664e9d74 OK in 0.78s
  49. [467/689] desktop_asrock_x470_x470_master_sli_718dba7a68d6 OK in 0.28s
  50. [468/689] desktop_dell_xps_xps_8940_9b79a7439313 OK in 0.84s
  51. [469/689] desktop_dell_inspiron_inspiron_530_def2def61aed OK in 0.12s
  52. [470/689] desktop_asrock_x399_x399_taichi_ab101543d5e5 OK in 0.86s
  53. [471/689] desktop_asrock_x370_x370_pro4_d168cdf2391b OK in 0.73s
  54. [472/689] desktop_dell_optiplex_optiplex_755_9b3c34 OK in 0.17s
  55. [472/689] desktop_gigabyte_technology_b550m_b550m_s2h_a1360a8647f9 FAILED in 2.08s
  56. STDOUT FOR desktop_gigabyte_technology_b550m_b550m_s2h_a1360a8647f9:
  57.  
  58. STDERR FOR desktop_gigabyte_technology_b550m_b550m_s2h_a1360a8647f9:
  59. /home/d-tatianin/Projects/uACPI/source/interpreter.c:4127:48: runtime error: member access within null pointer of type 'struct code_block'
  60. AddressSanitizer:DEADLYSIGNAL
  61. =================================================================
  62. ==312984==ERROR: AddressSanitizer: SEGV on unknown address 0x000000000008 (pc 0x5a9d0e57fb8a bp 0x7ffed80a0db0 sp 0x7ffed80a0d80 T0)
  63. ==312984==The signal is caused by a READ memory access.
  64. ==312984==Hint: address points to the zero page.
  65. #0 0x5a9d0e57fb8a in handle_control_flow /home/d-tatianin/Projects/uACPI/source/interpreter.c:4127
  66. #1 0x5a9d0e58db21 in exec_op /home/d-tatianin/Projects/uACPI/source/interpreter.c:5727
  67. #2 0x5a9d0e591a8c in uacpi_execute_control_method /home/d-tatianin/Projects/uACPI/source/interpreter.c:6136
  68. #3 0x5a9d0e5402d6 in uacpi_eval /home/d-tatianin/Projects/uACPI/source/uacpi.c:779
  69. #4 0x5a9d0e5b7105 in eval_sleep_helper /home/d-tatianin/Projects/uACPI/source/sleep.c:290
  70. #5 0x5a9d0e5b724c in eval_pts /home/d-tatianin/Projects/uACPI/source/sleep.c:309
  71. #6 0x5a9d0e5b7632 in uacpi_prepare_for_sleep_state /home/d-tatianin/Projects/uACPI/source/sleep.c:386
  72. #7 0x5a9d0e511dc0 in enumerate_namespace /home/d-tatianin/Projects/uACPI/tests/runner/test_runner.c:212
  73. #8 0x5a9d0e51282e in run_test /home/d-tatianin/Projects/uACPI/tests/runner/test_runner.c:436
  74. #9 0x5a9d0e512feb in main /home/d-tatianin/Projects/uACPI/tests/runner/test_runner.c:569
  75. #10 0x70da2d02a600 in __libc_start_call_main ../sysdeps/nptl/libc_start_call_main.h:59
  76. #11 0x70da2d02a717 in __libc_start_main_impl ../csu/libc-start.c:360
  77. #12 0x5a9d0e50d9e4 in _start (/home/d-tatianin/Projects/uACPI/tests/runner/build-linux-64bits/test-runner+0x12a9e4) (BuildId: a922e1b1b07e47fceddb7bc4400d9309e5299a0d)
  78.  
  79. ==312984==Register values:
  80. rax = 0x0000000000000000 rbx = 0x0000000000000000 rcx = 0x000070da2d41d900 rdx = 0x0000000000000008
  81. rdi = 0x00005a9d0e57fb39 rsi = 0x00007ffed80a0d70 rbp = 0x00007ffed80a0db0 rsp = 0x00007ffed80a0d80
  82. r8 = 0x00007ffed80a07bb r9 = 0x000000000000008b r10 = 0x0000000000000000 r11 = 0x0000000000000206
  83. r12 = 0x00006cda2acb3100 r13 = 0x0000000000000005 r14 = 0x00000d9b45596620 r15 = 0x0000000000000003
  84. AddressSanitizer can not provide additional info.
  85. SUMMARY: AddressSanitizer: SEGV /home/d-tatianin/Projects/uACPI/source/interpreter.c:4127 in handle_control_flow
  86. ==312984==ABORTING
  87.  
  88. [473/689] desktop_asrock_z170_z170_extreme4_fbf904e4434d OK in 0.67s
  89. [474/689] desktop_dell_optiplex_optiplex_3080_0b33085dfa99 OK in 0.58s
  90. [475/689] notebook_lenovo_thinkpad_thinkpad_t470p_20j7s0dk00_5865e6669295 OK in 6.47s
  91. [476/689] desktop_asrock_h310_h310cm-hdv_024de286f7b5 OK in 0.75s
  92. [477/689] notebook_lenovo_thinkpad_thinkpad_x1_carbon_gen_9_20xw007ypb_c06a0e31b5d6 OK in 6.71s
  93. [478/689] notebook_lenovo_thinkpad_thinkpad_l14_gen_2a_20x6s1ds0p_afeac727552d OK in 9.54s
  94. [479/689] desktop_hewlett-packard_elitedesk_elitedesk_800_g3_sff_45f34bfd030b OK in 3.52s
  95. [480/689] notebook_lenovo_thinkpad_thinkpad_mini10_3507a31_eac15d3f8438 OK in 0.18s
  96. [481/689] desktop_dell_precision_precision_t3600_a82d1c626adb OK in 1.74s
  97. [482/689] desktop_asrock_b650_b650_pg_lightning_69b64d1d19b3 OK in 1.12s
  98. [483/689] desktop_hewlett-packard_z220_z220_cmt_workstation_9d0dfefb9e7c OK in 0.25s
  99. [484/689] desktop_dell_optiplex_optiplex_7040_ad144 OK in 0.56s
  100. [485/689] desktop_asrock_b450m_b450m_pro4_9cdd2e1abe37 OK in 1.05s
  101. [486/689] notebook_lenovo_thinkpad_thinkpad_p17_gen_2i_20yu0006ge_16da01ac3d1b OK in 6.94s
  102. [487/689] desktop_gigabyte_technology_x470_x470_aorus_gaming_5_wifi_e7a117ace8b4 OK in 4.33s
  103. [488/689] notebook_apple_macbookpro11_macbookpro11,1_825764b4427f OK in 5.32s
  104. [489/689] desktop_hewlett-packard_z240_z240_sff_workstation_c6a3a3e6eb01 OK in 0.87s
  105. [490/689] desktop_gigabyte_technology_h87_h87-d3h_91387ba22866 OK in 0.38s
  106. [491/689] desktop_asrock_h77_h77m_b9edf74b73ff OK in 0.72s
  107. [492/689] notebook_lenovo_thinkpad_thinkpad_x230_2333br3_c1dacb9dd49b OK in 12.30s
  108. [493/689] desktop_asrock_h510_h510m-hdv_cdcd2d2eb373 OK in 1.53s
  109. [494/689] desktop_asrock_b650_b650_pg_lightning_e50ea86b0f5d OK in 1.20s
  110. [495/689] desktop_gigabyte_technology_990_990fxa-ud3_304d134a1d3e OK in 0.31s
  111. [496/689] desktop_gigabyte_technology_990_990xa-ud3_16d86a6f85c2 OK in 0.25s
  112. [497/689] desktop_supermicro_x8_x8sil_40aecbff4573 OK in 0.33s
  113. [498/689] desktop_gigabyte_technology_x79_x79-up4_e9921195b1eb OK in 3.55s
  114. [499/689] desktop_lenovo_thinkcentre_thinkcentre_m93p_10ab001uge_36ff62376a89 OK in 0.81s
  115. [500/689] desktop_gigabyte_technology_p35_p35-ds4_8b35a6ed2a7a OK in 0.16s
  116. [501/689] desktop_asrock_b450_b450_steel_legend_88a31 OK in 0.91s
  117. [501/689] desktop_gigabyte_technology_b550m_b550m_aorus_pro-p_e7097f5d323f FAILED in 2.81s
  118. STDOUT FOR desktop_gigabyte_technology_b550m_b550m_aorus_pro-p_e7097f5d323f:
  119.  
  120. STDERR FOR desktop_gigabyte_technology_b550m_b550m_aorus_pro-p_e7097f5d323f:
  121. /home/d-tatianin/Projects/uACPI/source/interpreter.c:4127:48: runtime error: member access within null pointer of type 'struct code_block'
  122. AddressSanitizer:DEADLYSIGNAL
  123. =================================================================
  124. ==313052==ERROR: AddressSanitizer: SEGV on unknown address 0x000000000008 (pc 0x5e3ce74ebb8a bp 0x7ffc51e1c9b0 sp 0x7ffc51e1c980 T0)
  125. ==313052==The signal is caused by a READ memory access.
  126. ==313052==Hint: address points to the zero page.
  127. #0 0x5e3ce74ebb8a in handle_control_flow /home/d-tatianin/Projects/uACPI/source/interpreter.c:4127
  128. #1 0x5e3ce74f9b21 in exec_op /home/d-tatianin/Projects/uACPI/source/interpreter.c:5727
  129. #2 0x5e3ce74fda8c in uacpi_execute_control_method /home/d-tatianin/Projects/uACPI/source/interpreter.c:6136
  130. #3 0x5e3ce74ac2d6 in uacpi_eval /home/d-tatianin/Projects/uACPI/source/uacpi.c:779
  131. #4 0x5e3ce7523105 in eval_sleep_helper /home/d-tatianin/Projects/uACPI/source/sleep.c:290
  132. #5 0x5e3ce752324c in eval_pts /home/d-tatianin/Projects/uACPI/source/sleep.c:309
  133. #6 0x5e3ce7523632 in uacpi_prepare_for_sleep_state /home/d-tatianin/Projects/uACPI/source/sleep.c:386
  134. #7 0x5e3ce747ddc0 in enumerate_namespace /home/d-tatianin/Projects/uACPI/tests/runner/test_runner.c:212
  135. #8 0x5e3ce747e82e in run_test /home/d-tatianin/Projects/uACPI/tests/runner/test_runner.c:436
  136. #9 0x5e3ce747efeb in main /home/d-tatianin/Projects/uACPI/tests/runner/test_runner.c:569
  137. #10 0x708fb002a600 in __libc_start_call_main ../sysdeps/nptl/libc_start_call_main.h:59
  138. #11 0x708fb002a717 in __libc_start_main_impl ../csu/libc-start.c:360
  139. #12 0x5e3ce74799e4 in _start (/home/d-tatianin/Projects/uACPI/tests/runner/build-linux-64bits/test-runner+0x12a9e4) (BuildId: a922e1b1b07e47fceddb7bc4400d9309e5299a0d)
  140.  
  141. ==313052==Register values:
  142. rax = 0x0000000000000000 rbx = 0x0000000000000000 rcx = 0x0000708fb041d900 rdx = 0x0000000000000008
  143. rdi = 0x00005e3ce74ebb39 rsi = 0x00007ffc51e1c970 rbp = 0x00007ffc51e1c9b0 rsp = 0x00007ffc51e1c980
  144. r8 = 0x00007ffc51e1c3bb r9 = 0x000000000000008b r10 = 0x0000000000000000 r11 = 0x0000000000000206
  145. r12 = 0x00006c8fadcaaa00 r13 = 0x0000000000000005 r14 = 0x00000d91f5b95540 r15 = 0x0000000000000003
  146. AddressSanitizer can not provide additional info.
  147. SUMMARY: AddressSanitizer: SEGV /home/d-tatianin/Projects/uACPI/source/interpreter.c:4127 in handle_control_flow
  148. ==313052==ABORTING
  149.  
  150. [502/689] desktop_dell_precision_precision_t3600_0b35aa5c5e30 OK in 2.01s
  151. [503/689] desktop_dell_precision_precision_workstation_t3500_2148e87727ee OK in 0.15s
  152. [504/689] desktop_asustek_computer_tuf_tuf_x470-plus_gaming_fa691f349b4d OK in 0.68s
  153. [505/689] desktop_dell_precision_precision_workstation_t7500_428b8d25dda9 OK in 0.20s
  154. [506/689] desktop_lenovo_thinkcentre_thinkcentre_m710q_10mr0009us_57ec640b0afd OK in 0.80s
  155. [507/689] desktop_asrock_b550m_b550m_pro4_7c9d8c3c9f5e OK in 0.98s
  156. [508/689] desktop_asustek_computer_m5a78l-m_m5a78l-m_plus-usb3_1429fa6a44bb OK in 0.34s
  157. [509/689] desktop_asustek_computer_k30_k30ad_m31ad_m51ad_7403924d239f OK in 2.05s
  158. [510/689] desktop_lenovo_thinkcentre_thinkcentre_m800_10fw0004ca_f935b8431f8f OK in 0.80s
  159. [511/689] desktop_dell_optiplex_optiplex_3020m_5b206dc9512c OK in 3.39s
  160. [512/689] desktop_asustek_computer_tuf_tuf_gaming_h570-pro_wifi_f91602f0faa5 OK in 1.38s
  161. [513/689] desktop_asustek_computer_prime_prime_b450m-a_ii_076ccb6076ed OK in 0.60s
  162. [514/689] desktop_dell_optiplex_optiplex_7020_6d4e9a8fe68b OK in 0.33s
  163. [515/689] desktop_asustek_computer_prime_prime_x399-a_73edb0ddff0e OK in 0.73s
  164. [516/689] desktop_asustek_computer_maximus_maximus_viii_formula_ed4ede81937f OK in 0.85s
  165. [517/689] desktop_asustek_computer_p5_p5b-mx_eb6cce37b87f OK in 0.18s
  166. [518/689] desktop_dell_optiplex_optiplex_5040_fa62aa11285a OK in 0.61s
  167. [519/689] desktop_asustek_computer_tuf_tuf_gaming_x570-plus_ffe351bd703d OK in 0.86s
  168. [520/689] desktop_asustek_computer_p5_p5gc-mx_84cd51fc834b OK in 0.19s
  169. [521/689] desktop_optimized_hosting_kvm_kvm_9112ec3cc44c OK in 0.16s
  170. [522/689] desktop_asustek_computer_prime_prime_z270-a_e3f807f0d97b OK in 0.91s
  171. [523/689] desktop_asustek_computer_p5_p5q-em_c27bd13101d2 OK in 0.23s
  172. [524/689] desktop_supermicro_x7_x7db8_22c25edff9a3 OK in 0.14s
  173. [525/689] desktop_asustek_computer_p5_p5vd2-vm_9610a2e3ca3d OK in 0.35s
  174. [526/689] desktop_asustek_computer_prime_prime_h270-plus_f5f6d462de08 OK in 0.86s
  175. [527/689] desktop_asustek_computer_prime_prime_z690-p_71656898deba OK in 1.42s
  176. [528/689] desktop_gigabyte_technology_x299_x299_ud4_ad9ba0c2f08f OK in 3.91s
  177. [529/689] desktop_asustek_computer_tuf_tuf_b360m-plus_gaming_s_991c7cb5459e OK in 1.45s
  178. [530/689] notebook_apple_macbookpro11_macbookpro11,1_82576 OK in 5.36s
  179. [531/689] desktop_asustek_computer_all_all_series_6b158ae6bd79 OK in 1.25s
  180. [532/689] desktop_gigabyte_technology_h410m_h410m_s2h_31ebc80b0863 OK in 4.88s
  181. [533/689] desktop_asustek_computer_prime_prime_b550-plus_a7bcabe66ea7 OK in 0.90s
  182. [534/689] desktop_gigabyte_technology_b650m_b650m_gaming_x_ax_894fb7d28f2c OK in 4.75s
  183. [535/689] desktop_asustek_computer_prime_prime_b460-plus_710a9465eb16 OK in 1.11s
  184. [536/689] notebook_lenovo_thinkpad_thinkpad_p1_gen_4i_20y4s0ks00_4012a98bfaa3 OK in 7.06s
  185. [537/689] desktop_asustek_computer_tuf_tuf_gaming_b550m-plus_5f9a1c76d918 OK in 0.85s
  186. [538/689] desktop_gigabyte_technology_f2_f2a78m-hd2_42ba815263dc OK in 0.24s
  187. [539/689] notebook_lenovo_thinkpad_thinkpad_l15_gen_2_20x300g8gm_79c50e5fee73 OK in 7.24s
  188. [540/689] notebook_lenovo_thinkpad_thinkpad_e15_gen_4_21e6006acd_137ff1e22ee3 OK in 7.39s
  189. [541/689] desktop_asustek_computer_prime_prime_b550m-a_wifi_ii_07e0c OK in 0.91s
  190. [542/689] notebook_lenovo_thinkpad_thinkpad_t520_4243b65_8eceb82738bc OK in 0.28s
  191. [543/689] desktop_asustek_computer_tuf_tuf_gaming_b550m-plus_4212f03f1d44 OK in 0.73s
  192. [544/689] desktop_asustek_computer_prime_prime_z590m-plus_01cb5fb8471f OK in 1.17s
  193. [545/689] desktop_asustek_computer_rog_rog_maximus_z790_apex_encore_453214f7306f OK in 1.08s
  194. [546/689] desktop_asustek_computer_tuf_tuf_gaming_b550m-plus_1c6f9d6927f5 OK in 0.76s
  195. [547/689] desktop_asustek_computer_all_all_series_251accf87e7b OK in 1.90s
  196. [548/689] desktop_asustek_computer_prime_prime_h670-plus_d4_04d719f81681 OK in 1.00s
  197. [549/689] desktop_asustek_computer_prime_prime_x370-pro_af35e7f8c107 OK in 0.57s
  198. [550/689] desktop_dell_precision_precision_t3610_072875b334cd OK in 6.46s
  199. [551/689] desktop_supermicro_x10_x10dai_4a64a6094fe3 OK in 4.07s
  200. [552/689] desktop_asustek_computer_prime_prime_x370-pro_22f59a67504c OK in 0.66s
  201. [553/689] desktop_asustek_computer_tuf_tuf_gaming_b650m-plus_225a3 OK in 0.96s
  202. [554/689] desktop_asustek_computer_rog_rog_maximus_z690_hero_5cac4aceee94 OK in 1.27s
  203. [555/689] desktop_asustek_computer_prime_prime_h310t_7c60e775ad2d OK in 1.17s
  204. [556/689] desktop_gigabyte_technology_x299_x299_ud4_pro_331f76f426af OK in 3.84s
  205. [557/689] desktop_asustek_computer_prime_prime_a320m-k_56ec98641976 OK in 0.61s
  206. [558/689] desktop_dell_g5_g5_5090_67c667dae80a OK in 0.96s
  207. [559/689] desktop_gigabyte_technology_ga-ma785_ga-ma785gm-us2h_75cf50c321be OK in 0.20s
  208. [560/689] desktop_asustek_computer_all_all_series_1f1094ad9ee9 OK in 1.71s
  209. [561/689] desktop_asustek_computer_m4a88td-v_m4a88td-v_evo-usb3_822ed952e415 OK in 0.33s
  210. [562/689] notebook_lenovo_thinkpad_thinkpad_t480s_20l7s00600_8c21f14ad994 OK in 9.71s
  211. [563/689] desktop_gigabyte_technology_z97x-gaming_z97x-gaming_5_98995e9a58a2 OK in 0.31s
  212. [564/689] desktop_asustek_computer_rog_rog_strix_z390-h_gaming_5180182bc315 OK in 1.38s
  213. [565/689] desktop_asustek_computer_tuf_tuf_gaming_b650m-plus_225a3f2b9199 OK in 1.06s
  214. [566/689] desktop_asustek_computer_rog_rog_strix_z370-g_gaming_b647cf3822f1 OK in 0.86s
  215. [567/689] desktop_asustek_computer_prime_prime_b350m-e_c6029faf836e OK in 0.61s
  216. [568/689] desktop_asustek_computer_z170_z170-a_8251618fd9b2 OK in 0.66s
  217. [569/689] desktop_asustek_computer_prime_prime_b660-plus_d4_9b142b25d938 OK in 1.39s
  218. [570/689] desktop_asustek_computer_rog_rog_strix_b560-a_gaming_wifi_28fa62e95ce1 OK in 1.16s
  219. [571/689] desktop_asustek_computer_prime_prime_h410m-e_dae89e314c76 OK in 1.10s
  220. [572/689] desktop_asustek_computer_tuf_tuf_gaming_z790-plus_wifi_d4_fcc2f7033916 OK in 1.14s
  221. [573/689] desktop_msi_ms_ms-7222_05b8285f38bf OK in 0.14s
  222. [574/689] desktop_asustek_computer_z170_z170-a_829c11128b18 OK in 0.87s
  223. [575/689] desktop_asustek_computer_cm_cm6870_c045cc8fc0b4 OK in 0.21s
  224. [576/689] notebook_apple_macbookpro11_macbookpro11,1_453137ec6e83 OK in 5.35s
  225. [577/689] desktop_asustek_computer_rog_rog_strix_b660-i_gaming_wifi_697584ebfa5c OK in 1.39s
  226. [578/689] desktop_msi_ms_ms-7519_4067500f99bb OK in 0.19s
  227. [579/689] desktop_asustek_computer_all_all_series_beb9f4663954 OK in 1.84s
  228. [580/689] desktop_hewlett-packard_450_450-a100ns_c9d5e5e25dcf OK in 5.42s
  229. [581/689] desktop_msi_ms_ms-7817_fa7197f212ca OK in 0.29s
  230. [582/689] desktop_asustek_computer_sabertooth_sabertooth_p67_7cbeb7920500 OK in 0.25s
  231. [583/689] desktop_asustek_computer_prime_prime_z390-p_842b84d25492 OK in 1.19s
  232. [584/689] desktop_msi_ms_ms-7817_b80440bde42e OK in 0.24s
  233. [585/689] desktop_asustek_computer_strix_strix_z270e_gaming_40ba5e949a86 OK in 0.81s
  234. [586/689] desktop_asustek_computer_rog_rog_strix_x570-e_gaming_1c1934a994b8 OK in 0.85s
  235. [587/689] desktop_asustek_computer_a88_a88x-plus_279ba270c61d OK in 0.21s
  236. [588/689] desktop_asustek_computer_rog_rog_strix_z490-f_gaming_7ed83b084e51 OK in 1.34s
  237. [589/689] desktop_hewlett-packard_desktop_m01-f3xxx_a2cdb OK in 0.91s
  238. [590/689] desktop_asustek_computer_p5ql_p5ql_pro_772a7ddd8bc2 OK in 0.17s
  239. [591/689] desktop_gigabyte_technology_z390_z390_i_aorus_pro_wifi_f80efc3e557e OK in 21.34s
  240. [592/689] desktop_msi_ms-7_ms-7b78_e18238cfe532 OK in 0.58s
  241. [593/689] desktop_hewlett-packard_h8_h8-1080sc_25250fd435e2 OK in 0.20s
  242. [594/689] desktop_asustek_computer_prime_prime_b650m-a_ii_ba68a44b01b8 OK in 0.86s
  243. [595/689] desktop_asustek_computer_rog_rog_maximus_xi_hero_322f466e2e3e OK in 1.31s
  244. [596/689] desktop_gigabyte_technology_ga-ma78_ga-ma78lmt-us2h_883557b73aaa OK in 0.21s
  245. [597/689] desktop_msi_ms-7_ms-7d23_4db8a3efbf0b OK in 1.03s
  246. [598/689] notebook_apple_macbookpro16_macbookpro16,1_f725d0179b32 OK in 1.48s
  247. [599/689] desktop_google_fizz_fizz_2273995fc33a OK in 0.15s
  248. [600/689] desktop_asustek_computer_m5_m5a88-m_b5844611ee06 OK in 0.35s
  249. [601/689] desktop_others_others_others_fbc02beee3c4 OK in 0.26s
  250. [602/689] desktop_gigabyte_technology_q87_q87m-d2h_4a407db4786c OK in 0.26s
  251. [603/689] desktop_msi_ms-7_ms-7e16_e1c70edcd975 OK in 0.85s
  252. [604/689] notebook_lenovo_thinkpad_thinkpad_x1_carbon_gen_8_20uas89500_282408b7fdec OK in 6.74s
  253. [605/689] desktop_msi_ms_ms-7793_a78785119709 OK in 0.31s
  254. [606/689] desktop_gigabyte_technology_ga-880_ga-880gma-usb3_83a64b35f7d8 OK in 0.26s
  255. [607/689] notebook_lenovo_thinkpad_thinkpad_w540_20bhs11m00_f5785b0c6551 OK in 12.38s
  256. [608/689] notebook_apple_macbookpro12_macbookpro12,1_a236f4dd9072 OK in 0.45s
  257. [609/689] desktop_msi_ms-7_ms-7c02_e7f57a01752d OK in 0.76s
  258. [610/689] desktop_tianbei_gem_gem12_92f536e19c16 OK in 0.57s
  259. [611/689] desktop_msi_ms-7_ms-7b79_58cca16afbb8 OK in 0.71s
  260. [612/689] desktop_peladn_ha_ha-4_5a2ccd6d8884 OK in 0.62s
  261. [613/689] desktop_asustek_computer_rog_rog_maximus_xi_formula_40d9f9c25c94 OK in 1.25s
  262. [614/689] desktop_msi_ms-7_ms-7c84_8aec9430ca40 OK in 0.69s
  263. [615/689] desktop_asustek_computer_rog_rog_strix_x670e-f_gaming_wifi_754107881c80 OK in 1.05s
  264. [616/689] desktop_medion_ms_ms-7318_04ddf3a09383 OK in 0.52s
  265. [617/689] desktop_msi_ms_ms-7885_a386b4bdc94d OK in 0.82s
  266. [618/689] desktop_gigabyte_technology_ax370-gaming_ax370-gaming_k5_e16b4e17052e OK in 4.19s
  267. [619/689] desktop_biostar_tb250_tb250-btc_1421a6055406 OK in 0.54s
  268. [620/689] desktop_msi_ms-7_ms-7c35_cc63ef2f9155 OK in 0.59s
  269. [621/689] desktop_msi_ms_ms-7641_9dd6689c023b OK in 0.19s
  270. [622/689] desktop_biostar_a68_a68mhe_a3ba00d9a03a OK in 0.22s
  271. [623/689] desktop_msi_ms-7_ms-7c91_4b3084362200 OK in 0.66s
  272. [624/689] desktop_msi_ms_ms-7850_f51f4b762f47 OK in 0.26s
  273. [625/689] desktop_msi_ms-7_ms-7d22_efe8f101ce6e OK in 1.18s
  274. [626/689] desktop_asustek_computer_rog_rog_zenith_ii_extreme_alpha_bf6a37f4a7d0 OK in 0.76s
  275. [627/689] desktop_gigabyte_technology_z270_z270n-wifi_c5aacad1cd45 OK in 0.63s
  276. [628/689] desktop_msi_ms-7_ms-7a38_7e5fad5a8e8c OK in 0.58s
  277. [629/689] desktop_asustek_computer_rog_rog_maximus_xi_formula_5e84c606c2ed OK in 1.11s
  278. [630/689] desktop_tsinghua_tongfang_computer_e_e500_58972bd24bf4 OK in 1.00s
  279. [631/689] desktop_biostar_b450mhp_10ede23c8192 OK in 0.65s
  280. [632/689] desktop_msi_ms-7_ms-7c91_6c848de1fd01 OK in 0.67s
  281. [633/689] desktop_msi_ms-7_ms-7a38_53b5d217d45c OK in 0.59s
  282. [634/689] desktop_msi_ms-7_ms-7d70_afd239798cb7 OK in 0.82s
  283. [635/689] desktop_asustek_computer_rog_rog_strix_b650e-e_gaming_wifi_155bcb0e54da OK in 0.86s
  284. [636/689] desktop_asustek_computer_rog_rog_crosshair_vii_hero_b8c16a683e5f OK in 0.58s
  285. [637/689] notebook_apple_macbookpro8_macbookpro8,1_105b0a5bdf18 OK in 2.19s
  286. [638/689] desktop_huanan_x99-qd4_x99-qd4_v1.0_734cd3a053fc OK in 0.73s
  287. [639/689] desktop_msi_ms-7_ms-7c91_12d38fa28e1a OK in 0.63s
  288. [640/689] desktop_msi_ms-7_ms-7a15_055f3a7cf9a9 OK in 0.44s
  289. [641/689] desktop_huanan_h97-zd3_h97-zd3_v2.0_da97878b0519 OK in 0.25s
  290. [642/689] desktop_wortmann_ag_eu1009_eu1009628_2110193_7b9307415ca0 OK in 0.98s
  291. [643/689] desktop_asustek_computer_h110_h110m-a-m.2_c8af5b504787 OK in 0.64s
  292. [644/689] desktop_asustek_computer_rog_rog_strix_b650e-e_gaming_wifi_f6a4ec50a721 OK in 0.78s
  293. [645/689] desktop_msi_ms-7_ms-7d67_dca8ef0efa4d OK in 0.89s
  294. [646/689] desktop_msi_ms-7_ms-7a71_0a6ae3a8428c OK in 0.42s
  295. [647/689] desktop_msi_mpg_b550_gaming_plus_ab170 OK in 0.63s
  296. [648/689] desktop_gmktec_nucbox_nucbox_k6_429d41325b4f OK in 0.46s
  297. [649/689] notebook_lenovo_thinkpad_thinkpad_p15s_gen_2i_20w6001vus_c49af6f23385 OK in 6.76s
  298. [650/689] desktop_msi_ms-7_ms-7c37_872109368cdd OK in 0.49s
  299. [651/689] desktop_asustek_computer_rog_rog_strix_x370-f_gaming_9a3503578d93 OK in 0.58s
  300. [652/689] desktop_msi_ms-7_ms-7e12_45b82ca46234 OK in 0.73s
  301. [653/689] desktop_gigabyte_technology_a320_a320m-s2h_7cfe191333a8 OK in 3.82s
  302. [654/689] desktop_azw_mini_mini_s_b2d47b242801 OK in 0.74s
  303. [655/689] desktop_msi_ms-7_ms-7c37_d3d64c7d3bf4 OK in 0.47s
  304. [656/689] desktop_asustek_computer_rog_rog_strix_b550-a_gaming_2a3464a3caf2 OK in 0.72s
  305. [657/689] desktop_asustek_computer_p8h61-m_p8h61-m_lx_r2.0_919695431ab5 OK in 1.52s
  306. [658/689] desktop_msi_ms-7_ms-7c37_129e9638dc76 OK in 0.52s
  307. [659/689] desktop_asustek_computer_a68_a68hm-k_17747204732b OK in 0.14s
  308. [660/689] desktop_azw_mini_mini_s_4cfbb4a892a7 OK in 0.68s
  309. [661/689] desktop_msi_ms-7_ms-7b19_0fe3c97f624e OK in 0.68s
  310. [662/689] desktop_asustek_computer_z170i_z170i_pro_gaming_14f5f0dd90ff OK in 0.66s
  311. [663/689] desktop_others_others_others_93b51664abeb OK in 0.62s
  312. [664/689] desktop_asustek_computer_p7_p7h55_8c403befa84f OK in 0.17s
  313. [665/689] desktop_others_others_others_bdc9fd1cda95 OK in 0.48s
  314. [666/689] notebook_apple_macbookair7_macbookair7,2_cff70078a1da OK in 3.44s
  315. [667/689] desktop_msi_ms-7_ms-7e16_b75c85853132 OK in 0.62s
  316. [668/689] notebook_apple_macbookpro5_macbookpro5,5_70ea14c29a69 OK in 0.11s
  317. [669/689] desktop_intel_dg965lv_dg965lv_aad36275-501_9eeb4575f468 OK in 3.12s
  318. [670/689] notebook_mechrevo_code01_code01_ver2.0_7b499d86606f OK in 0.28s
  319. [671/689] notebook_lenovo_thinkpad_thinkpad_t440s_20ars0mv00_0d08fb1c6071 OK in 12.27s
  320. [672/689] desktop_others_others_others_c5a1dcc12a6e OK in 0.58s
  321. [673/689] desktop_intel_x_x99_0ad635180fe5 OK in 0.48s
  322. [674/689] notebook_lenovo_thinkpad_thinkpad_x1_carbon_7th_20qes3dm0c_e248cb98a9b8 OK in 6.54s
  323. [675/689] desktop_intel_hm_hm570_00089523c3bb OK in 0.59s
  324. [676/689] desktop_intel_h_h61_6827f97bcd6a OK in 0.10s
  325. [677/689] desktop_mechrevo_f7bfd_f7bfd_v1.0_e1abcae8e8e9 OK in 0.49s
  326. [678/689] desktop_gigabyte_technology_x570_x570_aorus_master_dbd6d480b744 OK in 14.55s
  327. [678/689] desktop_gigabyte_technology_b550i_b550i_aorus_pro_ax_bcc05f46c625 FAILED in 4.64s
  328. STDOUT FOR desktop_gigabyte_technology_b550i_b550i_aorus_pro_ax_bcc05f46c625:
  329.  
  330. STDERR FOR desktop_gigabyte_technology_b550i_b550i_aorus_pro_ax_bcc05f46c625:
  331. /home/d-tatianin/Projects/uACPI/source/interpreter.c:4127:48: runtime error: member access within null pointer of type 'struct code_block'
  332. AddressSanitizer:DEADLYSIGNAL
  333. =================================================================
  334. ==313635==ERROR: AddressSanitizer: SEGV on unknown address 0x000000000008 (pc 0x636f0c89db8a bp 0x7ffc8a749070 sp 0x7ffc8a749040 T0)
  335. ==313635==The signal is caused by a READ memory access.
  336. ==313635==Hint: address points to the zero page.
  337. #0 0x636f0c89db8a in handle_control_flow /home/d-tatianin/Projects/uACPI/source/interpreter.c:4127
  338. #1 0x636f0c8abb21 in exec_op /home/d-tatianin/Projects/uACPI/source/interpreter.c:5727
  339. #2 0x636f0c8afa8c in uacpi_execute_control_method /home/d-tatianin/Projects/uACPI/source/interpreter.c:6136
  340. #3 0x636f0c85e2d6 in uacpi_eval /home/d-tatianin/Projects/uACPI/source/uacpi.c:779
  341. #4 0x636f0c8d5105 in eval_sleep_helper /home/d-tatianin/Projects/uACPI/source/sleep.c:290
  342. #5 0x636f0c8d524c in eval_pts /home/d-tatianin/Projects/uACPI/source/sleep.c:309
  343. #6 0x636f0c8d5632 in uacpi_prepare_for_sleep_state /home/d-tatianin/Projects/uACPI/source/sleep.c:386
  344. #7 0x636f0c82fdc0 in enumerate_namespace /home/d-tatianin/Projects/uACPI/tests/runner/test_runner.c:212
  345. #8 0x636f0c83082e in run_test /home/d-tatianin/Projects/uACPI/tests/runner/test_runner.c:436
  346. #9 0x636f0c830feb in main /home/d-tatianin/Projects/uACPI/tests/runner/test_runner.c:569
  347. #10 0x7ded3c62a600 in __libc_start_call_main ../sysdeps/nptl/libc_start_call_main.h:59
  348. #11 0x7ded3c62a717 in __libc_start_main_impl ../csu/libc-start.c:360
  349. #12 0x636f0c82b9e4 in _start (/home/d-tatianin/Projects/uACPI/tests/runner/build-linux-64bits/test-runner+0x12a9e4) (BuildId: a922e1b1b07e47fceddb7bc4400d9309e5299a0d)
  350.  
  351. ==313635==Register values:
  352. rax = 0x0000000000000000 rbx = 0x0000000000000000 rcx = 0x00007ded3ca1d900 rdx = 0x0000000000000008
  353. rdi = 0x0000636f0c89db39 rsi = 0x00007ffc8a749030 rbp = 0x00007ffc8a749070 rsp = 0x00007ffc8a749040
  354. r8 = 0x00007ffc8a748a7b r9 = 0x000000000000008b r10 = 0x0000000000000000 r11 = 0x0000000000000206
  355. r12 = 0x000079ed3a2d5300 r13 = 0x0000000000000005 r14 = 0x00000f3da745aa60 r15 = 0x0000000000000003
  356. AddressSanitizer can not provide additional info.
  357. SUMMARY: AddressSanitizer: SEGV /home/d-tatianin/Projects/uACPI/source/interpreter.c:4127 in handle_control_flow
  358. ==313635==ABORTING
  359.  
  360. [679/689] notebook_lenovo_thinkpad_thinkpad_l14_gen_3_21c60010bo_405067a82a69 OK in 6.33s
  361. [679/689] desktop_gigabyte_technology_z790_z790_ud_ax_490231533bd9 FAILED in 2.36s
  362. STDOUT FOR desktop_gigabyte_technology_z790_z790_ud_ax_490231533bd9:
  363.  
  364. STDERR FOR desktop_gigabyte_technology_z790_z790_ud_ax_490231533bd9:
  365. /home/d-tatianin/Projects/uACPI/source/interpreter.c:4127:48: runtime error: member access within null pointer of type 'struct code_block'
  366. AddressSanitizer:DEADLYSIGNAL
  367. =================================================================
  368. ==313709==ERROR: AddressSanitizer: SEGV on unknown address 0x000000000008 (pc 0x57f351d5fb8a bp 0x7ffe2808e720 sp 0x7ffe2808e6f0 T0)
  369. ==313709==The signal is caused by a READ memory access.
  370. ==313709==Hint: address points to the zero page.
  371. #0 0x57f351d5fb8a in handle_control_flow /home/d-tatianin/Projects/uACPI/source/interpreter.c:4127
  372. #1 0x57f351d6db21 in exec_op /home/d-tatianin/Projects/uACPI/source/interpreter.c:5727
  373. #2 0x57f351d71a8c in uacpi_execute_control_method /home/d-tatianin/Projects/uACPI/source/interpreter.c:6136
  374. #3 0x57f351d202d6 in uacpi_eval /home/d-tatianin/Projects/uACPI/source/uacpi.c:779
  375. #4 0x57f351d97105 in eval_sleep_helper /home/d-tatianin/Projects/uACPI/source/sleep.c:290
  376. #5 0x57f351d9724c in eval_pts /home/d-tatianin/Projects/uACPI/source/sleep.c:309
  377. #6 0x57f351d97632 in uacpi_prepare_for_sleep_state /home/d-tatianin/Projects/uACPI/source/sleep.c:386
  378. #7 0x57f351cf1dc0 in enumerate_namespace /home/d-tatianin/Projects/uACPI/tests/runner/test_runner.c:212
  379. #8 0x57f351cf282e in run_test /home/d-tatianin/Projects/uACPI/tests/runner/test_runner.c:436
  380. #9 0x57f351cf2feb in main /home/d-tatianin/Projects/uACPI/tests/runner/test_runner.c:569
  381. #10 0x767470a2a600 in __libc_start_call_main ../sysdeps/nptl/libc_start_call_main.h:59
  382. #11 0x767470a2a717 in __libc_start_main_impl ../csu/libc-start.c:360
  383. #12 0x57f351ced9e4 in _start (/home/d-tatianin/Projects/uACPI/tests/runner/build-linux-64bits/test-runner+0x12a9e4) (BuildId: a922e1b1b07e47fceddb7bc4400d9309e5299a0d)
  384.  
  385. ==313709==Register values:
  386. rax = 0x0000000000000000 rbx = 0x0000000000000000 rcx = 0x0000767470e1d900 rdx = 0x0000000000000008
  387. rdi = 0x000057f351d5fb39 rsi = 0x00007ffe2808e6e0 rbp = 0x00007ffe2808e720 rsp = 0x00007ffe2808e6f0
  388. r8 = 0x00007ffe2808e12b r9 = 0x000000000000008b r10 = 0x0000000000000000 r11 = 0x0000000000000206
  389. r12 = 0x000072746e696680 r13 = 0x0000000000000005 r14 = 0x00000e4e8dcd2cd0 r15 = 0x0000000000000003
  390. AddressSanitizer can not provide additional info.
  391. SUMMARY: AddressSanitizer: SEGV /home/d-tatianin/Projects/uACPI/source/interpreter.c:4127 in handle_control_flow
  392. ==313709==ABORTING
  393.  
  394. [679/689] desktop_gigabyte_technology_b550_b550_aorus_elite_ax_v2_ff5cab9f5a9a FAILED in 3.48s
  395. STDOUT FOR desktop_gigabyte_technology_b550_b550_aorus_elite_ax_v2_ff5cab9f5a9a:
  396.  
  397. STDERR FOR desktop_gigabyte_technology_b550_b550_aorus_elite_ax_v2_ff5cab9f5a9a:
  398. /home/d-tatianin/Projects/uACPI/source/interpreter.c:4127:48: runtime error: member access within null pointer of type 'struct code_block'
  399. AddressSanitizer:DEADLYSIGNAL
  400. =================================================================
  401. ==313708==ERROR: AddressSanitizer: SEGV on unknown address 0x000000000008 (pc 0x5af1b9cd7b8a bp 0x7ffcbf116a40 sp 0x7ffcbf116a10 T0)
  402. ==313708==The signal is caused by a READ memory access.
  403. ==313708==Hint: address points to the zero page.
  404. #0 0x5af1b9cd7b8a in handle_control_flow /home/d-tatianin/Projects/uACPI/source/interpreter.c:4127
  405. #1 0x5af1b9ce5b21 in exec_op /home/d-tatianin/Projects/uACPI/source/interpreter.c:5727
  406. #2 0x5af1b9ce9a8c in uacpi_execute_control_method /home/d-tatianin/Projects/uACPI/source/interpreter.c:6136
  407. #3 0x5af1b9c982d6 in uacpi_eval /home/d-tatianin/Projects/uACPI/source/uacpi.c:779
  408. #4 0x5af1b9d0f105 in eval_sleep_helper /home/d-tatianin/Projects/uACPI/source/sleep.c:290
  409. #5 0x5af1b9d0f24c in eval_pts /home/d-tatianin/Projects/uACPI/source/sleep.c:309
  410. #6 0x5af1b9d0f632 in uacpi_prepare_for_sleep_state /home/d-tatianin/Projects/uACPI/source/sleep.c:386
  411. #7 0x5af1b9c69dc0 in enumerate_namespace /home/d-tatianin/Projects/uACPI/tests/runner/test_runner.c:212
  412. #8 0x5af1b9c6a82e in run_test /home/d-tatianin/Projects/uACPI/tests/runner/test_runner.c:436
  413. #9 0x5af1b9c6afeb in main /home/d-tatianin/Projects/uACPI/tests/runner/test_runner.c:569
  414. #10 0x75a277e2a600 in __libc_start_call_main ../sysdeps/nptl/libc_start_call_main.h:59
  415. #11 0x75a277e2a717 in __libc_start_main_impl ../csu/libc-start.c:360
  416. #12 0x5af1b9c659e4 in _start (/home/d-tatianin/Projects/uACPI/tests/runner/build-linux-64bits/test-runner+0x12a9e4) (BuildId: a922e1b1b07e47fceddb7bc4400d9309e5299a0d)
  417.  
  418. ==313708==Register values:
  419. rax = 0x0000000000000000 rbx = 0x0000000000000000 rcx = 0x000075a27821d900 rdx = 0x0000000000000008
  420. rdi = 0x00005af1b9cd7b39 rsi = 0x00007ffcbf116a00 rbp = 0x00007ffcbf116a40 rsp = 0x00007ffcbf116a10
  421. r8 = 0x00007ffcbf11644b r9 = 0x000000000000008b r10 = 0x0000000000000000 r11 = 0x0000000000000206
  422. r12 = 0x000071a275ab6c00 r13 = 0x0000000000000005 r14 = 0x00000e344eb56d80 r15 = 0x0000000000000003
  423. AddressSanitizer can not provide additional info.
  424. SUMMARY: AddressSanitizer: SEGV /home/d-tatianin/Projects/uACPI/source/interpreter.c:4127 in handle_control_flow
  425. ==313708==ABORTING
  426.  
  427. [680/689] desktop_gigabyte_technology_z790_z790_aorus_pro_x_e0010e25df58 OK in 2.16s
  428. [681/689] desktop_gigabyte_technology_970_970a-ds3p_ac2460abc374 OK in 0.08s
  429. [681/689] desktop_gigabyte_technology_b550_b550_aorus_pro_v2_25e5ef251d0e FAILED in 3.17s
  430. STDOUT FOR desktop_gigabyte_technology_b550_b550_aorus_pro_v2_25e5ef251d0e:
  431.  
  432. STDERR FOR desktop_gigabyte_technology_b550_b550_aorus_pro_v2_25e5ef251d0e:
  433. /home/d-tatianin/Projects/uACPI/source/interpreter.c:4127:48: runtime error: member access within null pointer of type 'struct code_block'
  434. AddressSanitizer:DEADLYSIGNAL
  435. =================================================================
  436. ==313714==ERROR: AddressSanitizer: SEGV on unknown address 0x000000000008 (pc 0x644b6db5ab8a bp 0x7ffd7aaa78e0 sp 0x7ffd7aaa78b0 T0)
  437. ==313714==The signal is caused by a READ memory access.
  438. ==313714==Hint: address points to the zero page.
  439. #0 0x644b6db5ab8a in handle_control_flow /home/d-tatianin/Projects/uACPI/source/interpreter.c:4127
  440. #1 0x644b6db68b21 in exec_op /home/d-tatianin/Projects/uACPI/source/interpreter.c:5727
  441. #2 0x644b6db6ca8c in uacpi_execute_control_method /home/d-tatianin/Projects/uACPI/source/interpreter.c:6136
  442. #3 0x644b6db1b2d6 in uacpi_eval /home/d-tatianin/Projects/uACPI/source/uacpi.c:779
  443. #4 0x644b6db92105 in eval_sleep_helper /home/d-tatianin/Projects/uACPI/source/sleep.c:290
  444. #5 0x644b6db9224c in eval_pts /home/d-tatianin/Projects/uACPI/source/sleep.c:309
  445. #6 0x644b6db92632 in uacpi_prepare_for_sleep_state /home/d-tatianin/Projects/uACPI/source/sleep.c:386
  446. #7 0x644b6daecdc0 in enumerate_namespace /home/d-tatianin/Projects/uACPI/tests/runner/test_runner.c:212
  447. #8 0x644b6daed82e in run_test /home/d-tatianin/Projects/uACPI/tests/runner/test_runner.c:436
  448. #9 0x644b6daedfeb in main /home/d-tatianin/Projects/uACPI/tests/runner/test_runner.c:569
  449. #10 0x7c2c77e2a600 in __libc_start_call_main ../sysdeps/nptl/libc_start_call_main.h:59
  450. #11 0x7c2c77e2a717 in __libc_start_main_impl ../csu/libc-start.c:360
  451. #12 0x644b6dae89e4 in _start (/home/d-tatianin/Projects/uACPI/tests/runner/build-linux-64bits/test-runner+0x12a9e4) (BuildId: a922e1b1b07e47fceddb7bc4400d9309e5299a0d)
  452.  
  453. ==313714==Register values:
  454. rax = 0x0000000000000000 rbx = 0x0000000000000000 rcx = 0x00007c2c7821d900 rdx = 0x0000000000000008
  455. rdi = 0x0000644b6db5ab39 rsi = 0x00007ffd7aaa78a0 rbp = 0x00007ffd7aaa78e0 rsp = 0x00007ffd7aaa78b0
  456. r8 = 0x00007ffd7aaa72eb r9 = 0x000000000000008b r10 = 0x0000000000000000 r11 = 0x0000000000000206
  457. r12 = 0x0000782c75a65a80 r13 = 0x0000000000000005 r14 = 0x00000f058eb4cb50 r15 = 0x0000000000000003
  458. AddressSanitizer can not provide additional info.
  459. SUMMARY: AddressSanitizer: SEGV /home/d-tatianin/Projects/uACPI/source/interpreter.c:4127 in handle_control_flow
  460. ==313714==ABORTING
  461.  
  462. [681/689] desktop_gigabyte_technology_b550_b550_vision_d_b4d3fa24f862 FAILED in 3.11s
  463. STDOUT FOR desktop_gigabyte_technology_b550_b550_vision_d_b4d3fa24f862:
  464.  
  465. STDERR FOR desktop_gigabyte_technology_b550_b550_vision_d_b4d3fa24f862:
  466. /home/d-tatianin/Projects/uACPI/source/interpreter.c:4127:48: runtime error: member access within null pointer of type 'struct code_block'
  467. AddressSanitizer:DEADLYSIGNAL
  468. =================================================================
  469. ==313722==ERROR: AddressSanitizer: SEGV on unknown address 0x000000000008 (pc 0x5ec6f2518b8a bp 0x7ffcdaae2e90 sp 0x7ffcdaae2e60 T0)
  470. ==313722==The signal is caused by a READ memory access.
  471. ==313722==Hint: address points to the zero page.
  472. #0 0x5ec6f2518b8a in handle_control_flow /home/d-tatianin/Projects/uACPI/source/interpreter.c:4127
  473. #1 0x5ec6f2526b21 in exec_op /home/d-tatianin/Projects/uACPI/source/interpreter.c:5727
  474. #2 0x5ec6f252aa8c in uacpi_execute_control_method /home/d-tatianin/Projects/uACPI/source/interpreter.c:6136
  475. #3 0x5ec6f24d92d6 in uacpi_eval /home/d-tatianin/Projects/uACPI/source/uacpi.c:779
  476. #4 0x5ec6f2550105 in eval_sleep_helper /home/d-tatianin/Projects/uACPI/source/sleep.c:290
  477. #5 0x5ec6f255024c in eval_pts /home/d-tatianin/Projects/uACPI/source/sleep.c:309
  478. #6 0x5ec6f2550632 in uacpi_prepare_for_sleep_state /home/d-tatianin/Projects/uACPI/source/sleep.c:386
  479. #7 0x5ec6f24aadc0 in enumerate_namespace /home/d-tatianin/Projects/uACPI/tests/runner/test_runner.c:212
  480. #8 0x5ec6f24ab82e in run_test /home/d-tatianin/Projects/uACPI/tests/runner/test_runner.c:436
  481. #9 0x5ec6f24abfeb in main /home/d-tatianin/Projects/uACPI/tests/runner/test_runner.c:569
  482. #10 0x7e6328e2a600 in __libc_start_call_main ../sysdeps/nptl/libc_start_call_main.h:59
  483. #11 0x7e6328e2a717 in __libc_start_main_impl ../csu/libc-start.c:360
  484. #12 0x5ec6f24a69e4 in _start (/home/d-tatianin/Projects/uACPI/tests/runner/build-linux-64bits/test-runner+0x12a9e4) (BuildId: a922e1b1b07e47fceddb7bc4400d9309e5299a0d)
  485.  
  486. ==313722==Register values:
  487. rax = 0x0000000000000000 rbx = 0x0000000000000000 rcx = 0x00007e632921d900 rdx = 0x0000000000000008
  488. rdi = 0x00005ec6f2518b39 rsi = 0x00007ffcdaae2e50 rbp = 0x00007ffcdaae2e90 rsp = 0x00007ffcdaae2e60
  489. r8 = 0x00007ffcdaae289b r9 = 0x000000000000008b r10 = 0x0000000000000000 r11 = 0x0000000000000206
  490. r12 = 0x00007a6326abb280 r13 = 0x0000000000000005 r14 = 0x00000f4c64d57650 r15 = 0x0000000000000003
  491. AddressSanitizer can not provide additional info.
  492. SUMMARY: AddressSanitizer: SEGV /home/d-tatianin/Projects/uACPI/source/interpreter.c:4127 in handle_control_flow
  493. ==313722==ABORTING
  494.  
  495. SUMMARY: 681/689 in 94.04s (8 FAILED)
  496. ================================================================================
  497.  
Advertisement
Add Comment
Please, Sign In to add comment