daily pastebin goal
83%
SHARE
TWEET

Untitled

a guest Feb 1st, 2016 162 Never
Not a member of Pastebin yet? Sign Up, it unlocks many cool features!
  1. ----------------------------------------
  2. ----Command: "ionic run android"--------
  3. ----------------------------------------
  4. C:\app-projects\my-notes>ionic run android
  5. Running command: "C:\Program Files\nodejs\node.exe" C:\app-projects\my-notes\hooks\after_prepare\010_add_platform_class.
  6. js C:\app-projects\my-notes
  7. add to body class: platform-android
  8. Running command: cmd "/s /c "C:\app-projects\my-notes\platforms\android\cordova\run.bat""
  9. ANDROID_HOME=C:\Users\EscolhaFacil\AppData\Local\Android\android-sdk
  10. JAVA_HOME=C:\Program Files\Java\jdk1.8.0_71
  11.  
  12. C:\app-projects\my-notes\platforms\android\cordova\node_modules\q\q.js:126
  13.                     throw e;
  14.                     ^
  15. Error executing "adb devices": error: could not install *smartsocket* listener: cannot bind to 127.0.0.1:5037: Normalmen
  16. te é permitida apenas uma utilização de cada endereço de soquete (protocolo/endereço de rede/porta). (10048)
  17. could not read ok from ADB Server
  18. * failed to start daemon *
  19. error: cannot connect to daemon
  20.  
  21. ERROR running one or more of the platforms: Error: cmd: Command failed with exit code 1
  22. You may not have the required environment or OS to run this project
  23.  
  24. C:\app-projects\my-notes>
  25.  
  26. ----------------------------------------
  27. ----Command: "ionic emulate android"--------
  28. ----------------------------------------
  29. C:\app-projects\my-notes>ionic emulate android
  30. Running command: "C:\Program Files\nodejs\node.exe" C:\app-projects\my-notes\hooks\after_prepare\010_add_platform_class.
  31. js C:\app-projects\my-notes
  32. add to body class: platform-android
  33. Running command: cmd "/s /c "C:\app-projects\my-notes\platforms\android\cordova\run.bat --emulator""
  34. ANDROID_HOME=C:\Users\EscolhaFacil\AppData\Local\Android\android-sdk
  35. JAVA_HOME=C:\Program Files\Java\jdk1.8.0_71
  36.  
  37. C:\app-projects\my-notes\platforms\android\cordova\node_modules\q\q.js:126
  38.                     throw e;
  39.                     ^
  40. Error executing "adb devices": error: could not install *smartsocket* listener: cannot bind to 127.0.0.1:5037: Normalmen
  41. te é permitida apenas uma utilização de cada endereço de soquete (protocolo/endereço de rede/porta). (10048)
  42. could not read ok from ADB Server
  43. * failed to start daemon *
  44. error: cannot connect to daemon
  45.  
  46. Error: cmd: Command failed with exit code 1
  47.  
  48. C:\app-projects\my-notes>
  49.  
  50. ----------------------------------------
  51. ----Command: "ionic build android"--------
  52. ----------------------------------------
  53.  
  54. C:\app-projects\my-notes>ionic build android
  55. Running command: "C:\Program Files\nodejs\node.exe" C:\app-projects\my-notes\hooks\after_prepare\010_add_platform_class.
  56. js C:\app-projects\my-notes
  57. add to body class: platform-android
  58. Running command: cmd "/s /c "C:\app-projects\my-notes\platforms\android\cordova\build.bat""
  59. ANDROID_HOME=C:\Users\EscolhaFacil\AppData\Local\Android\android-sdk
  60. JAVA_HOME=C:\Program Files\Java\jdk1.8.0_71
  61. Running: C:\app-projects\my-notes\platforms\android\gradlew cdvBuildDebug -b C:\app-projects\my-notes\platforms\android\
  62. build.gradle -Dorg.gradle.daemon=true
  63.  
  64. FAILURE: Build failed with an exception.
  65.  
  66. * What went wrong:
  67. java.io.IOException: Unable to establish loopback connection
  68.  
  69. * Try:
  70. Run with --stacktrace option to get the stack trace. Run with --info or --debug option to get more log output.
  71.  
  72. C:\app-projects\my-notes\platforms\android\cordova\node_modules\q\q.js:126
  73.                     throw e;
  74.                     ^
  75. Error code 1 for command: cmd with args: /s /c "C:\app-projects\my-notes\platforms\android\gradlew cdvBuildDebug -b C:\a
  76. pp-projects\my-notes\platforms\android\build.gradle -Dorg.gradle.daemon=true"
  77. ERROR building one of the platforms: Error: cmd: Command failed with exit code 1
  78. You may not have the required environment or OS to build this project
  79. Error: cmd: Command failed with exit code 1
  80.  
  81. C:\app-projects\my-notes>
RAW Paste Data
We use cookies for various purposes including analytics. By continuing to use Pastebin, you agree to our use of cookies as described in the Cookies Policy. OK, I Understand
 
Top