daily pastebin goal
58%
SHARE
TWEET

Untitled

a guest Aug 17th, 2015 36 Never
Not a member of Pastebin yet? Sign Up, it unlocks many cool features!
  1. Creating qmake...
  2. make: Nothing to be done for `first'.
  3. Running configuration tests...
  4. Found pkg-config from $PATH: /usr/bin/pkg-config
  5. Warning: Disabling pkg-config since PKG_CONFIG_LIBDIR is not set.
  6. Warning: Disabling pkg-config since PKG_CONFIG_SYSROOT_DIR is not set.
  7. Determining architecture... ()
  8. /home/bob/Downloads/gcc-linaro-arm-linux-gnueabi/bin/arm-linux-gnueabi-g++ -c -pipe -march=armv7-a -mfpu=neon -DLINUX=1 -DEGL_API_FB=1 -mfloat-abi=hard -mfloat-abi=hard -g -Wall -W -fPIC  -I. -I../../mkspecs/devices/linux-imx6-g++ -o arch.o arch.cpp
  9. /home/bob/Downloads/gcc-linaro-arm-linux-gnueabi/bin/arm-linux-gnueabi-g++ -mfloat-abi=hard -o arch arch.o    
  10. /home/bob/Downloads/gcc-linaro-arm-linux-gnueabi/bin/../lib/gcc/arm-linux-gnueabi/4.7.1/../../../../arm-linux-gnueabi/bin/ld: error: arch.o uses VFP register arguments, arch does not
  11. /home/bob/Downloads/gcc-linaro-arm-linux-gnueabi/bin/../lib/gcc/arm-linux-gnueabi/4.7.1/../../../../arm-linux-gnueabi/bin/ld: failed to merge target specific data of file arch.o
  12. collect2: error: ld returned 1 exit status
  13. make: *** [arch] Error 1
  14. Unable to determine architecture!
  15.  
  16. Could not determine the target architecture!
  17. Turn on verbose messaging (-v) to see the final report.
  18. Determining architecture... ()
  19. g++ -c -pipe -g -Wall -W -fPIC  -I. -I../../mkspecs/linux-g++ -o arch.o arch.cpp
  20. g++  -o arch arch.o    
  21.    Found architecture in binary
  22. CFG_HOST_ARCH="x86_64"
  23. CFG_HOST_CPUFEATURES=" mmx sse sse2"
  24. System architecture: 'unknown'
  25. Host architecture: 'x86_64'
  26. C++11 auto-detection... ()
  27. /home/bob/Downloads/gcc-linaro-arm-linux-gnueabi/bin/arm-linux-gnueabi-g++ -c -pipe -march=armv7-a -mfpu=neon -DLINUX=1 -DEGL_API_FB=1 -mfloat-abi=hard -mfloat-abi=hard -O2 -std=c++0x -Wall -W -fPIC  -I. -I../../../mkspecs/devices/linux-imx6-g++ -o c++11.o c++11.cpp
  28. /home/bob/Downloads/gcc-linaro-arm-linux-gnueabi/bin/arm-linux-gnueabi-g++ -mfloat-abi=hard -Wl,-O1 -o c++11 c++11.o    
  29. /home/bob/Downloads/gcc-linaro-arm-linux-gnueabi/bin/../lib/gcc/arm-linux-gnueabi/4.7.1/../../../../arm-linux-gnueabi/bin/ld: error: c++11.o uses VFP register arguments, c++11 does not
  30. /home/bob/Downloads/gcc-linaro-arm-linux-gnueabi/bin/../lib/gcc/arm-linux-gnueabi/4.7.1/../../../../arm-linux-gnueabi/bin/ld: failed to merge target specific data of file c++11.o
  31. collect2: error: ld returned 1 exit status
  32. make: *** [c++11] Error 1
  33. C++11 disabled.
  34. sse2 auto-detection... ()
  35. /home/bob/Downloads/gcc-linaro-arm-linux-gnueabi/bin/arm-linux-gnueabi-g++ -c -pipe -march=armv7-a -mfpu=neon -DLINUX=1 -DEGL_API_FB=1 -mfloat-abi=hard -mfloat-abi=hard -msse2 -g -Wall -W -fPIC  -I. -I../../../mkspecs/devices/linux-imx6-g++ -o sse2.o sse2.cpp
  36. arm-linux-gnueabi-g++: error: unrecognized command line option ‘-msse2’
  37. make: *** [sse2.o] Error 1
  38. sse2 disabled.
  39. ipc_sysv auto-detection... ()
  40. /home/bob/Downloads/gcc-linaro-arm-linux-gnueabi/bin/arm-linux-gnueabi-g++ -c -pipe -march=armv7-a -mfpu=neon -DLINUX=1 -DEGL_API_FB=1 -mfloat-abi=hard -mfloat-abi=hard -O2 -Wall -W -fPIC  -I. -I../../../mkspecs/devices/linux-imx6-g++ -o ipc.o ipc.cpp
  41. /home/bob/Downloads/gcc-linaro-arm-linux-gnueabi/bin/arm-linux-gnueabi-g++ -mfloat-abi=hard -Wl,-O1 -o ipc_sysv ipc.o    
  42. /home/bob/Downloads/gcc-linaro-arm-linux-gnueabi/bin/../lib/gcc/arm-linux-gnueabi/4.7.1/../../../../arm-linux-gnueabi/bin/ld: error: ipc.o uses VFP register arguments, ipc_sysv does not
  43. /home/bob/Downloads/gcc-linaro-arm-linux-gnueabi/bin/../lib/gcc/arm-linux-gnueabi/4.7.1/../../../../arm-linux-gnueabi/bin/ld: failed to merge target specific data of file ipc.o
  44. collect2: error: ld returned 1 exit status
  45. make: *** [ipc_sysv] Error 1
  46. ipc_sysv disabled.
  47. ipc_posix auto-detection... ()
  48. /home/bob/Downloads/gcc-linaro-arm-linux-gnueabi/bin/arm-linux-gnueabi-g++ -c -pipe -march=armv7-a -mfpu=neon -DLINUX=1 -DEGL_API_FB=1 -mfloat-abi=hard -mfloat-abi=hard -O2 -Wall -W -fPIC  -I. -I../../../mkspecs/devices/linux-imx6-g++ -o ipc.o ipc.cpp
  49. /home/bob/Downloads/gcc-linaro-arm-linux-gnueabi/bin/arm-linux-gnueabi-g++ -mfloat-abi=hard -Wl,-O1 -o ipc_posix ipc.o   -lpthread -lrt
  50. /home/bob/Downloads/gcc-linaro-arm-linux-gnueabi/bin/../lib/gcc/arm-linux-gnueabi/4.7.1/../../../../arm-linux-gnueabi/bin/ld: error: ipc.o uses VFP register arguments, ipc_posix does not
  51. /home/bob/Downloads/gcc-linaro-arm-linux-gnueabi/bin/../lib/gcc/arm-linux-gnueabi/4.7.1/../../../../arm-linux-gnueabi/bin/ld: failed to merge target specific data of file ipc.o
  52. collect2: error: ld returned 1 exit status
  53. make: *** [ipc_posix] Error 1
  54. ipc_posix disabled.
  55. zlib auto-detection... ()
  56. /home/bob/Downloads/gcc-linaro-arm-linux-gnueabi/bin/arm-linux-gnueabi-g++ -c -pipe -march=armv7-a -mfpu=neon -DLINUX=1 -DEGL_API_FB=1 -mfloat-abi=hard -mfloat-abi=hard -O2 -Wall -W -fPIC  -I. -I../../../mkspecs/devices/linux-imx6-g++ -o zlib.o zlib.cpp
  57. zlib.cpp:34:18: fatal error: zlib.h: No such file or directory
  58. compilation terminated.
  59. make: *** [zlib.o] Error 1
  60. zlib disabled.
  61. mtdev auto-detection... ()
  62. Project ERROR: mtdev development package not found
  63. mtdev disabled.
  64. libjpeg auto-detection... ()
  65. /home/bob/Downloads/gcc-linaro-arm-linux-gnueabi/bin/arm-linux-gnueabi-g++ -c -pipe -march=armv7-a -mfpu=neon -DLINUX=1 -DEGL_API_FB=1 -mfloat-abi=hard -mfloat-abi=hard -O2 -Wall -W -fPIC  -I. -I../../../mkspecs/devices/linux-imx6-g++ -o libjpeg.o libjpeg.cpp
  66. libjpeg.cpp:37:21: fatal error: jpeglib.h: No such file or directory
  67. compilation terminated.
  68. make: *** [libjpeg.o] Error 1
  69. libjpeg disabled.
  70. libpng auto-detection... ()
  71. /home/bob/Downloads/gcc-linaro-arm-linux-gnueabi/bin/arm-linux-gnueabi-g++ -c -pipe -march=armv7-a -mfpu=neon -DLINUX=1 -DEGL_API_FB=1 -mfloat-abi=hard -mfloat-abi=hard -O2 -Wall -W -fPIC  -I. -I../../../mkspecs/devices/linux-imx6-g++ -o libpng.o libpng.cpp
  72. libpng.cpp:34:17: fatal error: png.h: No such file or directory
  73. compilation terminated.
  74. make: *** [libpng.o] Error 1
  75. libpng disabled.
  76. DB2 auto-detection... ()
  77. /home/bob/Downloads/gcc-linaro-arm-linux-gnueabi/bin/arm-linux-gnueabi-g++ -c -pipe -march=armv7-a -mfpu=neon -DLINUX=1 -DEGL_API_FB=1 -mfloat-abi=hard -mfloat-abi=hard -O2 -Wall -W -fPIC  -I. -I../../../mkspecs/devices/linux-imx6-g++ -o db2.o db2.cpp
  78. db2.cpp:34:20: fatal error: sqlcli.h: No such file or directory
  79. compilation terminated.
  80. make: *** [db2.o] Error 1
  81. DB2 disabled.
  82. InterBase auto-detection... ()
  83. /home/bob/Downloads/gcc-linaro-arm-linux-gnueabi/bin/arm-linux-gnueabi-g++ -c -pipe -march=armv7-a -mfpu=neon -DLINUX=1 -DEGL_API_FB=1 -mfloat-abi=hard -mfloat-abi=hard -O2 -Wall -W -fPIC  -I. -I../../../mkspecs/devices/linux-imx6-g++ -o ibase.o ibase.cpp
  84. ibase.cpp:34:19: fatal error: ibase.h: No such file or directory
  85. compilation terminated.
  86. make: *** [ibase.o] Error 1
  87. InterBase disabled.
  88. MySQL (thread-safe) auto-detection... ()
  89. /home/bob/Downloads/gcc-linaro-arm-linux-gnueabi/bin/arm-linux-gnueabi-g++ -c -pipe -march=armv7-a -mfpu=neon -DLINUX=1 -DEGL_API_FB=1 -mfloat-abi=hard -mfloat-abi=hard -O2 -Wall -W -fPIC  -I. -I../../../mkspecs/devices/linux-imx6-g++ -o mysql.o ../mysql/mysql.cpp
  90. ../mysql/mysql.cpp:34:19: fatal error: mysql.h: No such file or directory
  91. compilation terminated.
  92. make: *** [mysql.o] Error 1
  93. MySQL (thread-safe) disabled.
  94. MySQL (thread-unsafe) auto-detection... ()
  95. /home/bob/Downloads/gcc-linaro-arm-linux-gnueabi/bin/arm-linux-gnueabi-g++ -c -pipe -march=armv7-a -mfpu=neon -DLINUX=1 -DEGL_API_FB=1 -mfloat-abi=hard -mfloat-abi=hard -O2 -Wall -W -fPIC  -I. -I../../../mkspecs/devices/linux-imx6-g++ -o mysql.o mysql.cpp
  96. mysql.cpp:34:19: fatal error: mysql.h: No such file or directory
  97. compilation terminated.
  98. make: *** [mysql.o] Error 1
  99. MySQL (thread-unsafe) disabled.
  100. OCI auto-detection... ()
  101. /home/bob/Downloads/gcc-linaro-arm-linux-gnueabi/bin/arm-linux-gnueabi-g++ -c -pipe -march=armv7-a -mfpu=neon -DLINUX=1 -DEGL_API_FB=1 -mfloat-abi=hard -mfloat-abi=hard -O2 -Wall -W -fPIC  -I. -I../../../mkspecs/devices/linux-imx6-g++ -o oci.o oci.cpp
  102. oci.cpp:34:17: fatal error: oci.h: No such file or directory
  103. compilation terminated.
  104. make: *** [oci.o] Error 1
  105. OCI disabled.
  106. ODBC auto-detection... ()
  107. /home/bob/Downloads/gcc-linaro-arm-linux-gnueabi/bin/arm-linux-gnueabi-g++ -c -pipe -march=armv7-a -mfpu=neon -DLINUX=1 -DEGL_API_FB=1 -mfloat-abi=hard -mfloat-abi=hard -O2 -Wall -W -fPIC  -I. -I../../../mkspecs/devices/linux-imx6-g++ -o odbc.o odbc.cpp
  108. odbc.cpp:37:17: fatal error: sql.h: No such file or directory
  109. compilation terminated.
  110. make: *** [odbc.o] Error 1
  111. ODBC disabled.
  112. iODBC auto-detection... ()
  113. /home/bob/Downloads/gcc-linaro-arm-linux-gnueabi/bin/arm-linux-gnueabi-g++ -c -pipe -march=armv7-a -mfpu=neon -DLINUX=1 -DEGL_API_FB=1 -mfloat-abi=hard -mfloat-abi=hard -O2 -Wall -W -fPIC  -I. -I../../../mkspecs/devices/linux-imx6-g++ -o iodbc.o iodbc.cpp
  114. iodbc.cpp:34:17: fatal error: sql.h: No such file or directory
  115. compilation terminated.
  116. make: *** [iodbc.o] Error 1
  117. iODBC disabled.
  118. PostgreSQL auto-detection... ()
  119. /home/bob/Downloads/gcc-linaro-arm-linux-gnueabi/bin/arm-linux-gnueabi-g++ -c -pipe -march=armv7-a -mfpu=neon -DLINUX=1 -DEGL_API_FB=1 -mfloat-abi=hard -mfloat-abi=hard -O2 -Wall -W -fPIC  -I. -I../../../mkspecs/devices/linux-imx6-g++ -o psql.o psql.cpp
  120. psql.cpp:34:22: fatal error: libpq-fe.h: No such file or directory
  121. compilation terminated.
  122. make: *** [psql.o] Error 1
  123. PostgreSQL disabled.
  124. SQLite2 auto-detection... ()
  125. /home/bob/Downloads/gcc-linaro-arm-linux-gnueabi/bin/arm-linux-gnueabi-g++ -c -pipe -march=armv7-a -mfpu=neon -DLINUX=1 -DEGL_API_FB=1 -mfloat-abi=hard -mfloat-abi=hard -O2 -Wall -W -fPIC  -I. -I../../../mkspecs/devices/linux-imx6-g++ -o sqlite2.o sqlite2.cpp
  126. sqlite2.cpp:34:20: fatal error: sqlite.h: No such file or directory
  127. compilation terminated.
  128. make: *** [sqlite2.o] Error 1
  129. SQLite2 disabled.
  130. TDS auto-detection... ()
  131. /home/bob/Downloads/gcc-linaro-arm-linux-gnueabi/bin/arm-linux-gnueabi-g++ -c -pipe -march=armv7-a -mfpu=neon -DLINUX=1 -DEGL_API_FB=1 -mfloat-abi=hard -mfloat-abi=hard -O2 -Wall -W -fPIC  -I. -I../../../mkspecs/devices/linux-imx6-g++ -o tds.o tds.cpp
  132. tds.cpp:34:22: fatal error: sybfront.h: No such file or directory
  133. compilation terminated.
  134. make: *** [tds.o] Error 1
  135. TDS disabled.
  136. NIS auto-detection... ()
  137. /home/bob/Downloads/gcc-linaro-arm-linux-gnueabi/bin/arm-linux-gnueabi-g++ -c -pipe -march=armv7-a -mfpu=neon -DLINUX=1 -DEGL_API_FB=1 -mfloat-abi=hard -mfloat-abi=hard -O2 -Wall -W -fPIC  -I. -I../../../mkspecs/devices/linux-imx6-g++ -o nis.o nis.cpp
  138. /home/bob/Downloads/gcc-linaro-arm-linux-gnueabi/bin/arm-linux-gnueabi-g++ -mfloat-abi=hard -Wl,-O1 -o nis nis.o   -lnsl
  139. /home/bob/Downloads/gcc-linaro-arm-linux-gnueabi/bin/../lib/gcc/arm-linux-gnueabi/4.7.1/../../../../arm-linux-gnueabi/bin/ld: error: nis.o uses VFP register arguments, nis does not
  140. /home/bob/Downloads/gcc-linaro-arm-linux-gnueabi/bin/../lib/gcc/arm-linux-gnueabi/4.7.1/../../../../arm-linux-gnueabi/bin/ld: failed to merge target specific data of file nis.o
  141. collect2: error: ld returned 1 exit status
  142. make: *** [nis] Error 1
  143. NIS disabled.
  144. Cups auto-detection... ()
  145. /home/bob/Downloads/gcc-linaro-arm-linux-gnueabi/bin/arm-linux-gnueabi-g++ -c -pipe -march=armv7-a -mfpu=neon -DLINUX=1 -DEGL_API_FB=1 -mfloat-abi=hard -mfloat-abi=hard -O2 -Wall -W -fPIC  -I. -I../../../mkspecs/devices/linux-imx6-g++ -o cups.o cups.cpp
  146. cups.cpp:34:23: fatal error: cups/cups.h: No such file or directory
  147. compilation terminated.
  148. make: *** [cups.o] Error 1
  149. Cups disabled.
  150. POSIX iconv auto-detection... ()
  151. /home/bob/Downloads/gcc-linaro-arm-linux-gnueabi/bin/arm-linux-gnueabi-g++ -c -pipe -march=armv7-a -mfpu=neon -DLINUX=1 -DEGL_API_FB=1 -mfloat-abi=hard -mfloat-abi=hard -O2 -Wall -W -fPIC  -I. -I../../../mkspecs/devices/linux-imx6-g++ -o iconv.o iconv.cpp
  152. /home/bob/Downloads/gcc-linaro-arm-linux-gnueabi/bin/arm-linux-gnueabi-g++ -mfloat-abi=hard -Wl,-O1 -o iconv iconv.o    
  153. /home/bob/Downloads/gcc-linaro-arm-linux-gnueabi/bin/../lib/gcc/arm-linux-gnueabi/4.7.1/../../../../arm-linux-gnueabi/bin/ld: error: iconv.o uses VFP register arguments, iconv does not
  154. /home/bob/Downloads/gcc-linaro-arm-linux-gnueabi/bin/../lib/gcc/arm-linux-gnueabi/4.7.1/../../../../arm-linux-gnueabi/bin/ld: failed to merge target specific data of file iconv.o
  155. collect2: error: ld returned 1 exit status
  156. make: *** [iconv] Error 1
  157. POSIX iconv disabled.
  158. SUN libiconv auto-detection... ()
  159. /home/bob/Downloads/gcc-linaro-arm-linux-gnueabi/bin/arm-linux-gnueabi-g++ -c -pipe -march=armv7-a -mfpu=neon -DLINUX=1 -DEGL_API_FB=1 -mfloat-abi=hard -mfloat-abi=hard -O2 -Wall -W -fPIC  -I. -I../../../mkspecs/devices/linux-imx6-g++ -o gnu-libiconv.o ../gnu-libiconv/gnu-libiconv.cpp
  160. ../gnu-libiconv/gnu-libiconv.cpp: In function ‘int main(int, char**)’:
  161. ../gnu-libiconv/gnu-libiconv.cpp:46:46: error: invalid conversion from ‘const char**’ to ‘char**’ [-fpermissive]
  162. In file included from ../gnu-libiconv/gnu-libiconv.cpp:37:0:
  163. /home/bob/Downloads/gcc-linaro-arm-linux-gnueabi/bin/../arm-linux-gnueabi/libc/usr/include/iconv.h:43:15: error:   initializing argument 2 of ‘size_t iconv(iconv_t, char**, size_t*, char**, size_t*)’ [-fpermissive]
  164. make: *** [gnu-libiconv.o] Error 1
  165. SUN libiconv disabled.
  166. GNU libiconv auto-detection... ()
  167. /home/bob/Downloads/gcc-linaro-arm-linux-gnueabi/bin/arm-linux-gnueabi-g++ -c -pipe -march=armv7-a -mfpu=neon -DLINUX=1 -DEGL_API_FB=1 -mfloat-abi=hard -mfloat-abi=hard -O2 -Wall -W -fPIC  -I. -I../../../mkspecs/devices/linux-imx6-g++ -o gnu-libiconv.o gnu-libiconv.cpp
  168. gnu-libiconv.cpp: In function ‘int main(int, char**)’:
  169. gnu-libiconv.cpp:46:46: error: invalid conversion from ‘const char**’ to ‘char**’ [-fpermissive]
  170. In file included from gnu-libiconv.cpp:37:0:
  171. /home/bob/Downloads/gcc-linaro-arm-linux-gnueabi/bin/../arm-linux-gnueabi/libc/usr/include/iconv.h:43:15: error:   initializing argument 2 of ‘size_t iconv(iconv_t, char**, size_t*, char**, size_t*)’ [-fpermissive]
  172. make: *** [gnu-libiconv.o] Error 1
  173. GNU libiconv disabled.
  174. libproxy auto-detection... ()
  175. /home/bob/Downloads/gcc-linaro-arm-linux-gnueabi/bin/arm-linux-gnueabi-g++ -c -pipe -march=armv7-a -mfpu=neon -DLINUX=1 -DEGL_API_FB=1 -mfloat-abi=hard -mfloat-abi=hard -O2 -Wall -W -fPIC  -I. -I../../../mkspecs/devices/linux-imx6-g++ -o libproxy.o libproxy.cpp
  176. libproxy.cpp:36:19: fatal error: proxy.h: No such file or directory
  177. compilation terminated.
  178. make: *** [libproxy.o] Error 1
  179. libproxy disabled.
  180. Glib auto-detection... ()
  181. /home/bob/Downloads/gcc-linaro-arm-linux-gnueabi/bin/arm-linux-gnueabi-g++ -c -pipe -march=armv7-a -mfpu=neon -DLINUX=1 -DEGL_API_FB=1 -mfloat-abi=hard -mfloat-abi=hard -O2 -Wall -W -fPIC  -I. -I../../../mkspecs/devices/linux-imx6-g++ -o glib.o glib.cpp
  182. glib.cpp:36:18: fatal error: glib.h: No such file or directory
  183. compilation terminated.
  184. make: *** [glib.o] Error 1
  185. Glib disabled.
  186. ICU auto-detection... ()
  187. /home/bob/Downloads/gcc-linaro-arm-linux-gnueabi/bin/arm-linux-gnueabi-g++ -c -pipe -march=armv7-a -mfpu=neon -DLINUX=1 -DEGL_API_FB=1 -mfloat-abi=hard -mfloat-abi=hard -O2 -Wall -W -fPIC  -I. -I../../../mkspecs/devices/linux-imx6-g++ -o icu.o icu.cpp
  188. icu.cpp:34:28: fatal error: unicode/utypes.h: No such file or directory
  189. compilation terminated.
  190. make: *** [icu.o] Error 1
  191. ICU disabled.
  192. PulseAudio auto-detection... ()
  193. /home/bob/Downloads/gcc-linaro-arm-linux-gnueabi/bin/arm-linux-gnueabi-g++ -c -pipe -march=armv7-a -mfpu=neon -DLINUX=1 -DEGL_API_FB=1 -mfloat-abi=hard -mfloat-abi=hard -O2 -Wall -W -fPIC  -I. -I../../../mkspecs/devices/linux-imx6-g++ -o pulseaudio.o pulseaudio.cpp
  194. pulseaudio.cpp:34:30: fatal error: pulse/pulseaudio.h: No such file or directory
  195. compilation terminated.
  196. make: *** [pulseaudio.o] Error 1
  197. PulseAudio disabled.
  198. OpenGL auto-detection... ()
  199. /home/bob/Downloads/gcc-linaro-arm-linux-gnueabi/bin/arm-linux-gnueabi-g++ -c -pipe -march=armv7-a -mfpu=neon -DLINUX=1 -DEGL_API_FB=1 -mfloat-abi=hard -mfloat-abi=hard -O2 -Wall -W -fPIC  -I. -I../../../mkspecs/devices/linux-imx6-g++ -o opengldesktop.o opengldesktop.cpp
  200. opengldesktop.cpp:37:19: fatal error: GL/gl.h: No such file or directory
  201. compilation terminated.
  202. make: *** [opengldesktop.o] Error 1
  203. OpenGL disabled.
  204. OpenGL auto-detection... ()
  205. /home/bob/Downloads/gcc-linaro-arm-linux-gnueabi/bin/arm-linux-gnueabi-g++ -c -pipe -march=armv7-a -mfpu=neon -DLINUX=1 -DEGL_API_FB=1 -mfloat-abi=hard -mfloat-abi=hard -O2 -Wall -W -fPIC  -I. -I../../../mkspecs/devices/linux-imx6-g++ -o opengles2.o opengles2.cpp
  206. opengles2.cpp:37:25: fatal error: GLES2/gl2.h: No such file or directory
  207. compilation terminated.
  208. make: *** [opengles2.o] Error 1
  209. OpenGL disabled.
  210. FontConfig auto-detection... ()
  211. /home/bob/Downloads/gcc-linaro-arm-linux-gnueabi/bin/arm-linux-gnueabi-g++ -c -pipe -march=armv7-a -mfpu=neon -DLINUX=1 -DEGL_API_FB=1 -mfloat-abi=hard -mfloat-abi=hard -O2 -Wall -W -fPIC  -I. -I../../../mkspecs/devices/linux-imx6-g++ -o fontconfig.o fontconfig.cpp
  212. fontconfig.cpp:34:22: fatal error: ft2build.h: No such file or directory
  213. compilation terminated.
  214. make: *** [fontconfig.o] Error 1
  215. FontConfig disabled.
  216. libudev auto-detection... ()
  217. /home/bob/Downloads/gcc-linaro-arm-linux-gnueabi/bin/arm-linux-gnueabi-g++ -c -pipe -march=armv7-a -mfpu=neon -DLINUX=1 -DEGL_API_FB=1 -mfloat-abi=hard -mfloat-abi=hard -O2 -Wall -W -fPIC  -I. -I../../../mkspecs/devices/linux-imx6-g++ -o libudev.o libudev.cpp
  218. libudev.cpp:34:21: fatal error: libudev.h: No such file or directory
  219. compilation terminated.
  220. make: *** [libudev.o] Error 1
  221. libudev disabled.
  222. evdev auto-detection... ()
  223. /home/bob/Downloads/gcc-linaro-arm-linux-gnueabi/bin/arm-linux-gnueabi-g++ -c -pipe -march=armv7-a -mfpu=neon -DLINUX=1 -DEGL_API_FB=1 -mfloat-abi=hard -mfloat-abi=hard -O2 -Wall -W -fPIC  -I. -I../../../mkspecs/devices/linux-imx6-g++ -o evdev.o evdev.cpp
  224. /home/bob/Downloads/gcc-linaro-arm-linux-gnueabi/bin/arm-linux-gnueabi-g++ -mfloat-abi=hard -Wl,-O1 -o evdev evdev.o    
  225. /home/bob/Downloads/gcc-linaro-arm-linux-gnueabi/bin/../lib/gcc/arm-linux-gnueabi/4.7.1/../../../../arm-linux-gnueabi/bin/ld: error: evdev.o uses VFP register arguments, evdev does not
  226. /home/bob/Downloads/gcc-linaro-arm-linux-gnueabi/bin/../lib/gcc/arm-linux-gnueabi/4.7.1/../../../../arm-linux-gnueabi/bin/ld: failed to merge target specific data of file evdev.o
  227. collect2: error: ld returned 1 exit status
  228. make: *** [evdev] Error 1
  229. evdev disabled.
  230. tslib auto-detection... ()
  231. /home/bob/Downloads/gcc-linaro-arm-linux-gnueabi/bin/arm-linux-gnueabi-g++ -c -pipe -march=armv7-a -mfpu=neon -DLINUX=1 -DEGL_API_FB=1 -mfloat-abi=hard -mfloat-abi=hard -O2 -Wall -W -fPIC  -I. -I../../../mkspecs/devices/linux-imx6-g++ -o tslib.o tslib.cpp
  232. tslib.cpp:34:19: fatal error: tslib.h: No such file or directory
  233. compilation terminated.
  234. make: *** [tslib.o] Error 1
  235. tslib disabled.
  236. xkbcommon auto-detection... ()
  237. /home/bob/Downloads/gcc-linaro-arm-linux-gnueabi/bin/arm-linux-gnueabi-g++ -c -pipe -march=armv7-a -mfpu=neon -DLINUX=1 -DEGL_API_FB=1 -mfloat-abi=hard -mfloat-abi=hard -O2 -Wall -W -fPIC  -I. -I../../../mkspecs/devices/linux-imx6-g++ -o xkbcommon.o xkbcommon.cpp
  238. xkbcommon.cpp:34:33: fatal error: xkbcommon/xkbcommon.h: No such file or directory
  239. compilation terminated.
  240. make: *** [xkbcommon.o] Error 1
  241. xkbcommon disabled.
  242. XLib auto-detection... ()
  243. /home/bob/Downloads/gcc-linaro-arm-linux-gnueabi/bin/arm-linux-gnueabi-g++ -c -pipe -march=armv7-a -mfpu=neon -DLINUX=1 -DEGL_API_FB=1 -mfloat-abi=hard -mfloat-abi=hard -O2 -Wall -W -fPIC  -I. -I../../../mkspecs/devices/linux-imx6-g++ -o xlib.o xlib.cpp
  244. xlib.cpp:34:22: fatal error: X11/Xlib.h: No such file or directory
  245. compilation terminated.
  246. make: *** [xlib.o] Error 1
  247. XLib disabled.
  248. Xrender auto-detection... ()
  249. /home/bob/Downloads/gcc-linaro-arm-linux-gnueabi/bin/arm-linux-gnueabi-g++ -c -pipe -march=armv7-a -mfpu=neon -DLINUX=1 -DEGL_API_FB=1 -mfloat-abi=hard -mfloat-abi=hard -O2 -Wall -W -fPIC  -I. -I../../../mkspecs/devices/linux-imx6-g++ -o xrender.o xrender.cpp
  250. xrender.cpp:34:22: fatal error: X11/Xlib.h: No such file or directory
  251. compilation terminated.
  252. make: *** [xrender.o] Error 1
  253. Xrender disabled.
  254. XInput2 auto-detection... ()
  255. /home/bob/Downloads/gcc-linaro-arm-linux-gnueabi/bin/arm-linux-gnueabi-g++ -c -pipe -march=armv7-a -mfpu=neon -DLINUX=1 -DEGL_API_FB=1 -mfloat-abi=hard -mfloat-abi=hard -O2 -Wall -W -fPIC  -I. -I../../../mkspecs/devices/linux-imx6-g++ -o xinput2.o xinput2.cpp
  256. xinput2.cpp:34:22: fatal error: X11/Xlib.h: No such file or directory
  257. compilation terminated.
  258. make: *** [xinput2.o] Error 1
  259. XInput2 disabled.
  260. xcb auto-detection... ()
  261. /home/bob/Downloads/gcc-linaro-arm-linux-gnueabi/bin/arm-linux-gnueabi-g++ -c -pipe -march=armv7-a -mfpu=neon -DLINUX=1 -DEGL_API_FB=1 -mfloat-abi=hard -mfloat-abi=hard -O2 -Wall -W -fPIC  -I. -I../../../mkspecs/devices/linux-imx6-g++ -o xcb.o xcb.cpp
  262. xcb.cpp:34:21: fatal error: xcb/xcb.h: No such file or directory
  263. compilation terminated.
  264. make: *** [xcb.o] Error 1
  265. xcb disabled.
  266. The test for linking against libxcb failed!
  267. Use of pkg-config is not enabled, maybe you want to pass -force-pkg-config?
  268. You might need to install dependency packages for libxcb.
  269. See src/plugins/platforms/xcb/README.
RAW Paste Data
We use cookies for various purposes including analytics. By continuing to use Pastebin, you agree to our use of cookies as described in the Cookies Policy. OK, I Understand
 
Top