Guest User

MT-i386 build

a guest
Jun 10th, 2020
61
Never
Not a member of Pastebin yet? Sign Up, it unlocks many cool features!
  1. root@E6530-01:/tmp/minetest-i386# cmake . -DRUN_IN_PLACE=FALSE -DBUILD_SERVER=TRUE
  2. -- *** Will build version 5.3.0-dev ***
  3. -- Using GMP provided by system.
  4. -- Using bundled JSONCPP library.
  5. -- Could NOT find LuaJIT (missing:  LUA_LIBRARY LUA_INCLUDE_DIR)
  6. -- LuaJIT not found, using bundled Lua.
  7. -- cURL support enabled.
  8. -- GetText enabled; locales found: ms;ro;th;zh_TW;jbo;el;be;nn;sv;eu;ar;es;pt;zh_CN;fr;kn;pt_BR;cs;ru;it;he;kk;tr;ja_KS;sl;ko;ky;id;ca;et;uk;hu;sw;vi;sr_Cyrl;da;ja;de;dv;fil;lo;eo;nb;pl;my;lt;nl
  9. -- Sound enabled.
  10. -- Freetype enabled.
  11. -- Could NOT find Curses (missing:  CURSES_LIBRARY CURSES_INCLUDE_PATH)
  12. -- ncurses not found!
  13. -- Could NOT find PostgreSQL (missing:  PostgreSQL_LIBRARY PostgreSQL_INCLUDE_DIR PostgreSQL_TYPE_INCLUDE_DIR)
  14. -- PostgreSQL not found!
  15. -- LevelDB not found!
  16. -- Redis not found!
  17. -- Prometheus client disabled.
  18. -- SpatialIndex not found!
  19. -- Locale blacklist applied; Locales used: ms;ro;th;zh_TW;jbo;el;nn;sv;eu;ar;es;pt;zh_CN;fr;kn;pt_BR;cs;ru;it;kk;tr;ja_KS;sl;id;ca;et;uk;hu;sw;vi;sr_Cyrl;da;ja;de;dv;fil;lo;eo;nb;pl;my;lt;nl
  20. -- Could NOT find Doxygen (missing:  DOXYGEN_EXECUTABLE)
  21. -- Configuring done
  22. -- Generating done
  23. -- Build files have been written to: /tmp/minetest-i386
  24. root@E6530-01:/tmp/minetest-i386# make -j8
  25. [  0%] Built target jsoncpp
  26. [  0%] mo update
  27. [ 15%] Built target translations
  28. -- *** Detected Git version 5.3.0-dev-64380cf-dirty ***
  29. [ 15%] Built target GenerateVersion
  30. [ 20%] Built target lua
  31. [ 53%] Built target minetestserver
  32. [ 53%] Building CXX object src/CMakeFiles/minetest.dir/content/mods.cpp.o
  33. [ 53%] Building CXX object src/CMakeFiles/minetest.dir/content/content.cpp.o
  34. [ 53%] Building CXX object src/CMakeFiles/minetest.dir/database/database-files.cpp.o
  35. [ 53%] Building CXX object src/CMakeFiles/minetest.dir/client/wieldmesh.cpp.o
  36. [ 53%] Building CXX object src/CMakeFiles/minetest.dir/database/database-dummy.cpp.o
  37. [ 53%] Building CXX object src/CMakeFiles/minetest.dir/client/mesh.cpp.o
  38. [ 53%] Building CXX object src/CMakeFiles/minetest.dir/content/subgames.cpp.o
  39. [ 54%] Building CXX object src/CMakeFiles/minetest.dir/content/packages.cpp.o
  40. [ 54%] Building CXX object src/CMakeFiles/minetest.dir/database/database-leveldb.cpp.o
  41. [ 54%] Building CXX object src/CMakeFiles/minetest.dir/database/database-postgresql.cpp.o
  42. /tmp/minetest-i386/src/client/mesh.cpp: In function 'bool checkMeshNormals(irr::scene::IMesh*)':
  43. /tmp/minetest-i386/src/client/mesh.cpp:344:23: error: 'isfinite' was not declared in this scope
  44.    if (!isfinite(length) || fabs(length) < 1e-10)
  45.                        ^
  46. /tmp/minetest-i386/src/client/mesh.cpp:344:23: note: suggested alternative:
  47. In file included from /tmp/minetest-i386/src/client/mesh.cpp:24:0:
  48. /usr/include/c++/5/cmath:601:5: note:   'std::isfinite'
  49.      isfinite(_Tp __x)
  50.      ^
  51. [ 55%] Building CXX object src/CMakeFiles/minetest.dir/database/database-redis.cpp.o
  52. [ 55%] Building CXX object src/CMakeFiles/minetest.dir/database/database-sqlite3.cpp.o
  53. src/CMakeFiles/minetest.dir/build.make:638: recipe for target 'src/CMakeFiles/minetest.dir/client/mesh.cpp.o' failed
  54. make[2]: *** [src/CMakeFiles/minetest.dir/client/mesh.cpp.o] Error 1
  55. make[2]: *** Waiting for unfinished jobs....
  56. CMakeFiles/Makefile2:326: recipe for target 'src/CMakeFiles/minetest.dir/all' failed
  57. make[1]: *** [src/CMakeFiles/minetest.dir/all] Error 2
  58. Makefile:149: recipe for target 'all' failed
  59. make: *** [all] Error 2
  60. root@E6530-01:/tmp/minetest-i386#
RAW Paste Data