Guest User

Untitled

a guest
Dec 9th, 2016
93
Never
Not a member of Pastebin yet? Sign Up, it unlocks many cool features!
  1. login as: user
  2. user@192.168.10.119's password:
  3. Welcome to Ubuntu 12.04.3 LTS (GNU/Linux 3.5.0-43-generic x86_64)
  4.  
  5. * Documentation: https://help.ubuntu.com/
  6.  
  7. 435 packages can be updated.
  8. 289 updates are security updates.
  9.  
  10. New release '14.04.1 LTS' available.
  11. Run 'do-release-upgrade' to upgrade to it.
  12.  
  13. Last login: Thu Jun 18 14:06:56 2015 from 192.168.10.42
  14. user@vm00:~$ xlock
  15. The program 'xlock' can be found in the following packages:
  16. * xlockmore
  17. * xlockmore-gl
  18. Try: sudo apt-get install <selected package>
  19. user@vm00:~$ xlock
  20. The program 'xlock' can be found in the following packages:
  21. * xlockmore
  22. * xlockmore-gl
  23. Try: sudo apt-get install <selected package>
  24. user@vm00:~$ xclock
  25. ^C
  26. user@vm00:~$ eclipse
  27.  
  28.  
  29. euser@vm00:~$
  30. user@vm00:~$
  31. user@vm00:~$ eclipse
  32.  
  33. [debug] execute contextualize
  34. [debug] execute contextualize
  35. [debug] execute contextualize
  36. [debug] execute contextualize
  37. [debug] execute contextualize
  38. [debug] execute contextualize
  39. [debug] execute contextualize
  40. [debug] execute contextualize
  41.  
  42. /opt/apache^Z
  43. [1]+ Stopped /home/user/eclipse/eclipse
  44. user@vm00:~$ bg
  45. [1]+ /home/user/eclipse/eclipse &
  46. user@vm00:~$
  47. user@vm00:~$ /opt/apache-tomcat-7.0.55/bin/startup.sh
  48. Using CATALINA_BASE: /opt/apache-tomcat-7.0.55
  49. Using CATALINA_HOME: /opt/apache-tomcat-7.0.55
  50. Using CATALINA_TMPDIR: /opt/apache-tomcat-7.0.55/temp
  51. Using JRE_HOME: /opt/jdk1.7.0_45
  52. Using CLASSPATH: /opt/apache-tomcat-7.0.55/bin/bootstrap.jar:/opt/apache-t omcat-7.0.55/bin/tomcat-juli.jar
  53. Tomcat started.
  54. user@vm00:~$ /opt/apache-tomcat-7.0.55/bin/c
  55. catalina.sh configtest.sh
  56. user@vm00:~$ /opt/apache-tomcat-7.0.55/bin/catalina.sh start
  57. Using CATALINA_BASE: /opt/apache-tomcat-7.0.55
  58. Using CATALINA_HOME: /opt/apache-tomcat-7.0.55
  59. Using CATALINA_TMPDIR: /opt/apache-tomcat-7.0.55/temp
  60. Using JRE_HOME: /opt/jdk1.7.0_45
  61. Using CLASSPATH: /opt/apache-tomcat-7.0.55/bin/bootstrap.jar:/opt/apache-t omcat-7.0.55/bin/tomcat-juli.jar
  62. Tomcat started.
  63. user@vm00:~$ firefox &
  64. [2] 19184
  65. user@vm00:~$
  66. Display all 2363 possibilities? (y or n)
  67. user@vm00:~$ cd feladatok/wssample/wssample-backend/
  68. user@vm00:~/feladatok/wssample/wssample-backend$
  69. user@vm00:~/feladatok/wssample/wssample-backend$ mvn clean instal
  70.  
  71. [INFO] Scanning for projects...
  72. [INFO]
  73. [INFO] ------------------------------------------------------------------------
  74. [INFO] Building wssample-backend 1.0
  75. [INFO] ------------------------------------------------------------------------
  76. [INFO] ------------------------------------------------------------------------
  77. [INFO] BUILD FAILURE
  78. [INFO] ------------------------------------------------------------------------
  79. [INFO] Total time: 0.202s
  80. [INFO] Finished at: Fri Dec 09 18:59:33 CET 2016
  81. [INFO] Final Memory: 5M/30M
  82. [INFO] ------------------------------------------------------------------------
  83. [ERROR] Unknown lifecycle phase "instal". You must specify a valid lifecycle pha se or a goal in the format <plugin-prefix>:<goal> or <plugin-group-id>:<plugin-a rtifact-id>[:<plugin-version>]:<goal>. Available lifecycle phases are: validate, initialize, generate-sources, process-sources, generate-resources, process-reso urces, compile, process-classes, generate-test-sources, process-test-sources, ge nerate-test-resources, process-test-resources, test-compile, process-test-classe s, test, prepare-package, package, pre-integration-test, integration-test, post- integration-test, verify, install, deploy, pre-site, site, post-site, site-deplo y, pre-clean, clean, post-clean. -> [Help 1]
  84. [ERROR]
  85. [ERROR] To see the full stack trace of the errors, re-run Maven with the -e swit ch.
  86. [ERROR] Re-run Maven using the -X switch to enable full debug logging.
  87. [ERROR]
  88. [ERROR] For more information about the errors and possible solutions, please rea d the following articles:
  89. [ERROR] [Help 1] http://cwiki.apache.org/confluence/display/MAVEN/LifecyclePhase NotFoundException
  90. user@vm00:~/feladatok/wssample/wssample-backend$
  91. user@vm00:~/feladatok/wssample/wssample-backend$ mvn clean instal▒
  92. [INFO] Scanning for projects...
  93. [INFO]
  94. [INFO] ------------------------------------------------------------------------
  95. [INFO] Building wssample-backend 1.0
  96. [INFO] ------------------------------------------------------------------------
  97. [INFO] ------------------------------------------------------------------------
  98. [INFO] BUILD FAILURE
  99. [INFO] ------------------------------------------------------------------------
  100. [INFO] Total time: 0.172s
  101. [INFO] Finished at: Fri Dec 09 19:00:01 CET 2016
  102. [INFO] Final Memory: 5M/30M
  103. [INFO] ------------------------------------------------------------------------
  104. [ERROR] Unknown lifecycle phase "instal�". You must specify a valid lifecycle phase or a goal in the format <plugin-prefix>:<goal> or <plugin-group-id>:<plugin-artifact-id>[:<plugin-version>]:<goal>. Available lifecycle phases are: validate, initialize, generate-sources, process-sources, generate-resources, process-resources, compile, process-classes, generate-test-sources, process-test-sources, generate-test-resources, process-test-resources, test-compile, process-test-classes, test, prepare-package, package, pre-integration-test, integration-test, post-integration-test, verify, install, deploy, pre-site, site, post-site, site-deploy, pre-clean, clean, post-clean. -> [Help 1]
  105. [ERROR]
  106. [ERROR] To see the full stack trace of the errors, re-run Maven with the -e switch.
  107. [ERROR] Re-run Maven using the -X switch to enable full debug logging.
  108. [ERROR]
  109. [ERROR] For more information about the errors and possible solutions, please read the following articles:
  110. [ERROR] [Help 1] http://cwiki.apache.org/confluence/display/MAVEN/LifecyclePhaseNotFoundException
  111. user@vm00:~/feladatok/wssample/wssample-backend$ mvn clean install
  112. [INFO] Scanning for projects...
  113. [INFO]
  114. [INFO] ------------------------------------------------------------------------
  115. [INFO] Building wssample-backend 1.0
  116. [INFO] ------------------------------------------------------------------------
  117. [INFO]
  118. [INFO] --- maven-clean-plugin:2.5:clean (default-clean) @ wssample-backend ---
  119. [INFO] Deleting /home/user/feladatok/wssample/wssample-backend/target
  120. [INFO]
  121. [INFO] --- maven-resources-plugin:2.6:resources (default-resources) @ wssample-backend ---
  122. [INFO] Using 'UTF-8' encoding to copy filtered resources.
  123. [INFO] Copying 3 resources
  124. [INFO]
  125. [INFO] --- maven-compiler-plugin:3.1:compile (default-compile) @ wssample-backend ---
  126. [INFO] Changes detected - recompiling the module!
  127. [INFO] Compiling 11 source files to /home/user/feladatok/wssample/wssample-backend/target/classes
  128. [INFO]
  129. [INFO] --- maven-resources-plugin:2.6:testResources (default-testResources) @ wssample-backend ---
  130. [INFO] Using 'UTF-8' encoding to copy filtered resources.
  131. [INFO] Copying 0 resource
  132. [INFO]
  133. [INFO] --- maven-compiler-plugin:3.1:testCompile (default-testCompile) @ wssample-backend ---
  134. [INFO] Changes detected - recompiling the module!
  135. [INFO] Compiling 1 source file to /home/user/feladatok/wssample/wssample-backend/target/test-classes
  136. [INFO]
  137. [INFO] --- maven-surefire-plugin:2.12.4:test (default-test) @ wssample-backend ---
  138. [INFO] Surefire report directory: /home/user/feladatok/wssample/wssample-backend/target/surefire-reports
  139. Downloading: http://repo.maven.apache.org/maven2/org/apache/maven/surefire/surefire-junit4/2.12.4/surefire-junit4-2.12.4.pom
  140. Downloaded: http://repo.maven.apache.org/maven2/org/apache/maven/surefire/surefire-junit4/2.12.4/surefire-junit4-2.12.4.pom (3 KB at 8.7 KB/sec)
  141. Downloading: http://repo.maven.apache.org/maven2/org/apache/maven/surefire/surefire-providers/2.12.4/surefire-providers-2.12.4.pom
  142. Downloaded: http://repo.maven.apache.org/maven2/org/apache/maven/surefire/surefire-providers/2.12.4/surefire-providers-2.12.4.pom (3 KB at 29.4 KB/sec)
  143. Downloading: http://repo.maven.apache.org/maven2/org/apache/maven/surefire/surefire-junit4/2.12.4/surefire-junit4-2.12.4.jar
  144. Downloaded: http://repo.maven.apache.org/maven2/org/apache/maven/surefire/surefire-junit4/2.12.4/surefire-junit4-2.12.4.jar (37 KB at 279.5 KB/sec)
  145.  
  146. -------------------------------------------------------
  147. T E S T S
  148. -------------------------------------------------------
  149. Running hu.zerotohero.ws.daos.AdminDaoTest
  150. Tests run: 3, Failures: 0, Errors: 0, Skipped: 0, Time elapsed: 0.08 sec
  151.  
  152. Results :
  153.  
  154. Tests run: 3, Failures: 0, Errors: 0, Skipped: 0
  155.  
  156. [INFO]
  157. [INFO] --- maven-war-plugin:2.4:war (default-war) @ wssample-backend ---
  158. [INFO] Packaging webapp
  159. [INFO] Assembling webapp [wssample-backend] in [/home/user/feladatok/wssample/wssample-backend/target/wssample-backend-1.0]
  160. [INFO] Processing war project
  161. [INFO] Copying webapp resources [/home/user/feladatok/wssample/wssample-backend/src/main/webapp]
  162. [INFO] Webapp assembled in [193 msecs]
  163. [INFO] Building war: /home/user/feladatok/wssample/wssample-backend/target/wssample-backend-1.0.war
  164. [INFO]
  165. [INFO] --- maven-install-plugin:2.4:install (default-install) @ wssample-backend ---
  166. [INFO] Installing /home/user/feladatok/wssample/wssample-backend/target/wssample-backend-1.0.war to /home/user/.m2/repository/hu/zerotohero/wssample-backend/1.0/wssample-backend-1.0.war
  167. [INFO] Installing /home/user/feladatok/wssample/wssample-backend/pom.xml to /home/user/.m2/repository/hu/zerotohero/wssample-backend/1.0/wssample-backend-1.0.pom
  168. [INFO] ------------------------------------------------------------------------
  169. [INFO] BUILD SUCCESS
  170. [INFO] ------------------------------------------------------------------------
  171. [INFO] Total time: 6.497s
  172. [INFO] Finished at: Fri Dec 09 19:00:20 CET 2016
  173. [INFO] Final Memory: 18M/43M
  174. [INFO] ------------------------------------------------------------------------
  175. user@vm00:~/feladatok/wssample/wssample-backend$ mvm clean install -p cargo
  176. No command 'mvm' found, but there are 16 similar ones
  177. mvm: command not found
  178. user@vm00:~/feladatok/wssample/wssample-backend$ -P cargo
  179. -P: command not found
  180. user@vm00:~/feladatok/wssample/wssample-backend$ mvm clean install -Pcargo
  181. No command 'mvm' found, but there are 16 similar ones
  182. mvm: command not found
  183. user@vm00:~/feladatok/wssample/wssample-backend$ mvn clean install -Pcargo
  184. [INFO] Scanning for projects...
  185. [INFO]
  186. [INFO] ------------------------------------------------------------------------
  187. [INFO] Building wssample-backend 1.0
  188. [INFO] ------------------------------------------------------------------------
  189. [INFO]
  190. [INFO] --- maven-clean-plugin:2.5:clean (default-clean) @ wssample-backend ---
  191. [INFO] Deleting /home/user/feladatok/wssample/wssample-backend/target
  192. [INFO]
  193. [INFO] --- maven-resources-plugin:2.6:resources (default-resources) @ wssample-backend ---
  194. [INFO] Using 'UTF-8' encoding to copy filtered resources.
  195. [INFO] Copying 3 resources
  196. [INFO]
  197. [INFO] --- maven-compiler-plugin:3.1:compile (default-compile) @ wssample-backend ---
  198. [INFO] Changes detected - recompiling the module!
  199. [INFO] Compiling 11 source files to /home/user/feladatok/wssample/wssample-backend/target/classes
  200. [INFO]
  201. [INFO] --- maven-resources-plugin:2.6:testResources (default-testResources) @ wssample-backend ---
  202. [INFO] Using 'UTF-8' encoding to copy filtered resources.
  203. [INFO] Copying 0 resource
  204. [INFO]
  205. [INFO] --- maven-compiler-plugin:3.1:testCompile (default-testCompile) @ wssample-backend ---
  206. [INFO] Changes detected - recompiling the module!
  207. [INFO] Compiling 1 source file to /home/user/feladatok/wssample/wssample-backend/target/test-classes
  208. [INFO]
  209. [INFO] --- maven-surefire-plugin:2.12.4:test (default-test) @ wssample-backend ---
  210. [INFO] Surefire report directory: /home/user/feladatok/wssample/wssample-backend/target/surefire-reports
  211.  
  212. -------------------------------------------------------
  213. T E S T S
  214. -------------------------------------------------------
  215. Running hu.zerotohero.ws.daos.AdminDaoTest
  216. Tests run: 3, Failures: 0, Errors: 0, Skipped: 0, Time elapsed: 0.08 sec
  217.  
  218. Results :
  219.  
  220. Tests run: 3, Failures: 0, Errors: 0, Skipped: 0
  221.  
  222. [INFO]
  223. [INFO] --- maven-war-plugin:2.4:war (default-war) @ wssample-backend ---
  224. [INFO] Packaging webapp
  225. [INFO] Assembling webapp [wssample-backend] in [/home/user/feladatok/wssample/wssample-backend/target/wssample-backend-1.0]
  226. [INFO] Processing war project
  227. [INFO] Copying webapp resources [/home/user/feladatok/wssample/wssample-backend/src/main/webapp]
  228. [INFO] Webapp assembled in [123 msecs]
  229. [INFO] Building war: /home/user/feladatok/wssample/wssample-backend/target/wssample-backend-1.0.war
  230. [INFO]
  231. [INFO] --- maven-install-plugin:2.4:install (default-install) @ wssample-backend ---
  232. [INFO] Installing /home/user/feladatok/wssample/wssample-backend/target/wssample-backend-1.0.war to /home/user/.m2/repository/hu/zerotohero/wssample-backend/1.0/wssample-backend-1.0.war
  233. [INFO] Installing /home/user/feladatok/wssample/wssample-backend/pom.xml to /home/user/.m2/repository/hu/zerotohero/wssample-backend/1.0/wssample-backend-1.0.pom
  234. [INFO] ------------------------------------------------------------------------
  235. [INFO] BUILD SUCCESS
  236. [INFO] ------------------------------------------------------------------------
  237. [INFO] Total time: 5.329s
  238. [INFO] Finished at: Fri Dec 09 19:03:01 CET 2016
  239. [INFO] Final Memory: 17M/41M
  240. [INFO] ------------------------------------------------------------------------
  241. [WARNING] The requested profile "cargo" could not be activated because it does not exist.
  242. user@vm00:~/feladatok/wssample/wssample-backend$ sample frontend/
  243. No command 'sample' found, did you mean:
  244. Command 'yample' from package 'yample' (universe)
  245. Command 'ample' from package 'ample' (universe)
  246. sample: command not found
  247. user@vm00:~/feladatok/wssample/wssample-backend$ cd../sample-frontend/
  248. -bash: cd../sample-frontend/: No such file or directory
  249. user@vm00:~/feladatok/wssample/wssample-backend$ cd ../sample-frontend/
  250. -bash: cd: ../sample-frontend/: No such file or directory
  251. user@vm00:~/feladatok/wssample/wssample-backend$ cd ../wssample-frontend/
  252. user@vm00:~/feladatok/wssample/wssample-frontend$ cd -
  253. /home/user/feladatok/wssample/wssample-backend
  254. user@vm00:~/feladatok/wssample/wssample-backend$ Pcargo-redecloy
  255. Pcargo-redecloy: command not found
  256. user@vm00:~/feladatok/wssample/wssample-backend$ -Pcargo-redecloy
  257. -Pcargo-redecloy: command not found
  258. user@vm00:~/feladatok/wssample/wssample-backend$ -Pcargo -redecloy
  259. -Pcargo: command not found
  260. user@vm00:~/feladatok/wssample/wssample-backend$ -Pcargo -redeploy
  261. -Pcargo: command not found
  262. user@vm00:~/feladatok/wssample/wssample-backend$ -Pcargo-redeploy
  263. -Pcargo-redeploy: command not found
  264. user@vm00:~/feladatok/wssample/wssample-backend$ mvn clean -install -Pcargo-redeploy
  265. Unable to parse command line options: Unrecognized option: -install
  266.  
  267. usage: mvn [options] [<goal(s)>] [<phase(s)>]
  268.  
  269. Options:
  270. -am,--also-make If project list is specified, also
  271. build projects required by the
  272. list
  273. -amd,--also-make-dependents If project list is specified, also
  274. build projects that depend on
  275. projects on the list
  276. -B,--batch-mode Run in non-interactive (batch)
  277. mode
  278. -C,--strict-checksums Fail the build if checksums don't
  279. match
  280. -c,--lax-checksums Warn if checksums don't match
  281. -cpu,--check-plugin-updates Ineffective, only kept for
  282. backward compatibility
  283. -D,--define <arg> Define a system property
  284. -e,--errors Produce execution error messages
  285. -emp,--encrypt-master-password <arg> Encrypt master security password
  286. -ep,--encrypt-password <arg> Encrypt server password
  287. -f,--file <arg> Force the use of an alternate POM
  288. file (or directory with pom.xml).
  289. -fae,--fail-at-end Only fail the build afterwards;
  290. allow all non-impacted builds to
  291. continue
  292. -ff,--fail-fast Stop at first failure in
  293. reactorized builds
  294. -fn,--fail-never NEVER fail the build, regardless
  295. of project result
  296. -gs,--global-settings <arg> Alternate path for the global
  297. settings file
  298. -h,--help Display help information
  299. -l,--log-file <arg> Log file to where all build output
  300. will go.
  301. -llr,--legacy-local-repository Use Maven 2 Legacy Local
  302. Repository behaviour, ie no use of
  303. _remote.repositories. Can also be
  304. activated by using
  305. -Dmaven.legacyLocalRepo=true
  306. -N,--non-recursive Do not recurse into sub-projects
  307. -npr,--no-plugin-registry Ineffective, only kept for
  308. backward compatibility
  309. -npu,--no-plugin-updates Ineffective, only kept for
  310. backward compatibility
  311. -nsu,--no-snapshot-updates Suppress SNAPSHOT updates
  312. -o,--offline Work offline
  313. -P,--activate-profiles <arg> Comma-delimited list of profiles
  314. to activate
  315. -pl,--projects <arg> Comma-delimited list of specified
  316. reactor projects to build instead
  317. of all projects. A project can be
  318. specified by [groupId]:artifactId
  319. or by its relative path.
  320. -q,--quiet Quiet output - only show errors
  321. -rf,--resume-from <arg> Resume reactor from specified
  322. project
  323. -s,--settings <arg> Alternate path for the user
  324. settings file
  325. -T,--threads <arg> Thread count, for instance 2.0C
  326. where C is core multiplied
  327. -t,--toolchains <arg> Alternate path for the user
  328. toolchains file
  329. -U,--update-snapshots Forces a check for updated
  330. releases and snapshots on remote
  331. repositories
  332. -up,--update-plugins Ineffective, only kept for
  333. backward compatibility
  334. -V,--show-version Display version information
  335. WITHOUT stopping build
  336. -v,--version Display version information
  337. -X,--debug Produce execution debug output
  338. user@vm00:~/feladatok/wssample/wssample-backend$ mvn clean install -Pcargo-redeploy
  339. [INFO] Scanning for projects...
  340. [WARNING]
  341. [WARNING] Some problems were encountered while building the effective model for hu.zerotohero:wssample-backend:war:1.0
  342. [WARNING] 'build.plugins.plugin.version' for org.apache.maven.plugins:maven-surefire-plugin is missing. @ line 112, column 29
  343. [WARNING]
  344. [WARNING] It is highly recommended to fix these problems because they threaten the stability of your build.
  345. [WARNING]
  346. [WARNING] For this reason, future Maven versions might no longer support building such malformed projects.
  347. [WARNING]
  348. [INFO]
  349. [INFO] ------------------------------------------------------------------------
  350. [INFO] Building wssample-backend 1.0
  351. [INFO] ------------------------------------------------------------------------
  352. [INFO]
  353. [INFO] --- maven-clean-plugin:2.5:clean (default-clean) @ wssample-backend ---
  354. [INFO] Deleting /home/user/feladatok/wssample/wssample-backend/target
  355. [INFO]
  356. [INFO] --- maven-resources-plugin:2.6:resources (default-resources) @ wssample-backend ---
  357. [INFO] Using 'UTF-8' encoding to copy filtered resources.
  358. [INFO] Copying 3 resources
  359. [INFO]
  360. [INFO] --- maven-compiler-plugin:3.1:compile (default-compile) @ wssample-backend ---
  361. [INFO] Changes detected - recompiling the module!
  362. [INFO] Compiling 11 source files to /home/user/feladatok/wssample/wssample-backend/target/classes
  363. [INFO]
  364. [INFO] --- maven-resources-plugin:2.6:testResources (default-testResources) @ wssample-backend ---
  365. [INFO] Using 'UTF-8' encoding to copy filtered resources.
  366. [INFO] Copying 0 resource
  367. [INFO]
  368. [INFO] --- maven-compiler-plugin:3.1:testCompile (default-testCompile) @ wssample-backend ---
  369. [INFO] Changes detected - recompiling the module!
  370. [INFO] Compiling 1 source file to /home/user/feladatok/wssample/wssample-backend/target/test-classes
  371. [INFO]
  372. [INFO] --- maven-surefire-plugin:2.12.4:test (default-test) @ wssample-backend ---
  373. [WARNING] useSystemClassloader setting has no effect when not forking
  374. [INFO]
  375. [INFO] --- maven-war-plugin:2.4:war (default-war) @ wssample-backend ---
  376. [INFO] Packaging webapp
  377. [INFO] Assembling webapp [wssample-backend] in [/home/user/feladatok/wssample/wssample-backend/target/wssample-backend-1.0]
  378. [INFO] Processing war project
  379. [INFO] Copying webapp resources [/home/user/feladatok/wssample/wssample-backend/src/main/webapp]
  380. [INFO] Webapp assembled in [109 msecs]
  381. [INFO] Building war: /home/user/feladatok/wssample/wssample-backend/target/wssample-backend-1.0.war
  382. [INFO]
  383. [INFO] --- maven-install-plugin:2.4:install (default-install) @ wssample-backend ---
  384. [INFO] Installing /home/user/feladatok/wssample/wssample-backend/target/wssample-backend-1.0.war to /home/user/.m2/repository/hu/zerotohero/wssample-backend/1.0/wssample-backend-1.0.war
  385. [INFO] Installing /home/user/feladatok/wssample/wssample-backend/pom.xml to /home/user/.m2/repository/hu/zerotohero/wssample-backend/1.0/wssample-backend-1.0.pom
  386. [INFO] ------------------------------------------------------------------------
  387. [INFO] BUILD SUCCESS
  388. [INFO] ------------------------------------------------------------------------
  389. [INFO] Total time: 5.556s
  390. [INFO] Finished at: Fri Dec 09 19:10:17 CET 2016
  391. [INFO] Final Memory: 17M/40M
  392. [INFO] ------------------------------------------------------------------------
  393. user@vm00:~/feladatok/wssample/wssample-backend$ cd ..
  394. user@vm00:~/feladatok/wssample$ cd wssample-frontend/
  395. user@vm00:~/feladatok/wssample/wssample-frontend$ mvn clean-install
  396. [INFO] Scanning for projects...
  397. [WARNING]
  398. [WARNING] Some problems were encountered while building the effective model for hu.zerotohero:wssample-frontend:war:1.0
  399. [WARNING] 'build.plugins.plugin.version' for org.apache.maven.plugins:maven-surefire-plugin is missing. @ line 37, column 21
  400. [WARNING]
  401. [WARNING] It is highly recommended to fix these problems because they threaten the stability of your build.
  402. [WARNING]
  403. [WARNING] For this reason, future Maven versions might no longer support building such malformed projects.
  404. [WARNING]
  405. [INFO]
  406. [INFO] ------------------------------------------------------------------------
  407. [INFO] Building wssample-frontend 1.0
  408. [INFO] ------------------------------------------------------------------------
  409. [INFO] ------------------------------------------------------------------------
  410. [INFO] BUILD FAILURE
  411. [INFO] ------------------------------------------------------------------------
  412. [INFO] Total time: 0.193s
  413. [INFO] Finished at: Fri Dec 09 19:12:33 CET 2016
  414. [INFO] Final Memory: 5M/30M
  415. [INFO] ------------------------------------------------------------------------
  416. [ERROR] Unknown lifecycle phase "clean-install". You must specify a valid lifecycle phase or a goal in the format <plugin-prefix>:<goal> or <plugin-group-id>:<plugin-artifact-id>[:<plugin-version>]:<goal>. Available lifecycle phases are: validate, initialize, generate-sources, process-sources, generate-resources, process-resources, compile, process-classes, generate-test-sources, process-test-sources, generate-test-resources, process-test-resources, test-compile, process-test-classes, test, prepare-package, package, pre-integration-test, integration-test, post-integration-test, verify, install, deploy, pre-site, site, post-site, site-deploy, pre-clean, clean, post-clean. -> [Help 1]
  417. [ERROR]
  418. [ERROR] To see the full stack trace of the errors, re-run Maven with the -e switch.
  419. [ERROR] Re-run Maven using the -X switch to enable full debug logging.
  420. [ERROR]
  421. [ERROR] For more information about the errors and possible solutions, please read the following articles:
  422. [ERROR] [Help 1] http://cwiki.apache.org/confluence/display/MAVEN/LifecyclePhaseNotFoundException
  423. user@vm00:~/feladatok/wssample/wssample-frontend$ mvn clean install
  424. [INFO] Scanning for projects...
  425. [WARNING]
  426. [WARNING] Some problems were encountered while building the effective model for hu.zerotohero:wssample-frontend:war:1.0
  427. [WARNING] 'build.plugins.plugin.version' for org.apache.maven.plugins:maven-surefire-plugin is missing. @ line 37, column 21
  428. [WARNING]
  429. [WARNING] It is highly recommended to fix these problems because they threaten the stability of your build.
  430. [WARNING]
  431. [WARNING] For this reason, future Maven versions might no longer support building such malformed projects.
  432. [WARNING]
  433. [INFO]
  434. [INFO] ------------------------------------------------------------------------
  435. [INFO] Building wssample-frontend 1.0
  436. [INFO] ------------------------------------------------------------------------
  437. [INFO]
  438. [INFO] --- maven-clean-plugin:2.5:clean (default-clean) @ wssample-frontend ---
  439. [INFO] Deleting /home/user/feladatok/wssample/wssample-frontend/target
  440. [INFO]
  441. [INFO] --- jaxws-maven-plugin:1.12:wsimport (adminservice) @ wssample-frontend ---
  442. Downloading: http://download.java.net/maven/2/org/jvnet/staxex/stax-ex/maven-metadata.xml
  443. [WARNING] Could not transfer metadata org.jvnet.staxex:stax-ex/maven-metadata.xml from/to java.net (http://download.java.net/maven/1/): No connector available to access repository java.net (http://download.java.net/maven/1/) of type legacy using the available factories WagonRepositoryConnectorFactory
  444. [WARNING] Failure to transfer org.jvnet.staxex:stax-ex/maven-metadata.xml from http://download.java.net/maven/1/ was cached in the local repository, resolution will not be reattempted until the update interval of java.net has elapsed or updates are forced. Original error: Could not transfer metadata org.jvnet.staxex:stax-ex/maven-metadata.xml from/to java.net (http://download.java.net/maven/1/): No connector available to access repository java.net (http://download.java.net/maven/1/) of type legacy using the available factories WagonRepositoryConnectorFactory
  445. [INFO] Processing: http://localhost:8080/backend/ws/admin?wsdl
  446. [INFO] jaxws:wsimport args: [-s, /home/user/feladatok/wssample/wssample-frontend/target/generated-sources, -d, /home/user/feladatok/wssample/wssample-frontend/target/classes, -p, hu.zerotohero.wssample.ws.admin, -Xnocompile, http://localhost:8080/backend/ws/admin?wsdl]
  447. parsing WSDL...
  448.  
  449.  
  450. [ERROR] http://localhost:8080/backend/ws/admin?wsdl is unreachable
  451.  
  452.  
  453. Failed to parse the WSDL.
  454. [INFO] ------------------------------------------------------------------------
  455. [INFO] BUILD FAILURE
  456. [INFO] ------------------------------------------------------------------------
  457. [INFO] Total time: 3.725s
  458. [INFO] Finished at: Fri Dec 09 19:12:48 CET 2016
  459. [INFO] Final Memory: 10M/30M
  460. [INFO] ------------------------------------------------------------------------
  461. [ERROR] Failed to execute goal org.codehaus.mojo:jaxws-maven-plugin:1.12:wsimport (adminservice) on project wssample-frontend: Error executing: wsimport [-s, /home/user/feladatok/wssample/wssample-frontend/target/generated-sources, -d, /home/user/feladatok/wssample/wssample-frontend/target/classes, -p, hu.zerotohero.wssample.ws.admin, -Xnocompile, http://localhost:8080/backend/ws/admin?wsdl] -> [Help 1]
  462. [ERROR]
  463. [ERROR] To see the full stack trace of the errors, re-run Maven with the -e switch.
  464. [ERROR] Re-run Maven using the -X switch to enable full debug logging.
  465. [ERROR]
  466. [ERROR] For more information about the errors and possible solutions, please read the following articles:
  467. [ERROR] [Help 1] http://cwiki.apache.org/confluence/display/MAVEN/MojoExecutionException
  468. user@vm00:~/feladatok/wssample/wssample-frontend$ mvn clean install
  469. [INFO] Scanning for projects...
  470. [WARNING]
  471. [WARNING] Some problems were encountered while building the effective model for hu.zerotohero:wssample-frontend:war:1.0
  472. [WARNING] 'build.plugins.plugin.version' for org.apache.maven.plugins:maven-surefire-plugin is missing. @ line 37, column 21
  473. [WARNING]
  474. [WARNING] It is highly recommended to fix these problems because they threaten the stability of your build.
  475. [WARNING]
  476. [WARNING] For this reason, future Maven versions might no longer support building such malformed projects.
  477. [WARNING]
  478. [INFO]
  479. [INFO] ------------------------------------------------------------------------
  480. [INFO] Building wssample-frontend 1.0
  481. [INFO] ------------------------------------------------------------------------
  482. [INFO]
  483. [INFO] --- maven-clean-plugin:2.5:clean (default-clean) @ wssample-frontend ---
  484. [INFO] Deleting /home/user/feladatok/wssample/wssample-frontend/target
  485. [INFO]
  486. [INFO] --- jaxws-maven-plugin:1.12:wsimport (adminservice) @ wssample-frontend ---
  487. [WARNING] Could not transfer metadata org.jvnet.staxex:stax-ex/maven-metadata.xml from/to java.net (http://download.java.net/maven/1/): No connector available to access repository java.net (http://download.java.net/maven/1/) of type legacy using the available factories WagonRepositoryConnectorFactory
  488. [WARNING] Failure to transfer org.jvnet.staxex:stax-ex/maven-metadata.xml from http://download.java.net/maven/1/ was cached in the local repository, resolution will not be reattempted until the update interval of java.net has elapsed or updates are forced. Original error: Could not transfer metadata org.jvnet.staxex:stax-ex/maven-metadata.xml from/to java.net (http://download.java.net/maven/1/): No connector available to access repository java.net (http://download.java.net/maven/1/) of type legacy using the available factories WagonRepositoryConnectorFactory
  489. [INFO] Processing: http://localhost:8080/backend/ws/admin?wsdl
  490. [INFO] jaxws:wsimport args: [-s, /home/user/feladatok/wssample/wssample-frontend/target/generated-sources, -d, /home/user/feladatok/wssample/wssample-frontend/target/classes, -p, hu.zerotohero.wssample.ws.admin, -Xnocompile, http://localhost:8080/backend/ws/admin?wsdl]
  491. parsing WSDL...
  492.  
  493.  
  494. [ERROR] http://localhost:8080/backend/ws/admin?wsdl is unreachable
  495.  
  496.  
  497. Failed to parse the WSDL.
  498. [INFO] ------------------------------------------------------------------------
  499. [INFO] BUILD FAILURE
  500. [INFO] ------------------------------------------------------------------------
  501. [INFO] Total time: 1.649s
  502. [INFO] Finished at: Fri Dec 09 19:14:10 CET 2016
  503. [INFO] Final Memory: 9M/30M
  504. [INFO] ------------------------------------------------------------------------
  505. [ERROR] Failed to execute goal org.codehaus.mojo:jaxws-maven-plugin:1.12:wsimport (adminservice) on project wssample-frontend: Error executing: wsimport [-s, /home/user/feladatok/wssample/wssample-frontend/target/generated-sources, -d, /home/user/feladatok/wssample/wssample-frontend/target/classes, -p, hu.zerotohero.wssample.ws.admin, -Xnocompile, http://localhost:8080/backend/ws/admin?wsdl] -> [Help 1]
  506. [ERROR]
  507. [ERROR] To see the full stack trace of the errors, re-run Maven with the -e switch.
  508. [ERROR] Re-run Maven using the -X switch to enable full debug logging.
  509. [ERROR]
  510. [ERROR] For more information about the errors and possible solutions, please read the following articles:
  511. [ERROR] [Help 1] http://cwiki.apache.org/confluence/display/MAVEN/MojoExecutionException
  512. user@vm00:~/feladatok/wssample/wssample-frontend$ mvn clean-install
  513. [INFO] Scanning for projects...
  514. [WARNING]
  515. [WARNING] Some problems were encountered while building the effective model for hu.zerotohero:wssample-frontend:war:1.0
  516. [WARNING] 'build.plugins.plugin.version' for org.apache.maven.plugins:maven-surefire-plugin is missing. @ line 37, column 21
  517. [WARNING]
  518. [WARNING] It is highly recommended to fix these problems because they threaten the stability of your build.
  519. [WARNING]
  520. [WARNING] For this reason, future Maven versions might no longer support building such malformed projects.
  521. [WARNING]
  522. [INFO]
  523. [INFO] ------------------------------------------------------------------------
  524. [INFO] Building wssample-frontend 1.0
  525. [INFO] ------------------------------------------------------------------------
  526. [INFO] ------------------------------------------------------------------------
  527. [INFO] BUILD FAILURE
  528. [INFO] ------------------------------------------------------------------------
  529. [INFO] Total time: 0.169s
  530. [INFO] Finished at: Fri Dec 09 19:19:13 CET 2016
  531. [INFO] Final Memory: 5M/30M
  532. [INFO] ------------------------------------------------------------------------
  533. [ERROR] Unknown lifecycle phase "clean-install". You must specify a valid lifecycle phase or a goal in the format <plugin-prefix>:<goal> or <plugin-group-id>:<plugin-artifact-id>[:<plugin-version>]:<goal>. Available lifecycle phases are: validate, initialize, generate-sources, process-sources, generate-resources, process-resources, compile, process-classes, generate-test-sources, process-test-sources, generate-test-resources, process-test-resources, test-compile, process-test-classes, test, prepare-package, package, pre-integration-test, integration-test, post-integration-test, verify, install, deploy, pre-site, site, post-site, site-deploy, pre-clean, clean, post-clean. -> [Help 1]
  534. [ERROR]
  535. [ERROR] To see the full stack trace of the errors, re-run Maven with the -e switch.
  536. [ERROR] Re-run Maven using the -X switch to enable full debug logging.
  537. [ERROR]
  538. [ERROR] For more information about the errors and possible solutions, please read the following articles:
  539. [ERROR] [Help 1] http://cwiki.apache.org/confluence/display/MAVEN/LifecyclePhaseNotFoundException
  540. user@vm00:~/feladatok/wssample/wssample-frontend$ mvn -Pcargo
  541. [INFO] Scanning for projects...
  542. [WARNING]
  543. [WARNING] Some problems were encountered while building the effective model for hu.zerotohero:wssample-frontend:war:1.0
  544. [WARNING] 'build.plugins.plugin.version' for org.apache.maven.plugins:maven-surefire-plugin is missing. @ line 37, column 21
  545. [WARNING]
  546. [WARNING] It is highly recommended to fix these problems because they threaten the stability of your build.
  547. [WARNING]
  548. [WARNING] For this reason, future Maven versions might no longer support building such malformed projects.
  549. [WARNING]
  550. [INFO] ------------------------------------------------------------------------
  551. [INFO] BUILD FAILURE
  552. [INFO] ------------------------------------------------------------------------
  553. [INFO] Total time: 0.161s
  554. [INFO] Finished at: Fri Dec 09 19:40:25 CET 2016
  555. [INFO] Final Memory: 5M/30M
  556. [INFO] ------------------------------------------------------------------------
  557. [WARNING] The requested profile "cargo" could not be activated because it does not exist.
  558. [ERROR] No goals have been specified for this build. You must specify a valid lifecycle phase or a goal in the format <plugin-prefix>:<goal> or <plugin-group-id>:<plugin-artifact-id>[:<plugin-version>]:<goal>. Available lifecycle phases are: validate, initialize, generate-sources, process-sources, generate-resources, process-resources, compile, process-classes, generate-test-sources, process-test-sources, generate-test-resources, process-test-resources, test-compile, process-test-classes, test, prepare-package, package, pre-integration-test, integration-test, post-integration-test, verify, install, deploy, pre-site, site, post-site, site-deploy, pre-clean, clean, post-clean. -> [Help 1]
  559. [ERROR]
  560. [ERROR] To see the full stack trace of the errors, re-run Maven with the -e switch.
  561. [ERROR] Re-run Maven using the -X switch to enable full debug logging.
  562. [ERROR]
  563. [ERROR] For more information about the errors and possible solutions, please read the following articles:
  564. [ERROR] [Help 1] http://cwiki.apache.org/confluence/display/MAVEN/NoGoalSpecifiedException
  565. user@vm00:~/feladatok/wssample/wssample-frontend$ mvn -Pcargo-redeploy
  566. [INFO] Scanning for projects...
  567. [WARNING]
  568. [WARNING] Some problems were encountered while building the effective model for hu.zerotohero:wssample-frontend:war:1.0
  569. [WARNING] 'build.plugins.plugin.version' for org.apache.maven.plugins:maven-surefire-plugin is missing. @ line 37, column 21
  570. [WARNING]
  571. [WARNING] It is highly recommended to fix these problems because they threaten the stability of your build.
  572. [WARNING]
  573. [WARNING] For this reason, future Maven versions might no longer support building such malformed projects.
  574. [WARNING]
  575. [INFO]
  576. [INFO] ------------------------------------------------------------------------
  577. [INFO] Building wssample-frontend 1.0
  578. [INFO] ------------------------------------------------------------------------
  579. [INFO]
  580. [INFO] --- maven-clean-plugin:2.5:clean (default-clean) @ wssample-frontend ---
  581. [INFO] Deleting /home/user/feladatok/wssample/wssample-frontend/target
  582. [INFO]
  583. [INFO] --- jaxws-maven-plugin:1.12:wsimport (adminservice) @ wssample-frontend ---
  584. [WARNING] Could not transfer metadata org.jvnet.staxex:stax-ex/maven-metadata.xml from/to java.net (http://download.java.net/maven/1/): No connector available to access repository java.net (http://download.java.net/maven/1/) of type legacy using the available factories WagonRepositoryConnectorFactory
  585. [WARNING] Failure to transfer org.jvnet.staxex:stax-ex/maven-metadata.xml from http://download.java.net/maven/1/ was cached in the local repository, resolution will not be reattempted until the update interval of java.net has elapsed or updates are forced. Original error: Could not transfer metadata org.jvnet.staxex:stax-ex/maven-metadata.xml from/to java.net (http://download.java.net/maven/1/): No connector available to access repository java.net (http://download.java.net/maven/1/) of type legacy using the available factories WagonRepositoryConnectorFactory
  586. [INFO] Processing: http://localhost:8080/backend/ws/admin?wsdl
  587. [INFO] jaxws:wsimport args: [-s, /home/user/feladatok/wssample/wssample-frontend/target/generated-sources, -d, /home/user/feladatok/wssample/wssample-frontend/target/classes, -p, hu.zerotohero.wssample.ws.admin, -Xnocompile, http://localhost:8080/backend/ws/admin?wsdl]
  588. parsing WSDL...
  589.  
  590.  
  591. [ERROR] http://localhost:8080/backend/ws/admin?wsdl is unreachable
  592.  
  593.  
  594. Failed to parse the WSDL.
  595. [INFO] ------------------------------------------------------------------------
  596. [INFO] BUILD FAILURE
  597. [INFO] ------------------------------------------------------------------------
  598. [INFO] Total time: 1.636s
  599. [INFO] Finished at: Fri Dec 09 19:40:38 CET 2016
  600. [INFO] Final Memory: 9M/30M
  601. [INFO] ------------------------------------------------------------------------
  602. [ERROR] Failed to execute goal org.codehaus.mojo:jaxws-maven-plugin:1.12:wsimport (adminservice) on project wssample-frontend: Error executing: wsimport [-s, /home/user/feladatok/wssample/wssample-frontend/target/generated-sources, -d, /home/user/feladatok/wssample/wssample-frontend/target/classes, -p, hu.zerotohero.wssample.ws.admin, -Xnocompile, http://localhost:8080/backend/ws/admin?wsdl] -> [Help 1]
  603. [ERROR]
  604. [ERROR] To see the full stack trace of the errors, re-run Maven with the -e switch.
  605. [ERROR] Re-run Maven using the -X switch to enable full debug logging.
  606. [ERROR]
  607. [ERROR] For more information about the errors and possible solutions, please read the following articles:
  608. [ERROR] [Help 1] http://cwiki.apache.org/confluence/display/MAVEN/MojoExecutionException
  609. user@vm00:~/feladatok/wssample/wssample-frontend$ cd-
  610. No command 'cd-' found, did you mean:
  611. Command 'cdb' from package 'tinycdb' (main)
  612. Command 'cdi' from package 'cdo' (universe)
  613. Command 'cdv' from package 'codeville' (universe)
  614. Command 'cdp' from package 'irpas' (multiverse)
  615. Command 'cdo' from package 'cdo' (universe)
  616. Command 'cd5' from package 'cd5' (universe)
  617. Command 'cdw' from package 'cdw' (universe)
  618. cd-: command not found
  619. user@vm00:~/feladatok/wssample/wssample-frontend$ cd -
  620. /home/user/feladatok/wssample
  621. user@vm00:~/feladatok/wssample$ cd wssample-backend/
  622. user@vm00:~/feladatok/wssample/wssample-backend$ mvn -Pcargo-redeploy
  623. [INFO] Scanning for projects...
  624. [WARNING]
  625. [WARNING] Some problems were encountered while building the effective model for hu.zerotohero:wssample-backend:war:1.0
  626. [WARNING] 'build.plugins.plugin.version' for org.apache.maven.plugins:maven-surefire-plugin is missing. @ line 112, column 29
  627. [WARNING]
  628. [WARNING] It is highly recommended to fix these problems because they threaten the stability of your build.
  629. [WARNING]
  630. [WARNING] For this reason, future Maven versions might no longer support building such malformed projects.
  631. [WARNING]
  632. [INFO]
  633. [INFO] ------------------------------------------------------------------------
  634. [INFO] Building wssample-backend 1.0
  635. [INFO] ------------------------------------------------------------------------
  636. [INFO]
  637. [INFO] --- maven-clean-plugin:2.5:clean (default-clean) @ wssample-backend ---
  638. [INFO] Deleting /home/user/feladatok/wssample/wssample-backend/target
  639. [INFO]
  640. [INFO] --- maven-resources-plugin:2.6:resources (default-resources) @ wssample-backend ---
  641. [INFO] Using 'UTF-8' encoding to copy filtered resources.
  642. [INFO] Copying 3 resources
  643. [INFO]
  644. [INFO] --- maven-compiler-plugin:3.1:compile (default-compile) @ wssample-backend ---
  645. [INFO] Changes detected - recompiling the module!
  646. [INFO] Compiling 11 source files to /home/user/feladatok/wssample/wssample-backend/target/classes
  647. [INFO]
  648. [INFO] --- maven-resources-plugin:2.6:testResources (default-testResources) @ wssample-backend ---
  649. [INFO] Using 'UTF-8' encoding to copy filtered resources.
  650. [INFO] Copying 0 resource
  651. [INFO]
  652. [INFO] --- maven-compiler-plugin:3.1:testCompile (default-testCompile) @ wssample-backend ---
  653. [INFO] Changes detected - recompiling the module!
  654. [INFO] Compiling 1 source file to /home/user/feladatok/wssample/wssample-backend/target/test-classes
  655. [INFO]
  656. [INFO] --- maven-surefire-plugin:2.12.4:test (default-test) @ wssample-backend ---
  657. [WARNING] useSystemClassloader setting has no effect when not forking
  658. [INFO]
  659. [INFO] --- maven-war-plugin:2.4:war (default-war) @ wssample-backend ---
  660. [INFO] Packaging webapp
  661. [INFO] Assembling webapp [wssample-backend] in [/home/user/feladatok/wssample/wssample-backend/target/wssample-backend-1.0]
  662. [INFO] Processing war project
  663. [INFO] Copying webapp resources [/home/user/feladatok/wssample/wssample-backend/src/main/webapp]
  664. [INFO] Webapp assembled in [133 msecs]
  665. [INFO] Building war: /home/user/feladatok/wssample/wssample-backend/target/wssample-backend-1.0.war
  666. [INFO]
  667. [INFO] --- maven-install-plugin:2.4:install (default-install) @ wssample-backend ---
  668. [INFO] Installing /home/user/feladatok/wssample/wssample-backend/target/wssample-backend-1.0.war to /home/user/.m2/repository/hu/zerotohero/wssample-backend/1.0/wssample-backend-1.0.war
  669. [INFO] Installing /home/user/feladatok/wssample/wssample-backend/pom.xml to /home/user/.m2/repository/hu/zerotohero/wssample-backend/1.0/wssample-backend-1.0.pom
  670. [INFO]
  671. [INFO] --- cargo-maven2-plugin:1.1.3:redeploy (default-cli) @ wssample-backend ---
  672. [INFO] [mcat7xRemoteDeployer] [/home/user/feladatok/wssample/wssample-backend/target/wssample-backend-1.0.war] is not deployed. Doing a fresh deployment.
  673. [INFO] [mcat7xRemoteDeployer] Deploying [/home/user/feladatok/wssample/wssample-backend/target/wssample-backend-1.0.war]
  674. [INFO] ------------------------------------------------------------------------
  675. [INFO] BUILD SUCCESS
  676. [INFO] ------------------------------------------------------------------------
  677. [INFO] Total time: 10.024s
  678. [INFO] Finished at: Fri Dec 09 19:41:45 CET 2016
  679. [INFO] Final Memory: 19M/45M
  680. [INFO] ------------------------------------------------------------------------
  681. user@vm00:~/feladatok/wssample/wssample-backend$ mvn -Pcargo-redeploy
  682. [INFO] Scanning for projects...
  683. [WARNING]
  684. [WARNING] Some problems were encountered while building the effective model for hu.zerotohero:wssample-backend:war:1.0
  685. [WARNING] 'build.plugins.plugin.version' for org.apache.maven.plugins:maven-surefire-plugin is missing. @ line 112, column 29
  686. [WARNING]
  687. [WARNING] It is highly recommended to fix these problems because they threaten the stability of your build.
  688. [WARNING]
  689. [WARNING] For this reason, future Maven versions might no longer support building such malformed projects.
  690. [WARNING]
  691. [INFO]
  692. [INFO] ------------------------------------------------------------------------
  693. [INFO] Building wssample-backend 1.0
  694. [INFO] ------------------------------------------------------------------------
  695. [INFO]
  696. [INFO] --- maven-clean-plugin:2.5:clean (default-clean) @ wssample-backend ---
  697. [INFO] Deleting /home/user/feladatok/wssample/wssample-backend/target
  698. [INFO]
  699. [INFO] --- maven-resources-plugin:2.6:resources (default-resources) @ wssample-backend ---
  700. [INFO] Using 'UTF-8' encoding to copy filtered resources.
  701. [INFO] Copying 3 resources
  702. [INFO]
  703. [INFO] --- maven-compiler-plugin:3.1:compile (default-compile) @ wssample-backend ---
  704. [INFO] Changes detected - recompiling the module!
  705. [INFO] Compiling 11 source files to /home/user/feladatok/wssample/wssample-backend/target/classes
  706. [INFO]
  707. [INFO] --- maven-resources-plugin:2.6:testResources (default-testResources) @ wssample-backend ---
  708. [INFO] Using 'UTF-8' encoding to copy filtered resources.
  709. [INFO] Copying 0 resource
  710. [INFO]
  711. [INFO] --- maven-compiler-plugin:3.1:testCompile (default-testCompile) @ wssample-backend ---
  712. [INFO] Changes detected - recompiling the module!
  713. [INFO] Compiling 1 source file to /home/user/feladatok/wssample/wssample-backend/target/test-classes
  714. [INFO]
  715. [INFO] --- maven-surefire-plugin:2.12.4:test (default-test) @ wssample-backend ---
  716. [WARNING] useSystemClassloader setting has no effect when not forking
  717. [INFO]
  718. [INFO] --- maven-war-plugin:2.4:war (default-war) @ wssample-backend ---
  719. [INFO] Packaging webapp
  720. [INFO] Assembling webapp [wssample-backend] in [/home/user/feladatok/wssample/wssample-backend/target/wssample-backend-1.0]
  721. [INFO] Processing war project
  722. [INFO] Copying webapp resources [/home/user/feladatok/wssample/wssample-backend/src/main/webapp]
  723. [INFO] Webapp assembled in [133 msecs]
  724. [INFO] Building war: /home/user/feladatok/wssample/wssample-backend/target/wssample-backend-1.0.war
  725. [INFO]
  726. [INFO] --- maven-install-plugin:2.4:install (default-install) @ wssample-backend ---
  727. [INFO] Installing /home/user/feladatok/wssample/wssample-backend/target/wssample-backend-1.0.war to /home/user/.m2/repository/hu/zerotohero/wssample-backend/1.0/wssample-backend-1.0.war
  728. [INFO] Installing /home/user/feladatok/wssample/wssample-backend/pom.xml to /home/user/.m2/repository/hu/zerotohero/wssample-backend/1.0/wssample-backend-1.0.pom
  729. [INFO]
  730. [INFO] --- cargo-maven2-plugin:1.1.3:redeploy (default-cli) @ wssample-backend ---
  731. [INFO] [mcat7xRemoteDeployer] Redeploying [/home/user/feladatok/wssample/wssample-backend/target/wssample-backend-1.0.war]
  732. [INFO] [mcat7xRemoteDeployer] Undeploying [/home/user/feladatok/wssample/wssample-backend/target/wssample-backend-1.0.war]
  733. [INFO] [mcat7xRemoteDeployer] Deploying [/home/user/feladatok/wssample/wssample-backend/target/wssample-backend-1.0.war]
  734. [INFO] ------------------------------------------------------------------------
  735. [INFO] BUILD SUCCESS
  736. [INFO] ------------------------------------------------------------------------
  737. [INFO] Total time: 8.925s
  738. [INFO] Finished at: Fri Dec 09 19:42:51 CET 2016
  739. [INFO] Final Memory: 19M/46M
  740. [INFO] ------------------------------------------------------------------------
  741. user@vm00:~/feladatok/wssample/wssample-backend$ cd -
  742. /home/user/feladatok/wssample
  743. user@vm00:~/feladatok/wssample$ cd wssample-frontend/
  744. user@vm00:~/feladatok/wssample/wssample-frontend$ mvn -Pcargo-redeploy
  745. [INFO] Scanning for projects...
  746. [WARNING]
  747. [WARNING] Some problems were encountered while building the effective model for hu.zerotohero:wssample-frontend:war:1.0
  748. [WARNING] 'build.plugins.plugin.version' for org.apache.maven.plugins:maven-surefire-plugin is missing. @ line 37, column 21
  749. [WARNING]
  750. [WARNING] It is highly recommended to fix these problems because they threaten the stability of your build.
  751. [WARNING]
  752. [WARNING] For this reason, future Maven versions might no longer support building such malformed projects.
  753. [WARNING]
  754. [INFO]
  755. [INFO] ------------------------------------------------------------------------
  756. [INFO] Building wssample-frontend 1.0
  757. [INFO] ------------------------------------------------------------------------
  758. [INFO]
  759. [INFO] --- maven-clean-plugin:2.5:clean (default-clean) @ wssample-frontend ---
  760. [INFO] Deleting /home/user/feladatok/wssample/wssample-frontend/target
  761. [INFO]
  762. [INFO] --- jaxws-maven-plugin:1.12:wsimport (adminservice) @ wssample-frontend ---
  763. [WARNING] Could not transfer metadata org.jvnet.staxex:stax-ex/maven-metadata.xml from/to java.net (http://download.java.net/maven/1/): No connector available to access repository java.net (http://download.java.net/maven/1/) of type legacy using the available factories WagonRepositoryConnectorFactory
  764. [WARNING] Failure to transfer org.jvnet.staxex:stax-ex/maven-metadata.xml from http://download.java.net/maven/1/ was cached in the local repository, resolution will not be reattempted until the update interval of java.net has elapsed or updates are forced. Original error: Could not transfer metadata org.jvnet.staxex:stax-ex/maven-metadata.xml from/to java.net (http://download.java.net/maven/1/): No connector available to access repository java.net (http://download.java.net/maven/1/) of type legacy using the available factories WagonRepositoryConnectorFactory
  765. [INFO] Processing: http://localhost:8080/backend/ws/admin?wsdl
  766. [INFO] jaxws:wsimport args: [-s, /home/user/feladatok/wssample/wssample-frontend/target/generated-sources, -d, /home/user/feladatok/wssample/wssample-frontend/target/classes, -p, hu.zerotohero.wssample.ws.admin, -Xnocompile, http://localhost:8080/backend/ws/admin?wsdl]
  767. parsing WSDL...
  768.  
  769.  
  770. generating code...
  771.  
  772. [INFO]
  773. [INFO] --- jaxws-maven-plugin:1.12:wsimport (admineditorservice) @ wssample-frontend ---
  774. [INFO] Processing: http://localhost:8080/backend/ws/admineditor?wsdl
  775. [INFO] jaxws:wsimport args: [-s, /home/user/feladatok/wssample/wssample-frontend/target/generated-sources, -d, /home/user/feladatok/wssample/wssample-frontend/target/classes, -p, hu.zerotohero.wssample.ws.admin, -Xnocompile, http://localhost:8080/backend/ws/admineditor?wsdl]
  776. parsing WSDL...
  777.  
  778.  
  779. generating code...
  780.  
  781. [INFO]
  782. [INFO] --- maven-resources-plugin:2.6:resources (default-resources) @ wssample-frontend ---
  783. [INFO] Using 'UTF-8' encoding to copy filtered resources.
  784. [INFO] Copying 1 resource
  785. [INFO]
  786. [INFO] --- maven-compiler-plugin:3.1:compile (default-compile) @ wssample-frontend ---
  787. [INFO] Changes detected - recompiling the module!
  788. [INFO] Compiling 38 source files to /home/user/feladatok/wssample/wssample-frontend/target/classes
  789. [INFO]
  790. [INFO] --- maven-resources-plugin:2.6:testResources (default-testResources) @ wssample-frontend ---
  791. [INFO] Using 'UTF-8' encoding to copy filtered resources.
  792. [INFO] Copying 0 resource
  793. [INFO]
  794. [INFO] --- maven-compiler-plugin:3.1:testCompile (default-testCompile) @ wssample-frontend ---
  795. [INFO] Changes detected - recompiling the module!
  796. [INFO] Compiling 1 source file to /home/user/feladatok/wssample/wssample-frontend/target/test-classes
  797. [INFO]
  798. [INFO] --- maven-surefire-plugin:2.12.4:test (default-test) @ wssample-frontend ---
  799. [WARNING] useSystemClassloader setting has no effect when not forking
  800. [INFO]
  801. [INFO] --- maven-war-plugin:2.4:war (default-war) @ wssample-frontend ---
  802. [INFO] Packaging webapp
  803. [INFO] Assembling webapp [wssample-frontend] in [/home/user/feladatok/wssample/wssample-frontend/target/wssample-frontend-1.0]
  804. [INFO] Processing war project
  805. [INFO] Copying webapp resources [/home/user/feladatok/wssample/wssample-frontend/src/main/webapp]
  806. [INFO] Webapp assembled in [221 msecs]
  807. [INFO] Building war: /home/user/feladatok/wssample/wssample-frontend/target/wssample-frontend-1.0.war
  808. [INFO]
  809. [INFO] --- maven-install-plugin:2.4:install (default-install) @ wssample-frontend ---
  810. [INFO] Installing /home/user/feladatok/wssample/wssample-frontend/target/wssample-frontend-1.0.war to /home/user/.m2/repository/hu/zerotohero/wssample-frontend/1.0/wssample-frontend-1.0.war
  811. [INFO] Installing /home/user/feladatok/wssample/wssample-frontend/pom.xml to /home/user/.m2/repository/hu/zerotohero/wssample-frontend/1.0/wssample-frontend-1.0.pom
  812. [INFO]
  813. [INFO] --- cargo-maven2-plugin:1.1.3:redeploy (default-cli) @ wssample-frontend ---
  814. [INFO] [mcat7xRemoteDeployer] [/home/user/feladatok/wssample/wssample-frontend/target/wssample-frontend-1.0.war] is not deployed. Doing a fresh deployment.
  815. [INFO] [mcat7xRemoteDeployer] Deploying [/home/user/feladatok/wssample/wssample-frontend/target/wssample-frontend-1.0.war]
  816. [INFO] ------------------------------------------------------------------------
  817. [INFO] BUILD SUCCESS
  818. [INFO] ------------------------------------------------------------------------
  819. [INFO] Total time: 11.646s
  820. [INFO] Finished at: Fri Dec 09 19:43:55 CET 2016
  821. [INFO] Final Memory: 26M/67M
  822. [INFO] ------------------------------------------------------------------------
  823. user@vm00:~/feladatok/wssample/wssample-frontend$ [debug] execute contextualize
  824. [debug] execute contextualize
  825. [debug] execute contextualize
  826. [debug] execute contextualize
  827. [debug] execute contextualize
  828. [debug] execute contextualize
  829. [debug] execute contextualize
  830. [debug] execute contextualize
  831. [debug] execute contextualize
  832. [debug] execute contextualize
  833. [debug] execute contextualize
  834. [debug] execute contextualize
  835. [debug] execute contextualize
  836. [debug] execute contextualize
  837.  
  838. [1]- Done /home/user/eclipse/eclipse (wd: ~)
  839. (wd now: ~/feladatok/wssample/wssample-frontend)
  840. user@vm00:~/feladatok/wssample/wssample-frontend$ eclipse
  841. [debug] execute contextualize
  842. [debug] execute contextualize
  843. [debug] execute contextualize
  844. [debug] execute contextualize
  845. [debug] execute contextualize
  846. [debug] execute contextualize
  847. [debug] execute contextualize
  848. [debug] execute contextualize
  849. [debug] execute contextualize
  850. [debug] execute contextualize
  851. [debug] execute contextualize
  852. [debug] execute contextualize
  853. ^A
RAW Paste Data