SHARE
TWEET

Untitled

a guest Mar 7th, 2018 36 Never
Not a member of Pastebin yet? Sign Up, it unlocks many cool features!
  1. Amans-MacBook-Pro:build-mariadb amanjain$ make
  2. [ 75%] Built target INFO_SRC
  3. [ 75%] Built target INFO_BIN
  4. [ 75%] Built target abi_check
  5. [ 75%] Built target pcre
  6. [ 75%] Built target pcreposix
  7. [ 75%] Built target pcretest
  8. [ 75%] Built target pcregrep
  9. [ 75%] Built target mytap
  10. [ 75%] Built target strings
  11. [ 75%] Built target gen_dtrace_header
  12. [ 75%] Built target mysys_ssl
  13. [ 75%] Built target mysys
  14. [ 75%] Built target dbug
  15. [ 75%] Built target strings-t
  16. [ 75%] Built target no_plan-t
  17. [ 75%] Built target skip_all-t
  18. [ 75%] Built target simple-t
  19. [ 75%] Built target todo-t
  20. [ 75%] Built target skip-t
  21. [ 75%] Built target ma_dyncol-t
  22. [ 75%] Built target aes-t
  23. [ 75%] Built target dynstring-t
  24. [ 75%] Built target my_getopt-t
  25. [ 75%] Built target my_malloc-t
  26. [ 75%] Built target bitmap-t
  27. [ 75%] Built target lf-t
  28. [ 75%] Built target my_atomic-t
  29. [ 75%] Built target base64-t
  30. [ 75%] Built target my_vsnprintf-t
  31. [ 75%] Built target my_rdtsc-t
  32. [ 75%] Built target my_decimal-t
  33. [ 75%] Built target json_lib-t
  34. [ 75%] Built target wsrep
  35. [ 75%] Built target comp_err
  36. [ 75%] Built target GenError
  37. [ 75%] Built target csv
  38. [ 75%] Built target heap
  39. [ 75%] Built target innobase
  40. [ 75%] Built target myisam
  41. [ 75%] Built target aria
  42. [ 75%] Built target myisammrg
  43. [ 75%] Built target gen_lex_token
  44. [ 75%] Built target gen_lex_hash
  45. [ 75%] Built target GenServerSource
  46. [ 75%] Built target perfschema
  47. [ 75%] Built target sequence
  48. [ 75%] Built target feedback
  49. [ 75%] Built target user_variables
  50. [ 75%] Built target userstat
  51. [ 75%] Built target vio
  52. [ 75%] Built target partition
  53. [ 75%] Built target sql_sequence
  54. Scanning dependencies of target sql
  55. [ 75%] Building CXX object sql/CMakeFiles/sql.dir/item.cc.o
  56. [ 75%] Linking CXX static library libsql.a
  57. [ 75%] Built target sql
  58. [ 75%] Linking CXX executable explain_filename-t
  59. ld: warning: direct access in function 'ha_sequence::write_row(unsigned char*)' from file '../../sql/libsql_sequence.a(ha_sequence.cc.o)' to global weak symbol 'Write_rows_log_event::binlog_row_logging_function(THD*, TABLE*, bool, unsigned char const*, unsigned char const*)' from file '../../sql/libsql.a(handler.cc.o)' means the weak symbol cannot be overridden at runtime. This was likely caused by different translation units being compiled with different visibility settings.
  60. [ 75%] Built target explain_filename-t
  61. [ 75%] Built target mf_iocache-t
  62. [ 75%] Built target my_apc-t
  63. [ 75%] Built target mariadb_obj
  64. [ 75%] Built target mariadbclient
  65. [ 75%] Built target SYM_libmysqlclient.a
  66. [ 75%] Built target libmariadb
  67. [ 75%] Built target SYM_libmysqlclient.dylib
  68. [ 75%] Built target SYM_libmysqlclient_r.dylib
  69. [ 75%] Built target SYM_libmysqlclient_r.a
  70. [ 75%] Built target auth_gssapi_client
  71. [ 75%] Built target dialog
  72. [ 75%] Built target mysql_clear_password
  73. [ 75%] Built target sha256_password
  74. [ 75%] Built target mariadb_config
  75. [ 75%] Built target cctap
  76. [ 75%] Built target ma_getopt
  77. [ 75%] Built target t_conc173
  78. [ 75%] Built target t_aurora
  79. [ 75%] Built target async
  80. [ 75%] Built target thread
  81. [ 75%] Built target bulk1
  82. [ 75%] Built target misc
  83. [ 75%] Built target cursor
  84. [ 75%] Built target connection
  85. [ 75%] Built target ps_bugs
  86. [ 75%] Built target result
  87. [ 75%] Built target dyncol
  88. [ 75%] Built target ps_new
  89. [ 75%] Built target errors
  90. [ 75%] Built target sp
  91. [ 75%] Built target logs
  92. [ 75%] Built target fetch
  93. [ 75%] Built target view
  94. [ 75%] Built target features-10_2
  95. [ 75%] Built target basic-t
  96. [ 75%] Built target sqlite3
  97. [ 75%] Built target performance
  98. [ 75%] Built target ps
  99. [ 75%] Built target charset
  100. [ 75%] Linking CXX executable mysqld
  101. ld: warning: direct access in function 'ha_sequence::write_row(unsigned char*)' from file 'libsql_sequence.a(ha_sequence.cc.o)' to global weak symbol 'Write_rows_log_event::binlog_row_logging_function(THD*, TABLE*, bool, unsigned char const*, unsigned char const*)' from file 'libsql.a(handler.cc.o)' means the weak symbol cannot be overridden at runtime. This was likely caused by different translation units being compiled with different visibility settings.
  102. [ 75%] Built target mysqld
  103. [ 75%] Built target mysqlservices
  104. [ 75%] Linking CXX shared module ha_archive.so
  105. [ 75%] Built target archive
  106. [ 75%] Linking CXX shared module ha_blackhole.so
  107. [ 75%] Built target blackhole
  108. [ 75%] Built target JdbcInterface
  109. [ 75%] Linking CXX shared module ha_connect.so
  110. [ 75%] Built target connect
  111. [ 75%] Linking CXX shared module ha_example.so
  112. [ 75%] Built target example
  113. [ 75%] Linking CXX shared module ha_federated.so
  114. [ 75%] Built target federated
  115. [ 75%] Linking CXX shared module ha_federatedx.so
  116. [ 75%] Built target federatedx
  117. [ 75%] Built target hp_test2
  118. [ 75%] Built target hp_test1
  119. [ 75%] Built target crc
  120. [ 75%] Built target mbstream
  121. [ 75%] Linking CXX executable mariabackup
  122. ld: warning: direct access in function 'ha_sequence::write_row(unsigned char*)' from file '../../sql/libsql_sequence.a(ha_sequence.cc.o)' to global weak symbol 'Write_rows_log_event::binlog_row_logging_function(THD*, TABLE*, bool, unsigned char const*, unsigned char const*)' from file '../../sql/libsql.a(handler.cc.o)' means the weak symbol cannot be overridden at runtime. This was likely caused by different translation units being compiled with different visibility settings.
  123. [ 75%] Built target mariabackup
  124. [ 75%] Built target ma_rt_test
  125. [ 75%] Built target ma_sp_test
  126. [ 75%] Built target ma_test2
  127. [ 75%] Built target ma_test3
  128. [ 75%] Built target aria_pack
  129. [ 75%] Built target ma_test1
  130. [ 75%] Built target aria_dump_log
  131. [ 75%] Built target aria_ftdump
  132. [ 75%] Built target aria_read_log
  133. [ 75%] Built target aria_chk
  134. [ 75%] Built target ma_pagecache_rwconsist2_1k-t
  135. [ 75%] Built target ma_pagecache_rwconsist_1k-t
  136. [ 75%] Built target ma_test_loghandler_noflush-t
  137. [ 75%] Built target ma_test_loghandler_pagecache-t
  138. [ 75%] Built target ma_pagecache_consist_1kRD-t
  139. [ 75%] Built target ma_pagecache_consist_64kRD-t
  140. [ 75%] Built target ma_pagecache_consist_1k-t
  141. [ 75%] Built target ma_pagecache_single_8k-t
  142. [ 75%] Built target ma_pagecache_single_64k-t
  143. [ 75%] Built target ma_pagecache_single_1k-t
  144. [ 75%] Built target ma_test_loghandler_first_lsn-t
  145. [ 75%] Built target ma_test_loghandler_purge-t
  146. [ 75%] Built target ma_pagecache_consist_64kWR-t
  147. [ 75%] Built target ma_pagecache_consist_64kHC-t
  148. [ 75%] Built target ma_test_loghandler_max_lsn-t
  149. [ 75%] Built target ma_test_loghandler_multithread-t
  150. [ 75%] Built target ma_pagecache_consist_1kHC-t
  151. [ 75%] Built target ma_test_loghandler_long-t
  152. [ 75%] Built target ma_test_loghandler_readonly-t
  153. [ 75%] Built target ma_test_loghandler_multigroup-t
  154. [ 75%] Built target ma_pagecache_consist_1kWR-t
  155. [ 75%] Built target ma_test_loghandler_nologs-t
  156. [ 75%] Built target trnman-t
  157. [ 75%] Built target ma_test_loghandler-t
  158. [ 75%] Built target ma_pagecache_consist_64k-t
  159. [ 75%] Built target ma_control_file-t
  160. [ 75%] Built target libgroonga
  161. [ 75%] Built target mysql_normalizer
  162. [ 75%] Linking CXX shared module ha_mroonga.so
  163. [ 75%] Built target mroonga
  164. [ 75%] Built target suggest
  165. [ 75%] Built target tsv_query_expander
  166. [ 75%] Built target stop_word_token_filter
  167. [ 75%] Built target number_functions
  168. [ 75%] Built target index_column_functions
  169. [ 75%] Built target string_functions
  170. [ 75%] Built target time_functions
  171. [ 75%] Built target math_functions
  172. [ 75%] Built target vector_functions
  173. [ 75%] Built target sp_test
  174. [ 75%] Built target mi_test3
  175. [ 75%] Built target myisamlog
  176. [ 75%] Built target rt_test
  177. [ 75%] Built target myisampack
  178. [ 75%] Built target mi_test1
  179. [ 75%] Built target myisamchk
  180. [ 75%] Built target mi_test2
  181. [ 75%] Built target myisam_ftdump
  182. [ 75%] Built target pfs_server_stubs
  183. [ 75%] Built target pfs_misc-t
  184. [ 75%] Built target pfs_timer-t
  185. [ 75%] Built target pfs_instr-oom-t
  186. [ 75%] Built target pfs_host-oom-t
  187. [ 75%] Built target pfs-t
  188. [ 75%] Built target pfs_user-oom-t
  189. [ 75%] Built target pfs_account-oom-t
  190. [ 75%] Built target pfs_instr_class-oom-t
  191. [ 75%] Built target pfs_instr-t
  192. [ 75%] Built target pfs_instr_class-t
  193. [ 75%] Built target rocksdb_tools
  194. [ 75%] Built target rocksdblib
  195. [ 75%] Built target rocksdb_aux_lib
  196. [ 75%] Built target sst_dump
  197. [ 75%] Built target mysql_ldb
  198. [ 75%] Linking CXX shared module ha_rocksdb.so
  199. [ 75%] Built target rocksdb
  200. [ 75%] Linking CXX shared module ha_sphinx.so
  201. [ 75%] Built target sphinx
  202. [ 75%] Linking CXX shared module ha_spider.so
  203. [ 75%] Built target spider
  204. [ 75%] Linking CXX shared module ha_test_sql_discovery.so
  205. [ 75%] Built target test_sql_discovery
  206. [ 75%] Built target tokuportability_static_conv
  207. [ 75%] Built target tokuportability_static
  208. [ 75%] Built target logformat
  209. [ 75%] Built target generate_log_code
  210. [ 75%] Built target make_tdb
  211. [ 75%] Built target install_tdb_h
  212. [ 75%] Built target tokudb_static_conv
  213. [ 75%] Performing install step for 'build_lzma'
  214. Making install in api
  215. /bin/sh: /Users/amanjain/Documents/gsoc/maria/build-mariadb/storage/tokudb/PerconaFT/xz/src/build_lzma/build-aux/install-sh: Permission denied
  216. make[5]: *** [install-nobase_includeHEADERS] Error 126
  217. make[4]: *** [install-am] Error 2
  218. make[3]: *** [install-recursive] Error 1
  219. make[2]: *** [storage/tokudb/PerconaFT/xz/src/build_lzma-stamp/build_lzma-install] Error 2
  220. make[1]: *** [storage/tokudb/PerconaFT/CMakeFiles/build_lzma.dir/all] Error 2
  221. make: *** [all] Error 2
RAW Paste Data
We use cookies for various purposes including analytics. By continuing to use Pastebin, you agree to our use of cookies as described in the Cookies Policy. OK, I Understand
 
Top