Guest User

Untitled

a guest
Jan 25th, 2021
36
Never
Not a member of Pastebin yet? Sign Up, it unlocks many cool features!
  1. Build started at 2021-01-25T20:40:22.137048
  2. Main binary: /usr/bin/python3
  3. Build Options: -Ddocdir=/usr/local/share/doc -Dqemu_firmwarepath=/usr/local/share/qemu-firmware -Dqemu_suffix=qemu -Doptimization=2 -Ddebug=true -Dwerror=true -Dstrip=true -Db_pie=true -Db_staticpic=true -Db_coverage=false -Db_lto=false -Dcfi=false -Dcfi_debug=false -Dmalloc=system -Dmalloc_trim=auto -Dsparse=auto -Dkvm=auto -Dhax=auto -Dwhpx=auto -Dhvf=auto -Dxen=disabled -Dxen_pci_passthrough=auto -Dtcg=enabled -Dcocoa=auto -Dgtk=auto -Dmpath=auto -Dsdl=auto -Dsdl_image=auto -Dvnc=enabled -Dvnc_sasl=auto -Dvnc_jpeg=auto -Dvnc_png=auto -Dgettext=auto -Dxkbcommon=auto -Du2f=auto -Dvirtiofsd=auto -Dcapstone=auto -Dslirp=auto -Dfdt=auto -Dbrlapi=auto -Dcurl=auto -Dglusterfs=auto -Dbzip2=auto -Dlibiscsi=auto -Dlibnfs=auto -Diconv=auto -Dcurses=auto -Dlibudev=auto -Drbd=enabled -Dlzo=auto -Dsnappy=auto -Dlzfse=auto -Dzstd=auto -Dseccomp=auto -Dvirtfs=auto -Dcap_ng=auto -Dattr=auto -Ddefault_devices=true -Ddocs=auto -Dsphinx_build= -Dinstall_blobs=true -Dvhost_user_blk_server=auto -Dfuse=auto -Dfuse_lseek=auto -Dguest_agent_msi=auto -Dprefix=/usr/local -Dbindir=/usr/local/bin -Ddatadir=/usr/local/share -Dincludedir=/usr/local/include -Dlibdir=/usr/local/lib -Dlibexecdir=/usr/local/libexec -Dlocaledir=/usr/local/share/locale -Dlocalstatedir=/usr/local/var -Dmandir=/usr/local/share/man -Dsysconfdir=/usr/local/etc '--native-file config-meson.cross'
  4. Python system: Linux
  5. The Meson build system
  6. Version: 0.55.3
  7. Source dir: /home/lieven/git/qemu
  8. Build dir: /home/lieven/git/qemu/build
  9. Build type: native build
  10. Running command: /usr/bin/head /home/lieven/git/qemu/VERSION
  11. --- stdout ---
  12. 5.2.50
  13.  
  14. --- stderr ---
  15.  
  16.  
  17. None of 'PKG_CONFIG_PATH' are defined in the environment, not changing global flags.
  18. None of 'PKG_CONFIG_PATH' are defined in the environment, not changing global flags.
  19. Project name: qemu
  20. Project version: 5.2.50
  21. None of 'CFLAGS' are defined in the environment, not changing global flags.
  22. None of 'LDFLAGS' are defined in the environment, not changing global flags.
  23. None of 'CPPFLAGS' are defined in the environment, not changing global flags.
  24. None of 'CC_LD' are defined in the environment, not changing global flags.
  25. Sanity testing C compiler: cc
  26. Is cross compiler: False.
  27. None of 'CC_LD' are defined in the environment, not changing global flags.
  28. Sanity check compiler command line: cc /home/lieven/git/qemu/build/meson-private/sanitycheckc.c -o /home/lieven/git/qemu/build/meson-private/sanitycheckc.exe -pipe -D_FILE_OFFSET_BITS=64
  29. Sanity check compile stdout:
  30.  
  31. -----
  32. Sanity check compile stderr:
  33.  
  34. -----
  35. Running test binary command: /home/lieven/git/qemu/build/meson-private/sanitycheckc.exe
  36. C compiler for the build machine: cc (gcc 7.5.0 "cc (Ubuntu 7.5.0-3ubuntu1~18.04) 7.5.0")
  37. C linker for the build machine: cc ld.bfd 2.30
  38. None of 'CFLAGS' are defined in the environment, not changing global flags.
  39. None of 'LDFLAGS' are defined in the environment, not changing global flags.
  40. None of 'CPPFLAGS' are defined in the environment, not changing global flags.
  41. None of 'CC_LD' are defined in the environment, not changing global flags.
  42. Sanity testing C compiler: cc
  43. Is cross compiler: False.
  44. None of 'CC_LD' are defined in the environment, not changing global flags.
  45. Sanity check compiler command line: cc /home/lieven/git/qemu/build/meson-private/sanitycheckc.c -o /home/lieven/git/qemu/build/meson-private/sanitycheckc.exe -pipe -D_FILE_OFFSET_BITS=64
  46. Sanity check compile stdout:
  47.  
  48. -----
  49. Sanity check compile stderr:
  50.  
  51. -----
  52. Running test binary command: /home/lieven/git/qemu/build/meson-private/sanitycheckc.exe
  53. C compiler for the host machine: cc (gcc 7.5.0 "cc (Ubuntu 7.5.0-3ubuntu1~18.04) 7.5.0")
  54. C linker for the host machine: cc ld.bfd 2.30
  55. Build machine cpu family: x86_64
  56. Build machine cpu: x86_64
  57. Host machine cpu family: x86_64
  58. Host machine cpu: x86_64
  59. Target machine cpu family: x86_64
  60. Target machine cpu: x86_64
  61. ../meson.build:10: WARNING: Module unstable-keyval has no backwards or forwards compatibility and might not exist in future releases.
  62. Program sh found: YES
  63. Program python3 found: YES (/usr/bin/python3)
  64. Program bzip2 found: YES
  65. None of 'CXXFLAGS' are defined in the environment, not changing global flags.
  66. None of 'LDFLAGS' are defined in the environment, not changing global flags.
  67. None of 'CPPFLAGS' are defined in the environment, not changing global flags.
  68. None of 'CXX_LD' are defined in the environment, not changing global flags.
  69. Sanity testing C++ compiler: c++
  70. Is cross compiler: False.
  71. None of 'CXX_LD' are defined in the environment, not changing global flags.
  72. Sanity check compiler command line: c++ /home/lieven/git/qemu/build/meson-private/sanitycheckcpp.cc -o /home/lieven/git/qemu/build/meson-private/sanitycheckcpp.exe -pipe -D_FILE_OFFSET_BITS=64
  73. Sanity check compile stdout:
  74.  
  75. -----
  76. Sanity check compile stderr:
  77.  
  78. -----
  79. Running test binary command: /home/lieven/git/qemu/build/meson-private/sanitycheckcpp.exe
  80. C++ compiler for the host machine: c++ (gcc 7.5.0 "c++ (Ubuntu 7.5.0-3ubuntu1~18.04) 7.5.0")
  81. C++ linker for the host machine: c++ ld.bfd 2.30
  82. Program cgcc found: NO
  83. None of 'CC_LD' are defined in the environment, not changing global flags.
  84. Running compile:
  85. Working directory: /home/lieven/git/qemu/build/meson-private/tmp4gbytkba
  86. Command line: cc /home/lieven/git/qemu/build/meson-private/tmp4gbytkba/testfile.c -o /home/lieven/git/qemu/build/meson-private/tmp4gbytkba/output.exe -pipe -D_FILE_OFFSET_BITS=64 -O0 -Wl,--start-group -lm -Wl,--end-group -Wl,--allow-shlib-undefined
  87.  
  88. Code:
  89. int main(void) { return 0; }
  90.  
  91. Compiler stdout:
  92.  
  93. Compiler stderr:
  94.  
  95. Library m found: YES
  96. None of 'CC_LD' are defined in the environment, not changing global flags.
  97. Running compile:
  98. Working directory: /home/lieven/git/qemu/build/meson-private/tmpck2i2w6u
  99. Command line: cc /home/lieven/git/qemu/build/meson-private/tmpck2i2w6u/testfile.c -o /home/lieven/git/qemu/build/meson-private/tmpck2i2w6u/output.exe -pipe -D_FILE_OFFSET_BITS=64 -O0 -Wl,--start-group -lutil -Wl,--end-group -Wl,--allow-shlib-undefined
  100.  
  101. Code:
  102. int main(void) { return 0; }
  103.  
  104. Compiler stdout:
  105.  
  106. Compiler stderr:
  107.  
  108. Library util found: YES
  109. Run-time dependency appleframeworks found: NO (tried framework)
  110. Pkg-config binary for MachineChoice.HOST is not cached.
  111. Pkg-config binary for MachineChoice.HOST specified from cross file, native file, or env var as ['pkg-config']
  112. Found pkg-config: /usr/bin/pkg-config (0.29.1)
  113. Determining dependency 'pixman-1' with pkg-config executable '/usr/bin/pkg-config'
  114. PKG_CONFIG_PATH:
  115. Called `/usr/bin/pkg-config --modversion pixman-1` -> 0
  116. 0.34.0
  117. PKG_CONFIG_PATH:
  118. Called `/usr/bin/pkg-config --cflags pixman-1` -> 0
  119. -I/usr/include/pixman-1
  120. PKG_CONFIG_PATH:
  121. Called `/usr/bin/pkg-config pixman-1 --libs` -> 0
  122. -L/usr/lib/x86_64-linux-gnu -lpixman-1
  123. PKG_CONFIG_PATH:
  124. Called `/usr/bin/pkg-config pixman-1 --libs` -> 0
  125. -lpixman-1
  126. None of 'PKG_CONFIG_PATH' are defined in the environment, not changing global flags.
  127. None of 'CXX_LD' are defined in the environment, not changing global flags.
  128. Running compile:
  129. Working directory: /home/lieven/git/qemu/build/meson-private/tmpuzfmtb4d
  130. Command line: c++ /home/lieven/git/qemu/build/meson-private/tmpuzfmtb4d/testfile.cpp -o /home/lieven/git/qemu/build/meson-private/tmpuzfmtb4d/output.exe -pipe -D_FILE_OFFSET_BITS=64 -O0 -fpermissive
  131.  
  132. Code:
  133. #include<stdio.h>
  134.  
  135. int main(void) {
  136. printf("%ld\n", (long)(sizeof(void *)));
  137. return 0;
  138. };
  139. Compiler stdout:
  140.  
  141. Compiler stderr:
  142.  
  143. Program stdout:
  144.  
  145. 8
  146.  
  147. Program stderr:
  148.  
  149.  
  150. Running compile:
  151. Working directory: /home/lieven/git/qemu/build/meson-private/tmp7of5y9g7
  152. Command line: c++ /home/lieven/git/qemu/build/meson-private/tmp7of5y9g7/testfile.cpp -o /home/lieven/git/qemu/build/meson-private/tmp7of5y9g7/output.obj -pipe -c -D_FILE_OFFSET_BITS=64 -O0 -fpermissive --print-search-dirs
  153.  
  154. Code:
  155.  
  156. Compiler stdout:
  157. install: /usr/lib/gcc/x86_64-linux-gnu/7/
  158. programs: =/usr/lib/gcc/x86_64-linux-gnu/7/:/usr/lib/gcc/x86_64-linux-gnu/7/:/usr/lib/gcc/x86_64-linux-gnu/:/usr/lib/gcc/x86_64-linux-gnu/7/:/usr/lib/gcc/x86_64-linux-gnu/:/usr/lib/gcc/x86_64-linux-gnu/7/../../../../x86_64-linux-gnu/bin/x86_64-linux-gnu/7/:/usr/lib/gcc/x86_64-linux-gnu/7/../../../../x86_64-linux-gnu/bin/x86_64-linux-gnu/:/usr/lib/gcc/x86_64-linux-gnu/7/../../../../x86_64-linux-gnu/bin/
  159. libraries: =/usr/lib/gcc/x86_64-linux-gnu/7/:/usr/lib/gcc/x86_64-linux-gnu/7/../../../../x86_64-linux-gnu/lib/x86_64-linux-gnu/7/:/usr/lib/gcc/x86_64-linux-gnu/7/../../../../x86_64-linux-gnu/lib/x86_64-linux-gnu/:/usr/lib/gcc/x86_64-linux-gnu/7/../../../../x86_64-linux-gnu/lib/../lib/:/usr/lib/gcc/x86_64-linux-gnu/7/../../../x86_64-linux-gnu/7/:/usr/lib/gcc/x86_64-linux-gnu/7/../../../x86_64-linux-gnu/:/usr/lib/gcc/x86_64-linux-gnu/7/../../../../lib/:/lib/x86_64-linux-gnu/7/:/lib/x86_64-linux-gnu/:/lib/../lib/:/usr/lib/x86_64-linux-gnu/7/:/usr/lib/x86_64-linux-gnu/:/usr/lib/../lib/:/usr/lib/gcc/x86_64-linux-gnu/7/../../../../x86_64-linux-gnu/lib/:/usr/lib/gcc/x86_64-linux-gnu/7/../../../:/lib/:/usr/lib/
  160.  
  161. Compiler stderr:
  162.  
  163. Run-time dependency pixman-1 found: YES 0.34.0
  164. None of 'CC_LD' are defined in the environment, not changing global flags.
  165. Running compile:
  166. Working directory: /home/lieven/git/qemu/build/meson-private/tmpodg8wwoe
  167. Command line: cc /home/lieven/git/qemu/build/meson-private/tmpodg8wwoe/testfile.c -o /home/lieven/git/qemu/build/meson-private/tmpodg8wwoe/output.exe -pipe -D_FILE_OFFSET_BITS=64 -O0 -Wl,--start-group -laio -Wl,--end-group -Wl,--allow-shlib-undefined
  168.  
  169. Code:
  170. int main(void) { return 0; }
  171.  
  172. Compiler stdout:
  173.  
  174. Compiler stderr:
  175. /usr/bin/ld: cannot find -laio
  176. collect2: error: ld returned 1 exit status
  177.  
  178. None of 'CC_LD' are defined in the environment, not changing global flags.
  179. Running compile:
  180. Working directory: /home/lieven/git/qemu/build/meson-private/tmpn4uj3ev8
  181. Command line: cc /home/lieven/git/qemu/build/meson-private/tmpn4uj3ev8/testfile.c -o /home/lieven/git/qemu/build/meson-private/tmpn4uj3ev8/output.exe -pipe -D_FILE_OFFSET_BITS=64 -O0
  182.  
  183. Code:
  184. #include<stdio.h>
  185.  
  186. int main(void) {
  187. printf("%ld\n", (long)(sizeof(void *)));
  188. return 0;
  189. };
  190. Compiler stdout:
  191.  
  192. Compiler stderr:
  193.  
  194. Program stdout:
  195.  
  196. 8
  197.  
  198. Program stderr:
  199.  
  200.  
  201. Running compile:
  202. Working directory: /home/lieven/git/qemu/build/meson-private/tmptwan07w6
  203. Command line: cc /home/lieven/git/qemu/build/meson-private/tmptwan07w6/testfile.c -o /home/lieven/git/qemu/build/meson-private/tmptwan07w6/output.obj -pipe -c -D_FILE_OFFSET_BITS=64 -O0 --print-search-dirs
  204.  
  205. Code:
  206.  
  207. Compiler stdout:
  208. install: /usr/lib/gcc/x86_64-linux-gnu/7/
  209. programs: =/usr/lib/gcc/x86_64-linux-gnu/7/:/usr/lib/gcc/x86_64-linux-gnu/7/:/usr/lib/gcc/x86_64-linux-gnu/:/usr/lib/gcc/x86_64-linux-gnu/7/:/usr/lib/gcc/x86_64-linux-gnu/:/usr/lib/gcc/x86_64-linux-gnu/7/../../../../x86_64-linux-gnu/bin/x86_64-linux-gnu/7/:/usr/lib/gcc/x86_64-linux-gnu/7/../../../../x86_64-linux-gnu/bin/x86_64-linux-gnu/:/usr/lib/gcc/x86_64-linux-gnu/7/../../../../x86_64-linux-gnu/bin/
  210. libraries: =/usr/lib/gcc/x86_64-linux-gnu/7/:/usr/lib/gcc/x86_64-linux-gnu/7/../../../../x86_64-linux-gnu/lib/x86_64-linux-gnu/7/:/usr/lib/gcc/x86_64-linux-gnu/7/../../../../x86_64-linux-gnu/lib/x86_64-linux-gnu/:/usr/lib/gcc/x86_64-linux-gnu/7/../../../../x86_64-linux-gnu/lib/../lib/:/usr/lib/gcc/x86_64-linux-gnu/7/../../../x86_64-linux-gnu/7/:/usr/lib/gcc/x86_64-linux-gnu/7/../../../x86_64-linux-gnu/:/usr/lib/gcc/x86_64-linux-gnu/7/../../../../lib/:/lib/x86_64-linux-gnu/7/:/lib/x86_64-linux-gnu/:/lib/../lib/:/usr/lib/x86_64-linux-gnu/7/:/usr/lib/x86_64-linux-gnu/:/usr/lib/../lib/:/usr/lib/gcc/x86_64-linux-gnu/7/../../../../x86_64-linux-gnu/lib/:/usr/lib/gcc/x86_64-linux-gnu/7/../../../:/lib/:/usr/lib/
  211.  
  212. Compiler stderr:
  213.  
  214. Library aio found: NO
  215. Pkg-config binary for MachineChoice.HOST is cached.
  216. Determining dependency 'zlib' with pkg-config executable '/usr/bin/pkg-config'
  217. PKG_CONFIG_PATH:
  218. Called `/usr/bin/pkg-config --modversion zlib` -> 0
  219. 1.2.11
  220. PKG_CONFIG_PATH:
  221. Called `/usr/bin/pkg-config --cflags zlib` -> 0
  222.  
  223. PKG_CONFIG_PATH:
  224. Called `/usr/bin/pkg-config zlib --libs` -> 0
  225. -L/usr/lib/x86_64-linux-gnu -lz
  226. PKG_CONFIG_PATH:
  227. Called `/usr/bin/pkg-config zlib --libs` -> 0
  228. -lz
  229. None of 'PKG_CONFIG_PATH' are defined in the environment, not changing global flags.
  230. Run-time dependency zlib found: YES 1.2.11
  231. Pkg-config binary for MachineChoice.HOST is cached.
  232. Determining dependency 'libnfs' with pkg-config executable '/usr/bin/pkg-config'
  233. PKG_CONFIG_PATH:
  234. Called `/usr/bin/pkg-config --modversion libnfs` -> 0
  235. 4.0.0
  236. PKG_CONFIG_PATH:
  237. Called `/usr/bin/pkg-config --cflags libnfs` -> 0
  238. -I/usr/local/include
  239. PKG_CONFIG_PATH:
  240. Called `/usr/bin/pkg-config libnfs --libs` -> 0
  241. -L/usr/local/lib -lnfs
  242. PKG_CONFIG_PATH:
  243. Called `/usr/bin/pkg-config libnfs --libs` -> 0
  244. -L/usr/local/lib -lnfs
  245. None of 'PKG_CONFIG_PATH' are defined in the environment, not changing global flags.
  246. Run-time dependency libnfs found: YES 4.0.0
  247. None of 'CC_LD' are defined in the environment, not changing global flags.
  248. Running compile:
  249. Working directory: /home/lieven/git/qemu/build/meson-private/tmpp9a3tfak
  250. Command line: cc /home/lieven/git/qemu/build/meson-private/tmpp9a3tfak/testfile.c -o /home/lieven/git/qemu/build/meson-private/tmpp9a3tfak/output.exe -pipe -D_FILE_OFFSET_BITS=64 -O0 -std=gnu99
  251.  
  252. Code:
  253.  
  254. #include <stddef.h>
  255. #include <sys/types.h>
  256. #ifdef CONFIG_LIBATTR
  257. #include <attr/xattr.h>
  258. #else
  259. #include <sys/xattr.h>
  260. #endif
  261. int main(void) { getxattr(NULL, NULL, NULL, 0); setxattr(NULL, NULL, NULL, 0, 0); return 0; }
  262. Compiler stdout:
  263.  
  264. Compiler stderr:
  265.  
  266. Run-time dependency appleframeworks found: NO (tried framework)
  267. Pkg-config binary for MachineChoice.HOST is cached.
  268. Determining dependency 'libseccomp' with pkg-config executable '/usr/bin/pkg-config'
  269. PKG_CONFIG_PATH:
  270. Called `/usr/bin/pkg-config --modversion libseccomp` -> 1
  271.  
  272. Run-time dependency libseccomp found: NO (tried pkgconfig)
  273. Running compile:
  274. Working directory: /home/lieven/git/qemu/build/meson-private/tmpfix7sjc4
  275. Command line: cc /home/lieven/git/qemu/build/meson-private/tmpfix7sjc4/testfile.c -pipe -E -P -D_FILE_OFFSET_BITS=64 -P -O0 -std=gnu99
  276.  
  277. Code:
  278.  
  279. #ifdef __has_include
  280. #if !__has_include("cap-ng.h")
  281. #error "Header 'cap-ng.h' could not be found"
  282. #endif
  283. #else
  284. #include <cap-ng.h>
  285. #endif
  286. Compiler stdout:
  287.  
  288. Compiler stderr:
  289. /home/lieven/git/qemu/build/meson-private/tmpfix7sjc4/testfile.c:4:12: error: #error "Header 'cap-ng.h' could not be found"
  290. #error "Header 'cap-ng.h' could not be found"
  291. ^~~~~
  292.  
  293. Has header "cap-ng.h" : NO
  294. Pkg-config binary for MachineChoice.HOST is cached.
  295. Determining dependency 'xkbcommon' with pkg-config executable '/usr/bin/pkg-config'
  296. PKG_CONFIG_PATH:
  297. Called `/usr/bin/pkg-config --modversion xkbcommon` -> 0
  298. 0.8.0
  299. PKG_CONFIG_PATH:
  300. Called `/usr/bin/pkg-config --cflags xkbcommon` -> 0
  301.  
  302. PKG_CONFIG_PATH:
  303. Called `/usr/bin/pkg-config xkbcommon --libs` -> 0
  304. -L/usr/lib/x86_64-linux-gnu -lxkbcommon
  305. PKG_CONFIG_PATH:
  306. Called `/usr/bin/pkg-config xkbcommon --libs` -> 0
  307. -lxkbcommon
  308. None of 'PKG_CONFIG_PATH' are defined in the environment, not changing global flags.
  309. Run-time dependency xkbcommon found: YES 0.8.0
  310. None of 'CC_LD' are defined in the environment, not changing global flags.
  311. Running compile:
  312. Working directory: /home/lieven/git/qemu/build/meson-private/tmp8t_6swio
  313. Command line: cc /home/lieven/git/qemu/build/meson-private/tmp8t_6swio/testfile.c -o /home/lieven/git/qemu/build/meson-private/tmp8t_6swio/output.exe -pipe -D_FILE_OFFSET_BITS=64 -O0 -Wl,--start-group -lrt -Wl,--end-group -Wl,--allow-shlib-undefined
  314.  
  315. Code:
  316. int main(void) { return 0; }
  317.  
  318. Compiler stdout:
  319.  
  320. Compiler stderr:
  321.  
  322. Library rt found: YES
  323. Pkg-config binary for MachineChoice.HOST is cached.
  324. Determining dependency 'libiscsi' with pkg-config executable '/usr/bin/pkg-config'
  325. PKG_CONFIG_PATH:
  326. Called `/usr/bin/pkg-config --modversion libiscsi` -> 0
  327. 1.16.0
  328. PKG_CONFIG_PATH:
  329. Called `/usr/bin/pkg-config --cflags libiscsi` -> 0
  330. -I/usr/local/include
  331. PKG_CONFIG_PATH:
  332. Called `/usr/bin/pkg-config libiscsi --libs` -> 0
  333. -L/usr/local/lib -liscsi
  334. PKG_CONFIG_PATH:
  335. Called `/usr/bin/pkg-config libiscsi --libs` -> 0
  336. -L/usr/local/lib -liscsi
  337. None of 'PKG_CONFIG_PATH' are defined in the environment, not changing global flags.
  338. Run-time dependency libiscsi found: YES 1.16.0
  339. Pkg-config binary for MachineChoice.HOST is cached.
  340. Determining dependency 'libzstd' with pkg-config executable '/usr/bin/pkg-config'
  341. PKG_CONFIG_PATH:
  342. Called `/usr/bin/pkg-config --modversion libzstd` -> 1
  343.  
  344. Run-time dependency libzstd found: NO (tried pkgconfig)
  345. Pkg-config binary for MachineChoice.HOST is cached.
  346. Determining dependency 'libcurl' with pkg-config executable '/usr/bin/pkg-config'
  347. PKG_CONFIG_PATH:
  348. Called `/usr/bin/pkg-config --modversion libcurl` -> 1
  349.  
  350. Run-time dependency libcurl found: NO (tried pkgconfig)
  351. Pkg-config binary for MachineChoice.HOST is cached.
  352. Determining dependency 'libudev' with pkg-config executable '/usr/bin/pkg-config'
  353. PKG_CONFIG_PATH:
  354. Called `/usr/bin/pkg-config --modversion libudev` -> 0
  355. 237
  356. PKG_CONFIG_PATH:
  357. Called `/usr/bin/pkg-config --cflags libudev` -> 0
  358.  
  359. PKG_CONFIG_PATH:
  360. Called `/usr/bin/pkg-config libudev --libs` -> 0
  361. -L/lib/x86_64-linux-gnu -ludev
  362. PKG_CONFIG_PATH:
  363. Called `/usr/bin/pkg-config libudev --libs` -> 0
  364. -ludev
  365. None of 'PKG_CONFIG_PATH' are defined in the environment, not changing global flags.
  366. Run-time dependency libudev found: YES 237
  367. Library mpathpersist found: NO
  368. Pkg-config binary for MachineChoice.HOST is cached.
  369. Determining dependency 'ncursesw' with pkg-config executable '/usr/bin/pkg-config'
  370. PKG_CONFIG_PATH:
  371. Called `/usr/bin/pkg-config --modversion ncursesw` -> 1
  372.  
  373. Run-time dependency ncursesw found: NO (tried pkgconfig)
  374. Running compile:
  375. Working directory: /home/lieven/git/qemu/build/meson-private/tmp2fgicplm
  376. Command line: cc /home/lieven/git/qemu/build/meson-private/tmp2fgicplm/testfile.c -pipe -E -P -D_FILE_OFFSET_BITS=64 -P -O0 -std=gnu99 -DNCURSES_WIDECHAR
  377.  
  378. Code:
  379.  
  380. #ifdef __has_include
  381. #if !__has_include("curses.h")
  382. #error "Header 'curses.h' could not be found"
  383. #endif
  384. #else
  385. #include <curses.h>
  386. #endif
  387. Compiler stdout:
  388.  
  389. Compiler stderr:
  390. /home/lieven/git/qemu/build/meson-private/tmp2fgicplm/testfile.c:4:12: error: #error "Header 'curses.h' could not be found"
  391. #error "Header 'curses.h' could not be found"
  392. ^~~~~
  393.  
  394. Has header "curses.h" : NO
  395. Message: Trying with /usr/include/ncursesw
  396. Running compile:
  397. Working directory: /home/lieven/git/qemu/build/meson-private/tmph3zqun2n
  398. Command line: cc -I/usr/include/ncursesw /home/lieven/git/qemu/build/meson-private/tmph3zqun2n/testfile.c -pipe -E -P -D_FILE_OFFSET_BITS=64 -P -O0 -std=gnu99 -DNCURSES_WIDECHAR
  399.  
  400. Code:
  401.  
  402. #ifdef __has_include
  403. #if !__has_include("curses.h")
  404. #error "Header 'curses.h' could not be found"
  405. #endif
  406. #else
  407. #include <curses.h>
  408. #endif
  409. Compiler stdout:
  410.  
  411. Compiler stderr:
  412. /home/lieven/git/qemu/build/meson-private/tmph3zqun2n/testfile.c:4:12: error: #error "Header 'curses.h' could not be found"
  413. #error "Header 'curses.h' could not be found"
  414. ^~~~~
  415.  
  416. Has header "curses.h" : NO
  417. None of 'CC_LD' are defined in the environment, not changing global flags.
  418. Running compile:
  419. Working directory: /home/lieven/git/qemu/build/meson-private/tmp2f430ti7
  420. Command line: cc -I/usr/include/glib-2.0 -I/usr/lib/x86_64-linux-gnu/glib-2.0/include /home/lieven/git/qemu/build/meson-private/tmp2f430ti7/testfile.c -o /home/lieven/git/qemu/build/meson-private/tmp2f430ti7/output.exe -pipe -D_FILE_OFFSET_BITS=64 -O0 -std=gnu99 -pthread -Wl,--start-group -lgthread-2.0 -lglib-2.0 -liconv -Wl,--end-group
  421.  
  422. Code:
  423.  
  424. #include <iconv.h>
  425. int main(void) {
  426. iconv_t conv = iconv_open("WCHAR_T", "UCS-2");
  427. return conv != (iconv_t) -1;
  428. }
  429. Compiler stdout:
  430.  
  431. Compiler stderr:
  432. /usr/bin/ld: cannot find -liconv
  433. collect2: error: ld returned 1 exit status
  434.  
  435. None of 'CC_LD' are defined in the environment, not changing global flags.
  436. Running compile:
  437. Working directory: /home/lieven/git/qemu/build/meson-private/tmpkmh0r_xm
  438. Command line: cc -I/usr/include/glib-2.0 -I/usr/lib/x86_64-linux-gnu/glib-2.0/include /home/lieven/git/qemu/build/meson-private/tmpkmh0r_xm/testfile.c -o /home/lieven/git/qemu/build/meson-private/tmpkmh0r_xm/output.exe -pipe -D_FILE_OFFSET_BITS=64 -O0 -std=gnu99 -pthread -Wl,--start-group -lgthread-2.0 -lglib-2.0 -Wl,--end-group
  439.  
  440. Code:
  441.  
  442. #include <iconv.h>
  443. int main(void) {
  444. iconv_t conv = iconv_open("WCHAR_T", "UCS-2");
  445. return conv != (iconv_t) -1;
  446. }
  447. Compiler stdout:
  448.  
  449. Compiler stderr:
  450.  
  451. Running compile:
  452. Working directory: /home/lieven/git/qemu/build/meson-private/tmp82rbpipz
  453. Command line: cc /home/lieven/git/qemu/build/meson-private/tmp82rbpipz/testfile.c -pipe -E -P -D_FILE_OFFSET_BITS=64 -P -O0 -std=gnu99
  454.  
  455. Code:
  456.  
  457. #ifdef __has_include
  458. #if !__has_include("brlapi.h")
  459. #error "Header 'brlapi.h' could not be found"
  460. #endif
  461. #else
  462. #include <brlapi.h>
  463. #endif
  464. Compiler stdout:
  465.  
  466. Compiler stderr:
  467. /home/lieven/git/qemu/build/meson-private/tmp82rbpipz/testfile.c:4:12: error: #error "Header 'brlapi.h' could not be found"
  468. #error "Header 'brlapi.h' could not be found"
  469. ^~~~~
  470.  
  471. Has header "brlapi.h" : NO
  472. Pkg-config binary for MachineChoice.HOST is cached.
  473. Determining dependency 'sdl2' with pkg-config executable '/usr/bin/pkg-config'
  474. PKG_CONFIG_PATH:
  475. Called `/usr/bin/pkg-config --modversion sdl2` -> 0
  476. 2.0.8
  477. PKG_CONFIG_PATH:
  478. Called `/usr/bin/pkg-config --cflags sdl2` -> 0
  479. -D_REENTRANT -I/usr/include/SDL2
  480. PKG_CONFIG_PATH:
  481. Called `/usr/bin/pkg-config sdl2 --libs` -> 0
  482. -L/usr/lib/x86_64-linux-gnu -lSDL2
  483. PKG_CONFIG_PATH:
  484. Called `/usr/bin/pkg-config sdl2 --libs` -> 0
  485. -lSDL2
  486. None of 'PKG_CONFIG_PATH' are defined in the environment, not changing global flags.
  487. Run-time dependency sdl2 found: YES 2.0.8
  488. Pkg-config binary for MachineChoice.HOST is cached.
  489. Determining dependency 'SDL2_image' with pkg-config executable '/usr/bin/pkg-config'
  490. PKG_CONFIG_PATH:
  491. Called `/usr/bin/pkg-config --modversion SDL2_image` -> 1
  492.  
  493. Run-time dependency sdl2_image found: NO (tried pkgconfig)
  494.  
  495. ../meson.build:685:2: ERROR: C shared library 'rados' not found
  496. lieven@lieven-pc:~/git/qemu$ cat /home/lieven/git/qemu/build/meson-logs/meson-log.txt | grep -i lib
  497. Build Options: -Ddocdir=/usr/local/share/doc -Dqemu_firmwarepath=/usr/local/share/qemu-firmware -Dqemu_suffix=qemu -Doptimization=2 -Ddebug=true -Dwerror=true -Dstrip=true -Db_pie=true -Db_staticpic=true -Db_coverage=false -Db_lto=false -Dcfi=false -Dcfi_debug=false -Dmalloc=system -Dmalloc_trim=auto -Dsparse=auto -Dkvm=auto -Dhax=auto -Dwhpx=auto -Dhvf=auto -Dxen=disabled -Dxen_pci_passthrough=auto -Dtcg=enabled -Dcocoa=auto -Dgtk=auto -Dmpath=auto -Dsdl=auto -Dsdl_image=auto -Dvnc=enabled -Dvnc_sasl=auto -Dvnc_jpeg=auto -Dvnc_png=auto -Dgettext=auto -Dxkbcommon=auto -Du2f=auto -Dvirtiofsd=auto -Dcapstone=auto -Dslirp=auto -Dfdt=auto -Dbrlapi=auto -Dcurl=auto -Dglusterfs=auto -Dbzip2=auto -Dlibiscsi=auto -Dlibnfs=auto -Diconv=auto -Dcurses=auto -Dlibudev=auto -Drbd=enabled -Dlzo=auto -Dsnappy=auto -Dlzfse=auto -Dzstd=auto -Dseccomp=auto -Dvirtfs=auto -Dcap_ng=auto -Dattr=auto -Ddefault_devices=true -Ddocs=auto -Dsphinx_build= -Dinstall_blobs=true -Dvhost_user_blk_server=auto -Dfuse=auto -Dfuse_lseek=auto -Dguest_agent_msi=auto -Dprefix=/usr/local -Dbindir=/usr/local/bin -Ddatadir=/usr/local/share -Dincludedir=/usr/local/include -Dlibdir=/usr/local/lib -Dlibexecdir=/usr/local/libexec -Dlocaledir=/usr/local/share/locale -Dlocalstatedir=/usr/local/var -Dmandir=/usr/local/share/man -Dsysconfdir=/usr/local/etc '--native-file config-meson.cross'
  498. Command line: cc /home/lieven/git/qemu/build/meson-private/tmp4gbytkba/testfile.c -o /home/lieven/git/qemu/build/meson-private/tmp4gbytkba/output.exe -pipe -D_FILE_OFFSET_BITS=64 -O0 -Wl,--start-group -lm -Wl,--end-group -Wl,--allow-shlib-undefined
  499. Library m found: YES
  500. Command line: cc /home/lieven/git/qemu/build/meson-private/tmpck2i2w6u/testfile.c -o /home/lieven/git/qemu/build/meson-private/tmpck2i2w6u/output.exe -pipe -D_FILE_OFFSET_BITS=64 -O0 -Wl,--start-group -lutil -Wl,--end-group -Wl,--allow-shlib-undefined
  501. Library util found: YES
  502. Called `/usr/bin/pkg-config pixman-1 --libs` -> 0
  503. -L/usr/lib/x86_64-linux-gnu -lpixman-1
  504. Called `/usr/bin/pkg-config pixman-1 --libs` -> 0
  505. install: /usr/lib/gcc/x86_64-linux-gnu/7/
  506. programs: =/usr/lib/gcc/x86_64-linux-gnu/7/:/usr/lib/gcc/x86_64-linux-gnu/7/:/usr/lib/gcc/x86_64-linux-gnu/:/usr/lib/gcc/x86_64-linux-gnu/7/:/usr/lib/gcc/x86_64-linux-gnu/:/usr/lib/gcc/x86_64-linux-gnu/7/../../../../x86_64-linux-gnu/bin/x86_64-linux-gnu/7/:/usr/lib/gcc/x86_64-linux-gnu/7/../../../../x86_64-linux-gnu/bin/x86_64-linux-gnu/:/usr/lib/gcc/x86_64-linux-gnu/7/../../../../x86_64-linux-gnu/bin/
  507. libraries: =/usr/lib/gcc/x86_64-linux-gnu/7/:/usr/lib/gcc/x86_64-linux-gnu/7/../../../../x86_64-linux-gnu/lib/x86_64-linux-gnu/7/:/usr/lib/gcc/x86_64-linux-gnu/7/../../../../x86_64-linux-gnu/lib/x86_64-linux-gnu/:/usr/lib/gcc/x86_64-linux-gnu/7/../../../../x86_64-linux-gnu/lib/../lib/:/usr/lib/gcc/x86_64-linux-gnu/7/../../../x86_64-linux-gnu/7/:/usr/lib/gcc/x86_64-linux-gnu/7/../../../x86_64-linux-gnu/:/usr/lib/gcc/x86_64-linux-gnu/7/../../../../lib/:/lib/x86_64-linux-gnu/7/:/lib/x86_64-linux-gnu/:/lib/../lib/:/usr/lib/x86_64-linux-gnu/7/:/usr/lib/x86_64-linux-gnu/:/usr/lib/../lib/:/usr/lib/gcc/x86_64-linux-gnu/7/../../../../x86_64-linux-gnu/lib/:/usr/lib/gcc/x86_64-linux-gnu/7/../../../:/lib/:/usr/lib/
  508. Command line: cc /home/lieven/git/qemu/build/meson-private/tmpodg8wwoe/testfile.c -o /home/lieven/git/qemu/build/meson-private/tmpodg8wwoe/output.exe -pipe -D_FILE_OFFSET_BITS=64 -O0 -Wl,--start-group -laio -Wl,--end-group -Wl,--allow-shlib-undefined
  509. install: /usr/lib/gcc/x86_64-linux-gnu/7/
  510. programs: =/usr/lib/gcc/x86_64-linux-gnu/7/:/usr/lib/gcc/x86_64-linux-gnu/7/:/usr/lib/gcc/x86_64-linux-gnu/:/usr/lib/gcc/x86_64-linux-gnu/7/:/usr/lib/gcc/x86_64-linux-gnu/:/usr/lib/gcc/x86_64-linux-gnu/7/../../../../x86_64-linux-gnu/bin/x86_64-linux-gnu/7/:/usr/lib/gcc/x86_64-linux-gnu/7/../../../../x86_64-linux-gnu/bin/x86_64-linux-gnu/:/usr/lib/gcc/x86_64-linux-gnu/7/../../../../x86_64-linux-gnu/bin/
  511. libraries: =/usr/lib/gcc/x86_64-linux-gnu/7/:/usr/lib/gcc/x86_64-linux-gnu/7/../../../../x86_64-linux-gnu/lib/x86_64-linux-gnu/7/:/usr/lib/gcc/x86_64-linux-gnu/7/../../../../x86_64-linux-gnu/lib/x86_64-linux-gnu/:/usr/lib/gcc/x86_64-linux-gnu/7/../../../../x86_64-linux-gnu/lib/../lib/:/usr/lib/gcc/x86_64-linux-gnu/7/../../../x86_64-linux-gnu/7/:/usr/lib/gcc/x86_64-linux-gnu/7/../../../x86_64-linux-gnu/:/usr/lib/gcc/x86_64-linux-gnu/7/../../../../lib/:/lib/x86_64-linux-gnu/7/:/lib/x86_64-linux-gnu/:/lib/../lib/:/usr/lib/x86_64-linux-gnu/7/:/usr/lib/x86_64-linux-gnu/:/usr/lib/../lib/:/usr/lib/gcc/x86_64-linux-gnu/7/../../../../x86_64-linux-gnu/lib/:/usr/lib/gcc/x86_64-linux-gnu/7/../../../:/lib/:/usr/lib/
  512. Library aio found: NO
  513. Determining dependency 'zlib' with pkg-config executable '/usr/bin/pkg-config'
  514. Called `/usr/bin/pkg-config --modversion zlib` -> 0
  515. Called `/usr/bin/pkg-config --cflags zlib` -> 0
  516. Called `/usr/bin/pkg-config zlib --libs` -> 0
  517. -L/usr/lib/x86_64-linux-gnu -lz
  518. Called `/usr/bin/pkg-config zlib --libs` -> 0
  519. Run-time dependency zlib found: YES 1.2.11
  520. Determining dependency 'libnfs' with pkg-config executable '/usr/bin/pkg-config'
  521. Called `/usr/bin/pkg-config --modversion libnfs` -> 0
  522. Called `/usr/bin/pkg-config --cflags libnfs` -> 0
  523. Called `/usr/bin/pkg-config libnfs --libs` -> 0
  524. -L/usr/local/lib -lnfs
  525. Called `/usr/bin/pkg-config libnfs --libs` -> 0
  526. -L/usr/local/lib -lnfs
  527. Run-time dependency libnfs found: YES 4.0.0
  528. #ifdef CONFIG_LIBATTR
  529. Determining dependency 'libseccomp' with pkg-config executable '/usr/bin/pkg-config'
  530. Called `/usr/bin/pkg-config --modversion libseccomp` -> 1
  531. Run-time dependency libseccomp found: NO (tried pkgconfig)
  532. Called `/usr/bin/pkg-config xkbcommon --libs` -> 0
  533. -L/usr/lib/x86_64-linux-gnu -lxkbcommon
  534. Called `/usr/bin/pkg-config xkbcommon --libs` -> 0
  535. Command line: cc /home/lieven/git/qemu/build/meson-private/tmp8t_6swio/testfile.c -o /home/lieven/git/qemu/build/meson-private/tmp8t_6swio/output.exe -pipe -D_FILE_OFFSET_BITS=64 -O0 -Wl,--start-group -lrt -Wl,--end-group -Wl,--allow-shlib-undefined
  536. Library rt found: YES
  537. Determining dependency 'libiscsi' with pkg-config executable '/usr/bin/pkg-config'
  538. Called `/usr/bin/pkg-config --modversion libiscsi` -> 0
  539. Called `/usr/bin/pkg-config --cflags libiscsi` -> 0
  540. Called `/usr/bin/pkg-config libiscsi --libs` -> 0
  541. -L/usr/local/lib -liscsi
  542. Called `/usr/bin/pkg-config libiscsi --libs` -> 0
  543. -L/usr/local/lib -liscsi
  544. Run-time dependency libiscsi found: YES 1.16.0
  545. Determining dependency 'libzstd' with pkg-config executable '/usr/bin/pkg-config'
  546. Called `/usr/bin/pkg-config --modversion libzstd` -> 1
  547. Run-time dependency libzstd found: NO (tried pkgconfig)
  548. Determining dependency 'libcurl' with pkg-config executable '/usr/bin/pkg-config'
  549. Called `/usr/bin/pkg-config --modversion libcurl` -> 1
  550. Run-time dependency libcurl found: NO (tried pkgconfig)
  551. Determining dependency 'libudev' with pkg-config executable '/usr/bin/pkg-config'
  552. Called `/usr/bin/pkg-config --modversion libudev` -> 0
  553. Called `/usr/bin/pkg-config --cflags libudev` -> 0
  554. Called `/usr/bin/pkg-config libudev --libs` -> 0
  555. -L/lib/x86_64-linux-gnu -ludev
  556. Called `/usr/bin/pkg-config libudev --libs` -> 0
  557. Run-time dependency libudev found: YES 237
  558. Library mpathpersist found: NO
  559. Command line: cc -I/usr/include/glib-2.0 -I/usr/lib/x86_64-linux-gnu/glib-2.0/include /home/lieven/git/qemu/build/meson-private/tmp2f430ti7/testfile.c -o /home/lieven/git/qemu/build/meson-private/tmp2f430ti7/output.exe -pipe -D_FILE_OFFSET_BITS=64 -O0 -std=gnu99 -pthread -Wl,--start-group -lgthread-2.0 -lglib-2.0 -liconv -Wl,--end-group
  560. Command line: cc -I/usr/include/glib-2.0 -I/usr/lib/x86_64-linux-gnu/glib-2.0/include /home/lieven/git/qemu/build/meson-private/tmpkmh0r_xm/testfile.c -o /home/lieven/git/qemu/build/meson-private/tmpkmh0r_xm/output.exe -pipe -D_FILE_OFFSET_BITS=64 -O0 -std=gnu99 -pthread -Wl,--start-group -lgthread-2.0 -lglib-2.0 -Wl,--end-group
  561. Called `/usr/bin/pkg-config sdl2 --libs` -> 0
  562. -L/usr/lib/x86_64-linux-gnu -lSDL2
  563. Called `/usr/bin/pkg-config sdl2 --libs` -> 0
  564. ../meson.build:685:2: ERROR: C shared library 'rados' not found
  565.  
RAW Paste Data