gusibsd

Untitled

Mar 16th, 2014
238
0
Never
Not a member of Pastebin yet? Sign Up, it unlocks many cool features!
text 137.89 KB | None | 0 0
  1. build started at Sun Mar 16 10:59:11 UTC 2014
  2. port directory: /usr/ports/net-im/folks
  3. building for: FreeBSD head_amd64_gnome-xorg-gnome-mc-exp 11.0-CURRENT FreeBSD 11.0-CURRENT r262673 amd64
  4. maintained by: [email protected]
  5. ident warning: no id keywords in /usr/local/poudriere_data/build/head_amd64_gnome-xorg-gnome-mc-exp/ref//usr/ports/net-im/folks/Makefile
  6. Makefile ident:
  7. Poudriere version: 3.1-pre
  8.  
  9. ---Begin Environment---
  10. PKGREPOSITORY=/tmp/pkgs
  11. PACKAGES=/tmp/pkgs
  12. OSVERSION=1100010
  13. UNAME_v=FreeBSD 11.0-CURRENT r262673
  14. UNAME_r=11.0-CURRENT
  15. BLOCKSIZE=K
  16. MAIL=/var/mail/root
  17. STATUS=1
  18. SAVED_TERM=screen
  19. MASTERMNT=/usr/local/poudriere_data/build/head_amd64_gnome-xorg-gnome-mc-exp/ref
  20. PKG_EXT=txz
  21. FORCE_PACKAGE=yes
  22. tpid=47173
  23. PATH=/sbin:/bin:/usr/sbin:/usr/bin:/usr/games:/usr/local/sbin:/usr/local/bin:/root/bin
  24. POUDRIERE_BUILD_TYPE=bulk
  25. PKGNG=1
  26. PKG_DELETE=/usr/local/sbin/pkg-static delete -y -f
  27. PKG_ADD=/usr/local/sbin/pkg-static add
  28. PWD=/root/marcuscom/ports-experimental/trunk/net-im/folks
  29. MASTERNAME=head_amd64_gnome-xorg-gnome-mc-exp
  30. DEVELOPER_MODE=yes
  31. USER=root
  32. HOME=/root
  33. POUDRIERE_VERSION=3.1-pre
  34. TRYBROKEN=yes
  35. LOCALBASE=/usr/local
  36. PKG_VERSION=/poudriere/pkg-static version
  37. PKG_BIN=/usr/local/sbin/pkg-static
  38. ---End Environment---
  39.  
  40. ---Begin OPTIONS List---
  41. ===> The following configuration options are available for folks-0.9.6:
  42. SOCIALWEB=off: Social web backend
  43. ===> Use 'make config' to modify these settings
  44. ---End OPTIONS List---
  45.  
  46. --CONFIGURE_ARGS--
  47. --disable-tracker-backend --disable-eds-backend --enable-libsocialweb-backend=no --prefix=/usr/local ${_LATE_CONFIGURE_ARGS}
  48. --End CONFIGURE_ARGS--
  49.  
  50. --CONFIGURE_ENV--
  51. MAKE=gmake PKG_CONFIG=pkgconf SHELL=/bin/sh CONFIG_SHELL=/bin/sh LIBTOOL=/usr/local/bin/libtool LIBTOOLIZE=/usr/local/bin/libtoolize LIBTOOL_LIBEXECDIR=/usr/local/libexec/libtool LIBTOOL_SHAREDIR=/usr/local/share/libtool LIBTOOL_M4=/usr/local/share/aclocal/libtool.m4 LTMAIN=/usr/local/share/libtool/config/ltmain.sh ac_cv_path_DOLT_BASH= CONFIG_SITE=/usr/ports/Templates/config.site lt_cv_sys_max_cmd_len=262144
  52. --End CONFIGURE_ENV--
  53.  
  54. --MAKE_ENV--
  55. SHELL=/bin/sh NO_LINT=YES LIBTOOL=/usr/local/bin/libtool LIBTOOLIZE=/usr/local/bin/libtoolize LIBTOOL_LIBEXECDIR=/usr/local/libexec/libtool LIBTOOL_SHAREDIR=/usr/local/share/libtool LIBTOOL_M4=/usr/local/share/aclocal/libtool.m4 LTMAIN=/usr/local/share/libtool/config/ltmain.sh GI_SCANNER_DISABLE_CACHE=1 XDG_CACHE_HOME=/wrkdirs/usr/ports/net-im/folks/work PREFIX=/usr/local LOCALBASE=/usr/local LIBDIR="/usr/lib" CC="cc" CFLAGS="-O2 -pipe -fno-strict-aliasing" CPP="cpp" CPPFLAGS="-I/usr/local/include" LDFLAGS=" -L/usr/local/lib" CXX="c++" CXXFLAGS="-O2 -pipe -fno-strict-aliasing" MANPREFIX="/usr/local" BSD_INSTALL_PROGRAM="install -s -o root -g wheel -m 555" BSD_INSTALL_LIB="install -s -o root -g wheel -m 444" BSD_INSTALL_SCRIPT="install -o root -g wheel -m 555" BSD_INSTALL_DATA="install -o root -g wheel -m 444" BSD_INSTALL_MAN="install -o root -g wheel -m 444"
  56. --End MAKE_ENV--
  57.  
  58. --SUB_LIST--
  59. PREFIX=/usr/local
  60. LOCALBASE=/usr/local
  61. DATADIR=/usr/local/share/folks
  62. DOCSDIR=/usr/local/share/doc/folks
  63. EXAMPLESDIR=/usr/local/share/examples/folks
  64. WWWDIR=/usr/local/www/folks
  65. ETCDIR=/usr/local/etc/folks
  66. --End SUB_LIST--
  67.  
  68. ---Begin make.conf---
  69. USE_PACKAGE_DEPENDS=yes
  70. BATCH=yes
  71. WRKDIRPREFIX=/wrkdirs
  72. PORTSDIR=/usr/ports
  73. PACKAGES=/packages
  74. DISTDIR=/distfiles
  75. #### /usr/local/etc/poudriere.d/head_amd64_gnome-xorg-gnome-mc-exp-make.conf ####
  76. MASTER_SITE_GNOME+=http://www.gtlib.gatech.edu/pub/gnome/%SUBDIR%/
  77.  
  78. DEVELOPER= yes
  79.  
  80. DEFAULT_VERSIONS= perl5=5.16
  81.  
  82. QT4_OPTIONS= CUPS NAS QGTKSTYLE
  83. WITH_NEW_XORG= yes
  84.  
  85. KDE4_PREFIX=/usr/local
  86. WITH_GHOSTSCRIPT_VER=8
  87.  
  88. MALLOC_PRODUCTION=yes
  89. FIREFOX_I18N=ca
  90. THUNDERBIRD_I18N=ca
  91.  
  92. TEX_DEFAULT= texlive
  93. DEFAULT_PGSQL_VER=93
  94.  
  95. .if ${.CURDIR:M*/devel/google-sparsehash}
  96. USE_GCC= 4.6
  97. .endif
  98.  
  99. .if ${.CURDIR:M*/java/openjdk6}
  100. NO_IGNORE= YES
  101. .endif
  102.  
  103. .if ${.CURDIR:M*/audio/soundtouch}
  104. USE_GCC= 4.6
  105. .endif
  106.  
  107. .if ${.CURDIR:M*/x11/kdelibs4}
  108. MAKE_JOBS_UNSAFE= YES
  109. .endif
  110.  
  111. .if ${.CURDIR:M*/sysutils/polkit-gnome}
  112. MAKE_JOBS_UNSAFE= YES
  113. .endif
  114.  
  115. .if ${.CURDIR:M*/sysutils/polkit}
  116. MAKE_JOBS_UNSAFE= YES
  117. .endif
  118.  
  119. .if ${.CURDIR:M*/devel/py-notify}
  120. MAKE_JOBS_UNSAFE= YES
  121. .endif
  122.  
  123. .if ${.CURDIR:M*/textproc/scim}
  124. USE_GCC= 4.6
  125. .endif
  126.  
  127. .if ${.CURDIR:M*/audio/fluidsynth}
  128. USE_GCC= 4.6
  129. .endif
  130.  
  131. .if ${.CURDIR:M*/print/cups-pstoraster}
  132. MAKE_JOBS_UNSAFE= YES
  133. .endif
  134.  
  135. .if ${.CURDIR:M*/net/wireshark}
  136. MAKE_JOBS_UNSAFE= yes
  137. .endif
  138.  
  139. .if ${.CURDIR:M*/science/InsightToolkit}
  140. MAKE_JOBS_UNSAFE= yes
  141. .endif
  142.  
  143. .if ${.CURDIR:M*/science/netcdf4}
  144. USE_GCC= 4.6
  145. .endif
  146. ---End make.conf---
  147. =======================<phase: check-config >============================
  148. ===========================================================================
  149. =======================<phase: pkg-depends >============================
  150. ===> folks-0.9.6 depends on file: /usr/local/sbin/pkg - not found
  151. ===> Verifying install for /usr/local/sbin/pkg in /usr/ports/ports-mgmt/pkg
  152. ===> Installing existing package /packages/All/pkg-1.2.6.txz
  153. Installing pkg-1.2.6... done
  154. If you are upgrading from the old package format, first run:
  155.  
  156. # pkg2ng
  157. ===> Returning to build of folks-0.9.6
  158. ===========================================================================
  159. =======================<phase: fetch-depends >============================
  160. ===========================================================================
  161. =======================<phase: fetch >============================
  162. /!\ folks-0.9.6: Makefile warnings, please consider fixing /!\
  163.  
  164. USE_XZ is deprecated, please use USES=tar:xz
  165.  
  166. ===> Found saved configuration for folks-0.9.6
  167. ===> folks-0.9.6 depends on file: /usr/local/sbin/pkg - found
  168. ===> Fetching all distfiles required by folks-0.9.6 for building
  169. ===========================================================================
  170. =======================<phase: checksum >============================
  171. /!\ folks-0.9.6: Makefile warnings, please consider fixing /!\
  172.  
  173. USE_XZ is deprecated, please use USES=tar:xz
  174.  
  175. ===> Found saved configuration for folks-0.9.6
  176. ===> folks-0.9.6 depends on file: /usr/local/sbin/pkg - found
  177. ===> Fetching all distfiles required by folks-0.9.6 for building
  178. => SHA256 Checksum OK for folks-0.9.6.tar.xz.
  179. ===========================================================================
  180. =======================<phase: extract-depends>============================
  181. ===========================================================================
  182. =======================<phase: extract >============================
  183. /!\ folks-0.9.6: Makefile warnings, please consider fixing /!\
  184.  
  185. USE_XZ is deprecated, please use USES=tar:xz
  186.  
  187. ===> Found saved configuration for folks-0.9.6
  188. ===> folks-0.9.6 depends on file: /usr/local/sbin/pkg - found
  189. ===> Fetching all distfiles required by folks-0.9.6 for building
  190. ===> Extracting for folks-0.9.6
  191. => SHA256 Checksum OK for folks-0.9.6.tar.xz.
  192. ===========================================================================
  193. =======================<phase: patch-depends >============================
  194. ===> folks-0.9.6 depends on package: libtool>=2.4 - not found
  195. pkg-static: No package(s) matching libtool
  196. ===> Verifying install for libtool>=2.4 in /usr/ports/devel/libtool
  197. ===> Installing existing package /packages/All/libtool-2.4.2_2.txz
  198. Installing libtool-2.4.2_2... done
  199. ===> Returning to build of folks-0.9.6
  200. ===========================================================================
  201. =======================<phase: patch >============================
  202. ===> Patching for folks-0.9.6
  203. ===> folks-0.9.6 depends on package: libtool>=2.4 - found
  204. ===========================================================================
  205. =======================<phase: build-depends >============================
  206. ===> folks-0.9.6 depends on executable: vapigen - not found
  207. ===> Verifying install for vapigen in /usr/ports/lang/vala-vapigen
  208. ===> Installing existing package /packages/All/vala-vapigen-0.23.3.txz
  209. Installing vala-vapigen-0.23.3...Installing gettext-0.18.3.1... done
  210. Installing glib-2.39.91_1...Installing libffi-3.0.13_1... done
  211. Installing pcre-8.34... done
  212. Installing perl5-5.16.3_7... done
  213. Installing python27-2.7.6_4... done
  214. No schema files found: doing nothing.
  215. done
  216. Installing gnomehier-3.0... done
  217. Installing libxml2-2.9.1... done
  218. Installing libxslt-1.1.28_1...Installing libgcrypt-1.5.3...Installing libgpg-error-1.12... done
  219. done
  220. done
  221. Installing p5-XML-LibXML-2.0108,1...Installing p5-XML-NamespaceSupport-1.11... done
  222. Installing p5-XML-SAX-0.99_1...Installing p5-XML-SAX-Base-1.08... done
  223. done
  224. done
  225. Installing vala-0.23.3... done
  226. done
  227. ====
  228. Note that some of the standard modules are provided as separate
  229. ports since they require extra dependencies:
  230.  
  231. bsddb databases/py-bsddb
  232. gdbm databases/py-gdbm
  233. sqlite3 databases/py-sqlite3
  234. tkinter x11-toolkits/py-tkinter
  235.  
  236. Install them as needed.
  237. ====
  238. ===> Returning to build of folks-0.9.6
  239. ===> folks-0.9.6 depends on executable: gmake - not found
  240. ===> Verifying install for gmake in /usr/ports/devel/gmake
  241. ===> Installing existing package /packages/All/gmake-3.82_1.txz
  242. Installing gmake-3.82_1... done
  243. ===> Returning to build of folks-0.9.6
  244. ===> folks-0.9.6 depends on executable: pkgconf - not found
  245. ===> Verifying install for pkgconf in /usr/ports/devel/pkgconf
  246. ===> Installing existing package /packages/All/pkgconf-0.9.4.txz
  247. Installing pkgconf-0.9.4... done
  248. ===> Returning to build of folks-0.9.6
  249. ===> folks-0.9.6 depends on package: libtool>=2.4 - found
  250. ===> folks-0.9.6 depends on file: /usr/local/bin/intltool-extract - not found
  251. ===> Verifying install for /usr/local/bin/intltool-extract in /usr/ports/textproc/intltool
  252. ===> Installing existing package /packages/All/intltool-0.50.2.txz
  253. Installing intltool-0.50.2...Installing p5-XML-Parser-2.41_1...Installing expat-2.1.0... done
  254. done
  255. done
  256. ===> Returning to build of folks-0.9.6
  257. ===> folks-0.9.6 depends on executable: g-ir-scanner - not found
  258. ===> Verifying install for g-ir-scanner in /usr/ports/devel/gobject-introspection
  259. ===> Installing existing package /packages/All/gobject-introspection-1.39.90.txz
  260. Installing gobject-introspection-1.39.90... done
  261. ===> Returning to build of folks-0.9.6
  262. ===========================================================================
  263. =======================<phase: lib-depends >============================
  264. ===> folks-0.9.6 depends on shared library: libgee-0.8.so - not found
  265. ===> Verifying for libgee-0.8.so in /usr/ports/devel/libgee
  266. ===> Installing existing package /packages/All/libgee-0.13.91.txz
  267. Installing libgee-0.13.91... done
  268. ===> Returning to build of folks-0.9.6
  269. ===> folks-0.9.6 depends on shared library: libgcr-3.so - not found
  270. ===> Verifying for libgcr-3.so in /usr/ports/security/gcr
  271. ===> Installing existing package /packages/All/gcr-3.11.91.txz
  272. Installing gcr-3.11.91...Installing atk-2.11.90... done
  273. Installing dbus-1.6.18...Installing gnome_subr-1.0... done
  274. Installing libICE-1.0.8,1...Installing xproto-7.0.25... done
  275. done
  276. Installing libSM-1.2.2,1... done
  277. Installing libX11-1.6.2,1...Installing kbproto-1.0.6... done
  278. Installing libXau-1.0.8... done
  279. Installing libXdmcp-1.1.1... done
  280. Installing libxcb-1.9.3...Installing libpthread-stubs-0.3_4... done
  281. done
  282. done
  283. ===> Creating users and/or groups.
  284. Creating group 'messagebus' with gid '556'.
  285. Creating user 'messagebus' with uid '556'.
  286. done
  287. Installing desktop-file-utils-0.22_1... done
  288. Installing gdk-pixbuf2-2.30.0...Installing jasper-1.900.1_12...Installing jpeg-8_4... done
  289. done
  290. Installing libXi-1.7.2,1...Installing inputproto-2.3... done
  291. Installing libXext-1.3.2,1...Installing xextproto-7.2.1... done
  292. done
  293. Installing libXfixes-5.0.1...Installing fixesproto-5.0... done
  294. done
  295. done
  296. Installing libXt-1.1.4,1... done
  297. Installing png-1.5.18... done
  298. Installing tiff-4.0.3...Installing freeglut-2.8.1...Installing libGLU-9.0.0...Installing libGL-9.1.7...Installing dri2proto-2.8... done
  299. Installing libXdamage-1.1.4...Installing damageproto-1.2.1... done
  300. done
  301. Installing libXxf86vm-1.1.3...Installing xf86vidmodeproto-2.3.1... done
  302. done
  303. Installing libdrm-2.4.50...Installing libpciaccess-0.13.2...Installing pciids-20140222... done
  304. done
  305. done
  306. done
  307. done
  308. Installing libXrandr-1.4.2...Installing libXrender-0.9.8...Installing renderproto-0.11.1... done
  309. done
  310. Installing randrproto-1.4.0... done
  311. done
  312. done
  313. Installing jbigkit-1.6... done
  314. Installing libXmu-1.1.2,1... done
  315. done
  316. done
  317. Installing gtk-update-icon-cache-2.24.22...Installing hicolor-icon-theme-0.12... done
  318. Installing libXcomposite-0.4.4,1...Installing compositeproto-0.4.2... done
  319. done
  320. Installing libXcursor-1.1.14... done
  321. Installing libXinerama-1.1.3,1...Installing xineramaproto-1.2.1... done
  322. done
  323. Installing pango-1.36.1...Installing cairo-1.12.16,2...Installing fontconfig-2.11.0_1,1...Installing freetype2-2.5.2... done
  324. Running fc-cache to build fontconfig cache...
  325. /usr/local/share/fonts: skipping, no such directory
  326. /usr/local/lib/X11/fonts: caching, new cache contents: 0 fonts, 1 dirs
  327. /usr/local/lib/X11/fonts/local: caching, new cache contents: 0 fonts, 0 dirs
  328. /root/.local/share/fonts: skipping, no such directory
  329. /root/.fonts: skipping, no such directory
  330. /usr/local/share/fonts: skipping, no such directory
  331. /usr/local/lib/X11/fonts: caching, new cache contents: 0 fonts, 1 dirs
  332. /root/.local/share/fonts: skipping, no such directory
  333. /root/.fonts: skipping, no such directory
  334. /var/db/fontconfig: cleaning cache directory
  335. /root/.cache/fontconfig: not cleaning non-existent cache directory
  336. /root/.fontconfig: not cleaning non-existent cache directory
  337. fc-cache: succeeded
  338. done
  339. Installing pixman-0.32.4... done
  340. Installing xcb-util-renderutil-0.3.8...Installing xcb-util-0.3.9_1,1... done
  341. done
  342. done
  343. Installing encodings-1.0.4_1,1...Installing font-util-1.3.0_1... done
  344. done
  345. Installing harfbuzz-0.9.25_1...Installing graphite2-1.2.4... done
  346. Installing icu-52.1... done
  347. done
  348. Installing libXft-2.3.1... done
  349. Installing xorg-fonts-truetype-7.7_1...Installing dejavu-2.34_2... done
  350. Installing font-bh-ttf-1.0.3_1...Installing mkfontdir-1.0.7...Installing mkfontscale-1.1.1...Installing libfontenc-1.1.2... done
  351. done
  352. done
  353. done
  354. Installing font-misc-ethiopic-1.0.3_1... done
  355. Installing font-misc-meltho-1.0.3_1... done
  356. done
  357. done
  358. Installing shared-mime-info-1.1... done
  359. done
  360. Installing gtk3-3.11.8...Installing at-spi2-atk-2.11.91...Installing at-spi2-core-2.11.91...Installing libXtst-1.2.2...Installing recordproto-1.14.2... done
  361. done
  362. done
  363. done
  364. Installing colord-1.0.6...Installing lcms2-2.5... done
  365. Installing polkit-0.105_2... done
  366. Installing sqlite3-3.8.3.1... done
  367. ===> Creating users and/or groups.
  368. Creating group 'colord' with gid '970'.
  369. Creating user 'colord' with uid '970'.
  370. done
  371. Installing cups-client-1.5.4_1... done
  372. done
  373. Installing libtasn1-3.3... done
  374. Installing p11-kit-0.20.2...Installing ca_root_nss-3.15.4... done
  375. done
  376. done
  377. Since FreeBSD has new USB stack, freeglut normally doesn't build on FreeBSD 8
  378. (yet). To workaround this a small patch adds one include file and comments out
  379. content of one function (only leaves return NULL).
  380.  
  381. This might cause side effects. Joysticks do not work, and there might be ports
  382. that do not compile or applications that crash because of this.
  383.  
  384. Do not hesitate to contact [email protected] if there are any issues and side
  385. effects because of this.
  386. Make sure that the freetype module is loaded. If it is not, add the following
  387. line to the "Modules" section of your X Windows configuration file:
  388.  
  389. Load "freetype"
  390.  
  391. Add the following line to the "Files" section of X Windows configuration file:
  392.  
  393. FontPath "lib/X11/fonts/dejavu/"
  394.  
  395. Note: your X Windows configuration file is typically /etc/X11/XF86Config
  396. if you are using XFree86, and /etc/X11/xorg.conf if you are using X.Org.
  397. ===> Returning to build of folks-0.9.6
  398. ===> folks-0.9.6 depends on shared library: libzeitgeist-1.0.so - not found
  399. ===> Verifying for libzeitgeist-1.0.so in /usr/ports/sysutils/libzeitgeist
  400. ===> Installing existing package /packages/All/libzeitgeist-0.3.18.txz
  401. Installing libzeitgeist-0.3.18... done
  402. ===> Returning to build of folks-0.9.6
  403. ===> folks-0.9.6 depends on shared library: libtelepathy-glib.so - not found
  404. ===> Verifying for libtelepathy-glib.so in /usr/ports/net-im/telepathy-glib
  405. ===> Installing existing package /packages/All/telepathy-glib-0.22.1.txz
  406. Installing telepathy-glib-0.22.1...Installing dbus-glib-0.100.2... done
  407. done
  408. ===> Returning to build of folks-0.9.6
  409. ===> folks-0.9.6 depends on shared library: libintl.so - found
  410. ===> folks-0.9.6 depends on shared library: libatk-1.0.so - found
  411. ===> folks-0.9.6 depends on shared library: libedataserver-1.2.so.18 - not found
  412. ===> Verifying for libedataserver-1.2.so.18 in /usr/ports/databases/evolution-data-server
  413. ===> Installing existing package /packages/All/evolution-data-server-3.11.91.txz
  414. Installing evolution-data-server-3.11.91...Installing ORBit2-2.14.19...Installing libIDL-0.8.14_1... done
  415. done
  416. Installing db5-5.3.28... done
  417. Installing gconf2-3.2.6...Installing dconf-0.19.91... done
  418. Installing gtk2-2.24.22_1...Installing python-2.7_1,2...Installing python2-2_2... done
  419. done
  420. done
  421. done
  422. Installing gnome-online-accounts-3.11.91...Installing json-glib-0.99.2... done
  423. Installing libgnome-keyring-3.10.1... done
  424. Installing libnotify-0.7.6... done
  425. Installing libsecret-0.18... done
  426. Installing rest-0.7.90...Installing libsoup-gnome-2.45.90...Installing glib-networking-2.39.90...Installing gnutls-2.12.23_3...Installing nettle-2.7.1...Installing gmp-5.1.3_1... done
  427. done
  428. done
  429. Installing gsettings-desktop-schemas-3.11.90...Installing cantarell-fonts-0.0.15.../usr/local/share/fonts/cantarell: caching, new cache contents: 2 fonts, 0 dirs
  430. /usr/local/share/fonts/cantarell: caching, new cache contents: 2 fonts, 0 dirs
  431. /var/db/fontconfig: cleaning cache directory
  432. /root/.cache/fontconfig: not cleaning non-existent cache directory
  433. /root/.fontconfig: not cleaning non-existent cache directory
  434. /usr/local/bin/fc-cache: succeeded
  435. done
  436. done
  437. Installing libproxy-0.4.6_1... done
  438. done
  439. Installing libsoup-2.45.90... done
  440. done
  441. done
  442. Installing webkit-gtk3-2.3.91...Installing curl-7.35.0... done
  443. Installing enchant-1.6.0_2...Installing hunspell-1.3.2_4... done
  444. done
  445. Installing gstreamer1-plugins-1.2.3...Installing gstreamer1-1.2.3... done
  446. Installing iso-codes-3.51... done
  447. Installing orc-0.4.18... done
  448. done
  449. Installing webp-0.3.1_4...Installing giflib-nox11-4.2.3_1... done
  450. done
  451. done
  452. done
  453. Installing libgdata-0.14.1...Installing liboauth-1.0.1_1... done
  454. done
  455. Installing libgweather-3.11.91...Installing gnome-icon-theme-3.11.5... done
  456. done
  457. Installing libical-1.0... done
  458. Installing nss-3.15.4...Installing nspr-4.10.3... done
  459. done
  460. Installing openldap-client-2.4.38... done
  461. done
  462. ************************************************************
  463.  
  464. The OpenLDAP client package has been successfully installed.
  465.  
  466. Edit
  467. /usr/local/etc/openldap/ldap.conf
  468. to change the system-wide client defaults.
  469.  
  470. Try `man ldap.conf' and visit the OpenLDAP FAQ-O-Matic at
  471. http://www.OpenLDAP.org/faq/index.cgi?file=3
  472. for more information.
  473.  
  474. ************************************************************
  475. ===> Returning to build of folks-0.9.6
  476. ===> folks-0.9.6 depends on shared library: libgconf-2.so - found
  477. ===> folks-0.9.6 depends on shared library: libglib-2.0.so - found
  478. ===> folks-0.9.6 depends on shared library: libpcre.so - found
  479. ===> folks-0.9.6 depends on shared library: libgtk-x11-2.0.so - found
  480. ===> folks-0.9.6 depends on shared library: libgtk-3.so - found
  481. ===> folks-0.9.6 depends on shared library: libIDL-2.so - found
  482. ===> folks-0.9.6 depends on shared library: libxml2.so - found
  483. ===> folks-0.9.6 depends on shared library: libORBit-2.so - found
  484. ===> folks-0.9.6 depends on shared library: libpango-1.0.so - found
  485. ===========================================================================
  486. ====>> Recording filesystem state for prebuild... done
  487. =======================<phase: configure >============================
  488. ===> folks-0.9.6 depends on executable: vapigen - found
  489. ===> folks-0.9.6 depends on executable: gmake - found
  490. ===> folks-0.9.6 depends on executable: pkgconf - found
  491. ===> folks-0.9.6 depends on package: libtool>=2.4 - found
  492. ===> folks-0.9.6 depends on file: /usr/local/bin/intltool-extract - found
  493. ===> folks-0.9.6 depends on executable: g-ir-scanner - found
  494. ===> folks-0.9.6 depends on shared library: libgee-0.8.so - found
  495. ===> folks-0.9.6 depends on shared library: libgcr-3.so - found
  496. ===> folks-0.9.6 depends on shared library: libzeitgeist-1.0.so - found
  497. ===> folks-0.9.6 depends on shared library: libtelepathy-glib.so - found
  498. ===> folks-0.9.6 depends on shared library: libintl.so - found
  499. ===> folks-0.9.6 depends on shared library: libatk-1.0.so - found
  500. ===> folks-0.9.6 depends on shared library: libedataserver-1.2.so.18 - found
  501. ===> folks-0.9.6 depends on shared library: libgconf-2.so - found
  502. ===> folks-0.9.6 depends on shared library: libglib-2.0.so - found
  503. ===> folks-0.9.6 depends on shared library: libpcre.so - found
  504. ===> folks-0.9.6 depends on shared library: libgtk-x11-2.0.so - found
  505. ===> folks-0.9.6 depends on shared library: libgtk-3.so - found
  506. ===> folks-0.9.6 depends on shared library: libIDL-2.so - found
  507. ===> folks-0.9.6 depends on shared library: libxml2.so - found
  508. ===> folks-0.9.6 depends on shared library: libORBit-2.so - found
  509. ===> folks-0.9.6 depends on shared library: libpango-1.0.so - found
  510. ===> Configuring for folks-0.9.6
  511. ===> FreeBSD 10 autotools fix applied to /wrkdirs/usr/ports/net-im/folks/work/folks-0.9.6/m4/libtool.m4
  512. ===> FreeBSD 10 autotools fix applied to /wrkdirs/usr/ports/net-im/folks/work/folks-0.9.6/aclocal.m4
  513. ===> FreeBSD 10 autotools fix applied to /wrkdirs/usr/ports/net-im/folks/work/folks-0.9.6/configure
  514. configure: loading site script /usr/ports/Templates/config.site
  515. checking whether gmake supports nested variables... yes
  516. checking for a BSD-compatible install... /usr/bin/install -c -o root -g wheel
  517. checking whether build environment is sane... yes
  518. checking for a thread-safe mkdir -p... (cached) /bin/mkdir -p
  519. checking for gawk... (cached) /usr/bin/awk
  520. checking whether gmake sets $(MAKE)... yes
  521. checking how to create a ustar tar archive... (cached) /usr/bin/tar
  522. checking whether to enable maintainer-specific portions of Makefiles... yes
  523. checking for gcc... cc
  524. checking whether the C compiler works... yes
  525. checking for C compiler default output file name... a.out
  526. checking for suffix of executables...
  527. checking whether we are cross compiling... no
  528. checking for suffix of object files... o
  529. checking whether we are using the GNU C compiler... yes
  530. checking whether cc accepts -g... yes
  531. checking for cc option to accept ISO C89... none needed
  532. checking for style of include used by gmake... GNU
  533. checking dependency style of cc... gcc3
  534. checking whether cc understands -c and -o together... yes
  535. checking build system type... amd64-portbld-freebsd11.0
  536. checking host system type... amd64-portbld-freebsd11.0
  537. checking how to print strings... printf
  538. checking for a sed that does not truncate output... (cached) /usr/bin/sed
  539. checking for grep that handles long lines and -e... (cached) /usr/bin/grep
  540. checking for egrep... (cached) /usr/bin/egrep
  541. checking for fgrep... (cached) /usr/bin/fgrep
  542. checking for ld used by cc... /usr/bin/ld
  543. checking if the linker (/usr/bin/ld) is GNU ld... yes
  544. checking for BSD- or MS-compatible name lister (nm)... /usr/bin/nm -B
  545. checking the name lister (/usr/bin/nm -B) interface... BSD nm
  546. checking whether ln -s works... yes
  547. checking the maximum length of command line arguments... (cached) 262144
  548. checking whether the shell understands some XSI constructs... yes
  549. checking whether the shell understands "+="... no
  550. checking how to convert amd64-portbld-freebsd11.0 file names to amd64-portbld-freebsd11.0 format... func_convert_file_noop
  551. checking how to convert amd64-portbld-freebsd11.0 file names to toolchain format... func_convert_file_noop
  552. checking for /usr/bin/ld option to reload object files... -r
  553. checking for objdump... objdump
  554. checking how to recognize dependent libraries... pass_all
  555. checking for dlltool... no
  556. checking how to associate runtime and link libraries... printf %s\n
  557. checking for ar... ar
  558. checking for archiver @FILE support... no
  559. checking for strip... strip
  560. checking for ranlib... ranlib
  561. checking command to parse /usr/bin/nm -B output from cc object... ok
  562. checking for sysroot... no
  563. checking for mt... mt
  564. checking if mt is a manifest tool... no
  565. checking how to run the C preprocessor... cpp
  566. checking for ANSI C header files... (cached) yes
  567. checking for sys/types.h... (cached) yes
  568. checking for sys/stat.h... (cached) yes
  569. checking for stdlib.h... (cached) yes
  570. checking for string.h... (cached) yes
  571. checking for memory.h... (cached) yes
  572. checking for strings.h... (cached) yes
  573. checking for inttypes.h... (cached) yes
  574. checking for stdint.h... (cached) yes
  575. checking for unistd.h... (cached) yes
  576. checking for dlfcn.h... (cached) yes
  577. checking for objdir... .libs
  578. checking if cc supports -fno-rtti -fno-exceptions... yes
  579. checking for cc option to produce PIC... -fPIC -DPIC
  580. checking if cc PIC flag -fPIC -DPIC works... yes
  581. checking if cc static flag -static works... yes
  582. checking if cc supports -c -o file.o... yes
  583. checking if cc supports -c -o file.o... (cached) yes
  584. checking whether the cc linker (/usr/bin/ld) supports shared libraries... yes
  585. checking whether -lc should be explicitly linked in... no
  586. checking dynamic linker characteristics... freebsd11.0 ld.so
  587. checking how to hardcode library paths into programs... immediate
  588. checking whether stripping libraries is possible... yes
  589. checking if libtool supports shared libraries... yes
  590. checking whether to build shared libraries... yes
  591. checking whether to build static libraries... no
  592. checking pkg-config is at least version 0.21... yes
  593. checking pkg-config is at least version 0.16... yes
  594. checking for valac... /usr/local/bin/valac
  595. checking for GLIB... yes
  596. checking for GMODULE... yes
  597. checking for GIO... yes
  598. checking for DBUS_GLIB... yes
  599. checking for GEE... yes
  600. checking for TP_GLIB... yes
  601. checking for ZEITGEIST... no
  602. checking for EBOOK... yes
  603. checking for EBOOK... yes
  604. Vala source needs to be re-compiled; requiring Vala...
  605. checking for valac... (cached) /usr/local/bin/valac
  606. checking /usr/local/bin/valac is at least version 0.22.0.28-9090... yes
  607. checking for vapigen... /usr/local/bin/vapigen
  608. checking for gio-2.0 gee-0.8 vala bindings... yes
  609. checking for gio-2.0 gee-0.8 telepathy-glib vala bindings... yes
  610. checking for gio-2.0 gee-0.8 telepathy-glib libebook-1.2 vala bindings... yes
  611. checking for gio-2.0 gee-0.8 telepathy-glib libebook-1.2 libebook-1.2 vala bindings... yes
  612. checking for gobject-introspection... yes
  613. checking for memset... (cached) yes
  614. checking for strstr... yes
  615. checking for LIBXML... yes
  616. checking for main in -lreadline... yes
  617. checking for gio-2.0 gee-0.8 telepathy-glib libebook-1.2 libebook-1.2 readline vala bindings... yes
  618. checking whether NLS is requested... yes
  619. checking for intltool >= 0.50.0... 0.50.2 found
  620. checking for intltool-update... /usr/local/bin/intltool-update
  621. checking for intltool-merge... /usr/local/bin/intltool-merge
  622. checking for intltool-extract... /usr/local/bin/intltool-extract
  623. checking for xgettext... /usr/local/bin/xgettext
  624. checking for msgmerge... /usr/local/bin/msgmerge
  625. checking for msgfmt... /usr/local/bin/msgfmt
  626. checking for gmsgfmt... /usr/local/bin/msgfmt
  627. checking for perl... /usr/bin/perl
  628. checking for perl >= 5.8.1... 5.16.3
  629. checking for XML::Parser... ok
  630. checking to see if compiler understands -Werror=implicit... yes
  631. checking to see if compiler understands -Werror=missing-declarations... yes
  632. checking to see if compiler understands -Werror=missing-parameter-type... yes
  633. checking to see if compiler understands -Werror=missing-prototypes... yes
  634. checking to see if compiler understands -Werror=nested-externs... yes
  635. checking to see if compiler understands -Werror=old-style-declaration... yes
  636. checking to see if compiler understands -Werror=old-style-definition... yes
  637. checking to see if compiler understands -Werror=strict-prototypes... yes
  638. checking to see if compiler understands -fdiagnostics-color=auto... yes
  639. checking to see if compiler understands -Wall... yes
  640. checking to see if compiler understands -Werror... yes
  641. checking to see if compiler understands -Wextra... yes
  642. checking to see if compiler understands -Wno-missing-field-initializers... yes
  643. checking to see if compiler understands -Wno-unused-parameter... yes
  644. checking to see if compiler understands -Wstrict-prototypes... yes
  645. checking to see if compiler understands -Wmissing-prototypes... yes
  646. checking to see if compiler understands -Wimplicit-function-declaration... yes
  647. checking to see if compiler understands -Wpointer-arith... yes
  648. checking to see if compiler understands -Winit-self... yes
  649. checking to see if compiler understands -Wformat=2... yes
  650. checking to see if compiler understands -Wmissing-include-dirs... yes
  651. checking to see if compiler understands -Waggregate-return... yes
  652. checking to see if compiler understands -Wdeclaration-after-statement... yes
  653. checking to see if compiler understands -D_POSIX_SOURCE... yes
  654. checking to see if compiler understands -std=c99... yes
  655. checking to see if compiler understands -Wshadow... yes
  656. checking to see if compiler understands -Wmissing-prototypes... yes
  657. checking to see if compiler understands -Wmissing-declarations... yes
  658. checking to see if compiler understands -Wstrict-prototypes... yes
  659. configure: creating ./config.status
  660. config.status: creating backends/telepathy/lib/folks-telepathy.pc
  661. config.status: creating backends/telepathy/lib/folks-telepathy-uninstalled.pc
  662. config.status: creating backends/tracker/lib/folks-tracker.deps
  663. config.status: creating backends/tracker/lib/folks-tracker.pc
  664. config.status: creating backends/tracker/lib/folks-tracker-uninstalled.pc
  665. config.status: creating backends/eds/lib/folks-eds.pc
  666. config.status: creating backends/eds/lib/folks-eds-uninstalled.pc
  667. config.status: creating folks/folks.pc
  668. config.status: creating folks/folks-uninstalled.pc
  669. config.status: creating folks/org.freedesktop.folks.gschema.xml
  670. config.status: creating Makefile
  671. config.status: creating backends/Makefile
  672. config.status: creating backends/key-file/Makefile
  673. config.status: creating backends/libsocialweb/Makefile
  674. config.status: creating backends/libsocialweb/lib/Makefile
  675. config.status: creating backends/libsocialweb/lib/folks-libsocialweb.pc
  676. config.status: creating backends/libsocialweb/lib/folks-libsocialweb-uninstalled.pc
  677. config.status: creating backends/telepathy/Makefile
  678. config.status: creating backends/telepathy/lib/Makefile
  679. config.status: creating backends/tracker/Makefile
  680. config.status: creating backends/tracker/lib/Makefile
  681. config.status: creating backends/eds/Makefile
  682. config.status: creating backends/eds/lib/Makefile
  683. config.status: creating backends/ofono/Makefile
  684. config.status: creating backends/bluez/Makefile
  685. config.status: creating folks/Makefile
  686. config.status: creating docs/Makefile
  687. config.status: creating po/Makefile.in
  688. config.status: creating tests/Makefile
  689. config.status: creating tests/data/Makefile
  690. config.status: creating tests/eds/Makefile
  691. config.status: creating tests/folks/Makefile
  692. config.status: creating tests/key-file/Makefile
  693. config.status: creating tests/libsocialweb/Makefile
  694. config.status: creating tests/telepathy/Makefile
  695. config.status: creating tests/tracker/Makefile
  696. config.status: creating tests/lib/Makefile
  697. config.status: creating tests/lib/folks-test-uninstalled.pc
  698. config.status: creating tests/lib/eds/Makefile
  699. config.status: creating tests/lib/key-file/Makefile
  700. config.status: creating tests/lib/libsocialweb/Makefile
  701. config.status: creating tests/lib/telepathy/Makefile
  702. config.status: creating tests/lib/tracker/Makefile
  703. config.status: creating tests/lib/telepathy/contactlist/Makefile
  704. config.status: creating tests/tools/Makefile
  705. config.status: creating tools/Makefile
  706. config.status: creating tools/inspect/Makefile
  707. config.status: creating config.h
  708. config.status: executing depfiles commands
  709. config.status: executing libtool commands
  710. config.status: executing po/stamp-it commands
  711.  
  712. Configure summary:
  713.  
  714. Vala........................: yes
  715. Vala Compiler...............: /usr/local/bin/valac
  716. C Compiler Flags............: -O2 -pipe -fno-strict-aliasing -Werror=implicit -Werror=missing-declarations -Werror=missing-parameter-type -Werror=missing-prototypes -Werror=nested-externs -Werror=old-style-declaration -Werror=old-style-definition -Werror=strict-prototypes -fdiagnostics-color=auto
  717. Linker Flags................: -L/usr/local/lib
  718. Prefix......................: /usr/local
  719. Bugreporting URL............: https://bugzilla.gnome.org/browse.cgi?product=folks
  720. Documentation...............: no
  721. Import tool.................: yes
  722. Inspector tool..............: yes
  723. Telepathy backend...........: yes
  724. Tracker backend.............: no
  725. Libsocialweb backend........: no
  726. E-D-S backend...............: no
  727. Ofono backend...............: yes
  728. BlueZ backend...............: yes
  729. Zeitgeist support...........: no
  730. Build tests.................: yes
  731.  
  732. ===========================================================================
  733. =======================<phase: build >============================
  734. ===> Building for folks-0.9.6
  735. gmake[1]: Entering directory `/wrkdirs/usr/ports/net-im/folks/work/folks-0.9.6'
  736. gmake all-recursive
  737. gmake[2]: Entering directory `/wrkdirs/usr/ports/net-im/folks/work/folks-0.9.6'
  738. Making all in folks
  739. gmake[3]: Entering directory `/wrkdirs/usr/ports/net-im/folks/work/folks-0.9.6/folks'
  740. CC libfolks_la-abstract-field-details.lo
  741. CC libfolks_la-alias-details.lo
  742. CC libfolks_la-avatar-details.lo
  743. CC libfolks_la-backend.lo
  744. CC libfolks_la-backend-store.lo
  745. CC libfolks_la-birthday-details.lo
  746. CC libfolks_la-email-details.lo
  747. CC libfolks_la-favourite-details.lo
  748. In file included from <built-in>:162:
  749. In file included from <command line>:7:
  750. ../folks/warnings.h:49:32: warning: unknown warning group '-Wunused-but-set-variable', ignored [-Wunknown-pragmas]
  751. #pragma GCC diagnostic ignored "-Wunused-but-set-variable"
  752. ^
  753. ../folks/warnings.h:83:32: warning: unknown warning group '-Wsuggest-attribute=format', ignored [-Wunknown-pragmas]
  754. #pragma GCC diagnostic ignored "-Wsuggest-attribute=format"
  755. ^
  756. In file included from <built-in>:162:
  757. In file included from <command line>:7:
  758. ../folks/warnings.h:49:32: warning: unknown warning group '-Wunused-but-set-variable', ignored [-Wunknown-pragmas]
  759. #pragma GCC diagnostic ignored "-Wunused-but-set-variable"
  760. ^
  761. ../folks/warnings.h:83:32: warning: unknown warning group '-Wsuggest-attribute=format', ignored [-Wunknown-pragmas]
  762. #pragma GCC diagnostic ignored "-Wsuggest-attribute=format"
  763. ^
  764. In file included from <built-in>:In file included from <built-in>:162:
  765. In file included from <command line>:7:
  766. ../folks/warnings.h:49:32: warning: unknown warning group '-Wunused-but-set-variable', ignored [-Wunknown-pragmas]
  767. 162:
  768. In file included from <command line>:7:
  769. ../folks/warnings.h:49:32: warning: unknown warning group '-Wunused-but-set-variable', ignored [-Wunknown-pragmas]
  770. #pragma GCC diagnostic ignored "-Wunused-but-set-variable"
  771. ^
  772. #pragma GCC diagnostic ignored "-Wunused-but-set-variable"
  773. ^
  774. ../folks/warnings.h:83:32: warning: unknown warning group '-Wsuggest-attribute=format', ignored [-Wunknown-pragmas]
  775. In file included from <built-in>:162:
  776. In file included from <command line>:7:
  777. ../folks/warnings.h:49:32: warning: ../folks/warnings.h:83:32#pragma GCC diagnostic ignored "-Wsuggest-attribute=format":
  778. ^warning
  779. : In file included from unknown warning group '-Wsuggest-attribute=format', ignored [-Wunknown-pragmas]<built-in>unknown warning group '-Wunused-but-set-variable', ignored [-Wunknown-pragmas]:162
  780. :
  781. In file included from <command line>:7:
  782. ../folks/warnings.h:49:32: warning: unknown warning group '-Wunused-but-set-variable', ignored [-Wunknown-pragmas]
  783. In file included from #pragma GCC diagnostic ignored "-Wunused-but-set-variable"<built-in>
  784. ^
  785. #pragma GCC diagnostic ignored "-Wunused-but-set-variable"
  786. ^
  787. In file included from <built-in>:162:
  788. In file included from <command line>:7:
  789. ../folks/warnings.h
  790. :83:32: warning: unknown warning group '-Wsuggest-attribute=format', ignored [-Wunknown-pragmas]
  791. ../folks/warnings.h:83:32: warning: unknown warning group '-Wsuggest-attribute=format', ignored [-Wunknown-pragmas]
  792. #pragma GCC diagnostic ignored "-Wsuggest-attribute=format"
  793. ^
  794. #pragma GCC diagnostic ignored "-Wsuggest-attribute=format"
  795. ^
  796. #pragma GCC diagnostic ignored "-Wsuggest-attribute=format"
  797. ^
  798. ../folks/warnings.h:49:32: warning: :162:
  799. In file included from <command line>:7:
  800. ../folks/warnings.h:49:32: warning: unknown warning group '-Wunused-but-set-variable', ignored [-Wunknown-pragmas]
  801. unknown warning group '-Wunused-but-set-variable', ignored [-Wunknown-pragmas]
  802. #pragma GCC diagnostic ignored "-Wunused-but-set-variable"
  803. ^
  804. #pragma GCC diagnostic ignored "-Wunused-but-set-variable"
  805. ^
  806. ../folks/warnings.h:83:../folks/warnings.h:83:32: warning: unknown warning group '-Wsuggest-attribute=format', ignored [-Wunknown-pragmas]
  807. #pragma GCC diagnostic ignored "-Wsuggest-attribute=format"
  808. ^
  809. 32: warning: unknown warning group '-Wsuggest-attribute=format', ignored [-Wunknown-pragmas]
  810. #pragma GCC diagnostic ignored "-Wsuggest-attribute=format"
  811. ^
  812. backend-store.c:827:38: warning: incompatible pointer types passing 'GeeMap *' (aka 'struct _GeeMap *') to parameter of type 'GeeAbstractMap *' (aka 'struct _GeeAbstractMap *') [-Wincompatible-pointer-types]
  813. _tmp3_ = gee_abstract_map_get_size ((GeeMap*) _tmp2_);
  814. ^~~~~~~~~~~~~~~~
  815. /usr/local/include/gee-0.8/gee.h:1454:49: note: passing argument to parameter 'self' here
  816. gint gee_abstract_map_get_size (GeeAbstractMap* self);
  817. ^
  818. backend-store.c:841:41: warning: incompatible pointer types passing 'GeeMap *' (aka 'struct _GeeMap *') to parameter of type 'GeeAbstractMap *' (aka 'struct _GeeAbstractMap *') [-Wincompatible-pointer-types]
  819. _tmp7_ = gee_abstract_map_get_values ((GeeMap*) _tmp6_);
  820. ^~~~~~~~~~~~~~~~
  821. /usr/local/include/gee-0.8/gee.h:1457:61: note: passing argument to parameter 'self' here
  822. GeeCollection* gee_abstract_map_get_values (GeeAbstractMap* self);
  823. ^
  824. backend-store.c:1321:49: warning: incompatible pointer types passing 'GeeMap *' (aka 'struct _GeeMap *') to parameter of type 'GeeAbstractMap *' (aka 'struct _GeeAbstractMap *') [-Wincompatible-pointer-types]
  825. _data_->_tmp2_ = gee_abstract_map_get_values ((GeeMap*) _data_->_tmp1_);
  826. ^~~~~~~~~~~~~~~~~~~~~~~~
  827. /usr/local/include/gee-0.8/gee.h:1457:61: note: passing argument to parameter 'self' here
  828. GeeCollection* gee_abstract_map_get_values (GeeAbstractMap* self);
  829. ^
  830. backend-store.c:1454:57: warning: incompatible pointer types passing 'GeeMap *' (aka 'struct _GeeMap *') to parameter of type 'GeeAbstractMap *' (aka 'struct _GeeAbstractMap *') [-Wincompatible-pointer-types]
  831. _data_->_tmp39_ = gee_abstract_map_get_entries ((GeeMap*) G_TYPE_CHECK_INSTANCE_CAST (_data_->_tmp38_, GEE_TYPE_HASH_MAP, GeeHashMap));
  832. ^~~~~~~~~~~~~~~~~~~~~~~~~~~~~~~~~~~~~~~~~~~~~~~~~~~~~~~~~~~~~~~~~~~~~~~~~~~~~~~~~~~~~
  833. /usr/local/include/gee-0.8/gee.h:1458:55: note: passing argument to parameter 'self' here
  834. GeeSet* gee_abstract_map_get_entries (GeeAbstractMap* self);
  835. ^
  836. backend-store.c:1491:26: warning: assigning to 'GFile *' (aka 'struct _GFile *') from 'gconstpointer' (aka 'const void *') discards qualifiers [-Wincompatible-pointer-types-discards-qualifiers]
  837. _data_->_tmp54_ = _data_->_tmp53_;
  838. ^ ~~~~~~~~~~~~~~~
  839. abstract-field-details.c:1038:31: warning: passing 'gconstpointer' (aka 'const void *') to parameter of type 'gpointer' (aka 'void *') discards qualifiers [-Wincompatible-pointer-types-discards-qualifiers]
  840. g_value_set_pointer (value, folks_abstract_field_details_get_value (self));backend-store.c:1515:50: warning: incompatible pointer types passing 'GeeMap *' (aka 'struct _GeeMap *') to parameter of type 'GeeAbstractMap *' (aka 'struct _GeeAbstractMap *') [-Wincompatible-pointer-types]
  841. _data_->_tmp57_ = gee_abstract_map_get_values ((GeeMap*) _data_->_tmp56_);
  842. ^~~~~~~~~~~~~~~~~~~~~~~~~
  843. /usr/local/include/gee-0.8/gee.h:1457:61: note: passing argument to parameter 'self' here
  844. GeeCollection* gee_abstract_map_get_values (GeeAbstractMap* self);
  845. ^
  846.  
  847. ^~~~~~~~~~~~~~~~~~~~~~~~~~~~~~~~~~~~~~~~~~~~~
  848. /usr/local/include/glib-2.0/gobject/gvaluetypes.h:250:22: note: passing argument to parameter 'v_pointer' here2
  849. gpointer v_pointer);
  850. ^
  851. warnings generated.
  852. backend-store.c:1552:50: warning: incompatible pointer types passing 'GeeMap *' (aka 'struct _GeeMap *') to parameter of type 'GeeAbstractMap *' (aka 'struct _GeeAbstractMap *') [-Wincompatible-pointer-types]
  853. _data_->_tmp68_ = gee_abstract_map_get_values ((GeeMap*) _data_->_tmp67_);
  854. ^~~~~~~~~~~~~~~~~~~~~~~~~
  855. /usr/local/include/gee-0.8/gee.h:1457:61: note: passing argument to parameter 'self' here
  856. GeeCollection* gee_abstract_map_get_values (GeeAbstractMap* self);
  857. ^
  858. 2 warnings generated.
  859. 2 warnings generated.
  860. CC libfolks_la-folks-namespace.lo
  861. CC libfolks_la-gender-details.lo
  862. CC libfolks_la-group-details.lo
  863. backend-store.c:2226:40: warning: incompatible pointer types passing 'GeeMap *' (aka 'struct _GeeMap *') to parameter of type 'GeeAbstractMap *' (aka 'struct _GeeAbstractMap *') [-Wincompatible-pointer-types]
  864. _tmp1_ = gee_abstract_map_get_values ((GeeMap*) _tmp0_);
  865. ^~~~~~~~~~~~~~~~
  866. /usr/local/include/gee-0.8/gee.h:1457:61: note: passing argument to parameter 'self' here
  867. GeeCollection* gee_abstract_map_get_values (GeeAbstractMap* self);
  868. ^
  869. 2 warnings generated.
  870. backend-store.c:2636:56: warning: incompatible pointer types passing 'GeeMap *' (aka 'struct _GeeMap *') to parameter of type 'GeeAbstractMap *' (aka 'struct _GeeAbstractMap *') [-Wincompatible-pointer-types]
  871. _data_->_tmp39_ = gee_abstract_map_get_entries ((GeeMap*) G_TYPE_CHECK_INSTANCE_CAST (_data_->_tmp38_, GEE_TYPE_HASH_MAP, GeeHashMap));
  872. ^~~~~~~~~~~~~~~~~~~~~~~~~~~~~~~~~~~~~~~~~~~~~~~~~~~~~~~~~~~~~~~~~~~~~~~~~~~~~~~~~~~~~
  873. /usr/local/include/gee-0.8/gee.h:1458:55: note: passing argument to parameter 'self' here
  874. GeeSet* gee_abstract_map_get_entries (GeeAbstractMap* self);
  875. ^
  876. backend-store.c:2673:25: warning: assigning to 'GFile *' (aka 'struct _GFile *') from 'gconstpointer' (aka 'const void *') discards qualifiers [-Wincompatible-pointer-types-discards-qualifiers]
  877. _data_->_tmp54_ = _data_->_tmp53_;
  878. ^ ~~~~~~~~~~~~~~~
  879. 2 warnings generated.
  880. 2 warnings generated.
  881. CC libfolks_la-web-service-details.lo
  882. CC libfolks_la-im-details.lo
  883. backend-store.c:3295:64: warning: incompatible pointer types passing 'guint8 **' (aka 'unsigned char **') to parameter of type 'char **' [-Wincompatible-pointer-types]
  884. g_file_load_contents_finish (_data_->_tmp44_, _data_->_res_, &_data_->_tmp45_, &_data_->_tmp46_, NULL, &_data_->_inner_error_);
  885. ^~~~~~~~~~~~~~~~
  886. /usr/local/include/glib-2.0/gio/gfile.h:1193:36: note: passing argument to parameter 'contents' here
  887. char **contents,
  888. ^
  889. In file included from <built-in>:162:
  890. In file included from <command line>:7:
  891. ../folks/warnings.h:49:32: warning: unknown warning group '-Wunused-but-set-variable', ignored [-Wunknown-pragmas]
  892. #pragma GCC diagnostic ignored "-Wunused-but-set-variable"
  893. ^
  894. ../folks/warnings.h:83:32: warning: unknown warning group '-Wsuggest-attribute=format', ignored [-Wunknown-pragmas]
  895. #pragma GCC diagnostic ignored "-Wsuggest-attribute=format"
  896. ^
  897. In file included from <built-in>:162:
  898. In file included from <command line>:7:
  899. ../folks/warnings.h:49:32: warning: unknown warning group '-Wunused-but-set-variable', ignored [-Wunknown-pragmas]
  900. #pragma GCC diagnostic ignored "-Wunused-but-set-variable"
  901. ^
  902. ../folks/warnings.h:83:32: warning: unknown warning group '-Wsuggest-attribute=format', ignored [-Wunknown-pragmas]
  903. #pragma GCC diagnostic ignored "-Wsuggest-attribute=format"
  904. ^
  905. CC libfolks_la-interaction-details.lo
  906. backend-store.c:3506:50: warning: passing 'guint8 *' (aka 'unsigned char *') to parameter of type 'const char *' converts between pointers to integer types with different sign [-Wpointer-sign]
  907. g_file_replace_contents_async (_data_->_tmp5_, _data_->_tmp7_, (gsize) _data_->_tmp7__length1, NULL, FALSE, G_FILE_CREATE_PRIVATE, NULL, _folks_backend_store_save_key_file_ready, _data_);
  908. ^~~~~~~~~~~~~~
  909. /usr/local/include/glib-2.0/gio/gfile.h:1222:36: note: passing argument to parameter 'contents' here
  910. const char *contents,
  911. ^
  912. In file included from <built-in>:162:
  913. In file included from <command line>:7:
  914. ../folks/warnings.h:49:32: warning: unknown warning group '-Wunused-but-set-variable', ignored [-Wunknown-pragmas]
  915. #pragma GCC diagnostic ignored "-Wunused-but-set-variable"
  916. ^
  917. ../folks/warnings.h:83:32: warning: unknown warning group '-Wsuggest-attribute=format', ignored [-Wunknown-pragmas]
  918. #pragma GCC diagnostic ignored "-Wsuggest-attribute=format"
  919. ^
  920. backend-store.c:3710:41: warning: incompatible pointer types passing 'GeeMap *' (aka 'struct _GeeMap *') to parameter of type 'GeeAbstractMap *' (aka 'struct _GeeAbstractMap *') [-Wincompatible-pointer-types]
  921. _tmp1_ = gee_abstract_map_get_values ((GeeMap*) _tmp0_);
  922. ^~~~~~~~~~~~~~~~
  923. /usr/local/include/gee-0.8/gee.h:1457:61: note: passing argument to parameter 'self' here
  924. GeeCollection* gee_abstract_map_get_values (GeeAbstractMap* self);
  925. ^
  926. In file included from <built-in>:162:
  927. In file included from <command line>:7:
  928. ../folks/warnings.h:49:32: warning: unknown warning group '-Wunused-but-set-variable', ignored [-Wunknown-pragmas]
  929. #pragma GCC diagnostic ignored "-Wunused-but-set-variable"
  930. ^
  931. ../folks/warnings.h:83:32: warning: unknown warning group '-Wsuggest-attribute=format', ignored [-Wunknown-pragmas]
  932. #pragma GCC diagnostic ignored "-Wsuggest-attribute=format"
  933. ^
  934. In file included from <built-in>:162:
  935. In file included from <command line>:7:
  936. ../folks/warnings.h:49:32: warning: unknown warning group '-Wunused-but-set-variable', ignored [-Wunknown-pragmas]
  937. #pragma GCC diagnostic ignored "-Wunused-but-set-variable"
  938. ^
  939. ../folks/warnings.h:83:32: warning: unknown warning group '-Wsuggest-attribute=format', ignored [-Wunknown-pragmas]
  940. #pragma GCC diagnostic ignored "-Wsuggest-attribute=format"
  941. ^
  942. In file included from <built-in>:162:
  943. In file included from <command line>:7:
  944. ../folks/warnings.h:49:32: warning: unknown warning group '-Wunused-but-set-variable', ignored [-Wunknown-pragmas]
  945. #pragma GCC diagnostic ignored "-Wunused-but-set-variable"
  946. ^
  947. ../folks/warnings.h:83:32: warning: unknown warning group '-Wsuggest-attribute=format', ignored [-Wunknown-pragmas]
  948. #pragma GCC diagnostic ignored "-Wsuggest-attribute=format"
  949. ^
  950. 3 warnings generated.
  951. 2 warnings generated.
  952. CC libfolks_la-local-id-details.lo
  953. CC libfolks_la-location-details.lo
  954. In file included from <built-in>:162:
  955. In file included from <command line>:7:
  956. ../folks/warnings.h:49:32: warning: unknown warning group '-Wunused-but-set-variable', ignored [-Wunknown-pragmas]
  957. #pragma GCC diagnostic ignored "-Wunused-but-set-variable"
  958. ^
  959. ../folks/warnings.h:83:32: warning: unknown warning group '-Wsuggest-attribute=format', ignored [-Wunknown-pragmas]
  960. #pragma GCC diagnostic ignored "-Wsuggest-attribute=format"In file included from <built-in>:162:
  961. In file included from <command line>:7:
  962. ../folks/warnings.h:49:32: warning: unknown warning group '-Wunused-but-set-variable', ignored [-Wunknown-pragmas]
  963. #pragma GCC diagnostic ignored "-Wunused-but-set-variable"
  964. ^
  965. ../folks/warnings.h:83
  966. ^
  967. :32: warning: unknown warning group '-Wsuggest-attribute=format', ignored [-Wunknown-pragmas]
  968. #pragma GCC diagnostic ignored "-Wsuggest-attribute=format"
  969. ^
  970. 2 warnings generated.
  971. CC libfolks_la-name-details.lo
  972. In file included from <built-in>:162:
  973. In file included from <command line>:7:
  974. ../folks/warnings.h:49:32: warning: unknown warning group '-Wunused-but-set-variable', ignored [-Wunknown-pragmas]
  975. #pragma GCC diagnostic ignored "-Wunused-but-set-variable"
  976. ^
  977. ../folks/warnings.h:83:32: warning: unknown warning group '-Wsuggest-attribute=format', ignored [-Wunknown-pragmas]
  978. #pragma GCC diagnostic ignored "-Wsuggest-attribute=format"
  979. ^
  980. 2 warnings generated.
  981. CC libfolks_la-note-details.lo
  982. 2 warnings generated.
  983. In file included from <built-in>:162:
  984. In file included from <command line>:7:
  985. ../folks/warnings.h:49:32: warning: unknown warning group '-Wunused-but-set-variable', ignored [-Wunknown-pragmas]
  986. #pragma GCC diagnostic ignored "-Wunused-but-set-variable"
  987. ^
  988. ../folks/warnings.h:83:32: warning: unknown warning group '-Wsuggest-attribute=format', ignored [-Wunknown-pragmas]
  989. #pragma GCC diagnostic ignored "-Wsuggest-attribute=format"
  990. ^
  991. CC libfolks_la-phone-details.lo
  992. 2 warnings generated.
  993. CC libfolks_la-postal-address-details.lo
  994. In file included from <built-in>:162:
  995. In file included from <command line>:7:
  996. ../folks/warnings.h:49:32: warning: unknown warning group '-Wunused-but-set-variable', ignored [-Wunknown-pragmas]
  997. #pragma GCC diagnostic ignored "-Wunused-but-set-variable"
  998. ^
  999. ../folks/warnings.h:83:32: warning: unknown warning group '-Wsuggest-attribute=format', ignored [-Wunknown-pragmas]
  1000. #pragma GCC diagnostic ignored "-Wsuggest-attribute=format"
  1001. ^
  1002. In file included from <built-in>:162:
  1003. In file included from <command line>:7:
  1004. ../folks/warnings.h:49:32: warning: unknown warning group '-Wunused-but-set-variable', ignored [-Wunknown-pragmas]
  1005. #pragma GCC diagnostic ignored "-Wunused-but-set-variable"
  1006. ^
  1007. ../folks/warnings.h:83:32: warning: unknown warning group '-Wsuggest-attribute=format', ignored [-Wunknown-pragmas]
  1008. #pragma GCC diagnostic ignored "-Wsuggest-attribute=format"
  1009. ^
  1010. 2 warnings generated.
  1011. 2 warnings generated.
  1012. CC libfolks_la-presence-details.lo
  1013. 2 warnings generated.
  1014. CC libfolks_la-role-details.lo
  1015. CC libfolks_la-url-details.lo
  1016. In file included from <built-in>:162:
  1017. In file included from <command line>:7:
  1018. ../folks/warnings.h:49:32: warning: unknown warning group '-Wunused-but-set-variable', ignored [-Wunknown-pragmas]
  1019. #pragma GCC diagnostic ignored "-Wunused-but-set-variable"
  1020. ^
  1021. ../folks/warnings.h:83:32: warning: unknown warning group '-Wsuggest-attribute=format', ignored [-Wunknown-pragmas]
  1022. #pragma GCC diagnostic ignored "-Wsuggest-attribute=format"
  1023. ^
  1024. In file included from <built-in>:162:
  1025. In file included from <command line>:7:
  1026. ../folks/warnings.h:49:32: warning: unknown warning group '-Wunused-but-set-variable', ignored [-Wunknown-pragmas]
  1027. #pragma GCC diagnostic ignored "-Wunused-but-set-variable"
  1028. ^
  1029. ../folks/warnings.h:83:32: warning: unknown warning group '-Wsuggest-attribute=format', ignored [-Wunknown-pragmas]
  1030. #pragma GCC diagnostic ignored "-Wsuggest-attribute=format"
  1031. ^
  1032. In file included from <built-in>:162:
  1033. In file included from <command line>:7:
  1034. ../folks/warnings.h:49:32: warning: unknown warning group '-Wunused-but-set-variable', ignored [-Wunknown-pragmas]
  1035. #pragma GCC diagnostic ignored "-Wunused-but-set-variable"
  1036. ^
  1037. ../folks/warnings.h:83:32: warning: unknown warning group '-Wsuggest-attribute=format', ignored [-Wunknown-pragmas]
  1038. #pragma GCC diagnostic ignored "-Wsuggest-attribute=format"
  1039. ^
  1040. 15 warnings generated.
  1041. CC libfolks_la-individual.lo
  1042. In file included from <built-in>:162:
  1043. In file included from <command line>:7:
  1044. ../folks/warnings.h:49:32: warning: unknown warning group '-Wunused-but-set-variable', ignored [-Wunknown-pragmas]
  1045. #pragma GCC diagnostic ignored "-Wunused-but-set-variable"
  1046. ^
  1047. ../folks/warnings.h:83:32: warning: unknown warning group '-Wsuggest-attribute=format', ignored [-Wunknown-pragmas]
  1048. #pragma GCC diagnostic ignored "-Wsuggest-attribute=format"
  1049. ^
  1050. phone-details.c:534:36: warning: passing 'const gchar [6]' to parameter of type 'gchar *' (aka 'char *') discards qualifiers [-Wincompatible-pointer-types-discards-qualifiers]
  1051. if (_vala_char_array_contains (FOLKS_PHONE_FIELD_DETAILS__extension_chars, G_N_ELEMENTS (FOLKS_PHONE_FIELD_DETAILS__extension_chars), _tmp13_)) {
  1052. ^~~~~~~~~~~~~~~~~~~~~~~~~~~~~~~~~~~~~~~~~~
  1053. phone-details.c:471:51: note: passing argument to parameter 'stack' here
  1054. static gboolean _vala_char_array_contains (gchar* stack, int stack_length, gchar needle) {
  1055. ^
  1056. phone-details.c:583:38: warning: passing 'const gchar [8]' to parameter of type 'gchar *' (aka 'char *') discards qualifiers [-Wincompatible-pointer-types-discards-qualifiers]
  1057. if (_vala_char_array_contains (FOLKS_PHONE_FIELD_DETAILS__common_delimiters, G_N_ELEMENTS (FOLKS_PHONE_FIELD_DETAILS__common_delimiters), _tmp29_)) {
  1058. ^~~~~~~~~~~~~~~~~~~~~~~~~~~~~~~~~~~~~~~~~~~~
  1059. phone-details.c:471:51: note: passing argument to parameter 'stack' here
  1060. static gboolean _vala_char_array_contains (gchar* stack, int stack_length, gchar needle) {
  1061. ^
  1062. phone-details.c:588:39: warning: passing 'const gchar [12]' to parameter of type 'gchar *' (aka 'char *') discards qualifiers [-Wincompatible-pointer-types-discards-qualifiers]
  1063. if (_vala_char_array_contains (FOLKS_PHONE_FIELD_DETAILS__valid_digits, G_N_ELEMENTS (FOLKS_PHONE_FIELD_DETAILS__valid_digits), _tmp30_)) {
  1064. ^~~~~~~~~~~~~~~~~~~~~~~~~~~~~~~~~~~~~~~
  1065. phone-details.c:471:51: note: passing argument to parameter 'stack' here
  1066. static gboolean _vala_char_array_contains (gchar* stack, int stack_length, gchar needle) {
  1067. ^
  1068. phone-details.c:674:36: warning: passing 'const gchar [6]' to parameter of type 'gchar *' (aka 'char *') discards qualifiers [-Wincompatible-pointer-types-discards-qualifiers]
  1069. if (_vala_char_array_contains (FOLKS_PHONE_FIELD_DETAILS__extension_chars, G_N_ELEMENTS (FOLKS_PHONE_FIELD_DETAILS__extension_chars), _tmp11_)) {
  1070. ^~~~~~~~~~~~~~~~~~~~~~~~~~~~~~~~~~~~~~~~~~
  1071. phone-details.c:471:51: note: passing argument to parameter 'stack' here
  1072. static gboolean _vala_char_array_contains (gchar* stack, int stack_length, gchar needle) {
  1073. ^
  1074. 2 warnings generated.
  1075. 2 warnings generated.
  1076. CC libfolks_la-individual-aggregator.lo
  1077. 2 warnings generated.
  1078. postal-address-details.c:1165:9: warning: assigning to 'FolksPostalAddress *' (aka 'struct _FolksPostalAddress *') from 'gconstpointer' (aka 'const void *') discards qualifiers [-Wincompatible-pointer-types-discards-qualifiers]
  1079. _tmp3_ = _tmp2_;
  1080. ^ ~~~~~~
  1081. postal-address-details.c:1170:9: warning: assigning to 'FolksPostalAddress *' (aka 'struct _FolksPostalAddress *') from 'gconstpointer' (aka 'const void *') discards qualifiers [-Wincompatible-pointer-types-discards-qualifiers]
  1082. _tmp8_ = _tmp7_;
  1083. ^ ~~~~~~
  1084. postal-address-details.c:1199:9: warning: assigning to 'FolksPostalAddress *' (aka 'struct _FolksPostalAddress *') from 'gconstpointer' (aka 'const void *') discards qualifiers [-Wincompatible-pointer-types-discards-qualifiers]
  1085. _tmp2_ = _tmp1_;
  1086. ^ ~~~~~~
  1087. postal-address-details.c:1247:9: warning: assigning to 'FolksPostalAddress *' (aka 'struct _FolksPostalAddress *') from 'gconstpointer' (aka 'const void *') discards qualifiers [-Wincompatible-pointer-types-discards-qualifiers]
  1088. _tmp7_ = _tmp6_;
  1089. ^ ~~~~~~
  1090. postal-address-details.c:1255:11: warning: assigning to 'FolksPostalAddress *' (aka 'struct _FolksPostalAddress *') from 'gconstpointer' (aka 'const void *') discards qualifiers [-Wincompatible-pointer-types-discards-qualifiers]
  1091. _tmp11_ = _tmp10_;
  1092. ^ ~~~~~~~
  1093. postal-address-details.c:1275:9: warning: assigning to 'FolksPostalAddress *' (aka 'struct _FolksPostalAddress *') from 'gconstpointer' (aka 'const void *') discards qualifiers [-Wincompatible-pointer-types-discards-qualifiers]
  1094. _tmp3_ = _tmp2_;
  1095. ^ ~~~~~~
  1096. postal-address-details.c:1284:10: warning: assigning to 'FolksPostalAddress *' (aka 'struct _FolksPostalAddress *') from 'gconstpointer' (aka 'const void *') discards qualifiers [-Wincompatible-pointer-types-discards-qualifiers]
  1097. _tmp7_ = _tmp6_;
  1098. ^ ~~~~~~
  1099. postal-address-details.c:1307:9: warning: assigning to 'FolksPostalAddress *' (aka 'struct _FolksPostalAddress *') from 'gconstpointer' (aka 'const void *') discards qualifiers [-Wincompatible-pointer-types-discards-qualifiers]
  1100. _tmp1_ = _tmp0_;
  1101. ^ ~~~~~~
  1102. CC libfolks_la-persona.lo
  1103. CC libfolks_la-persona-store.lo
  1104. In file included from <built-in>:162:
  1105. In file included from <command line>:7:
  1106. ../folks/warnings.h:49:32: warning: unknown warning group '-Wunused-but-set-variable', ignored [-Wunknown-pragmas]
  1107. #pragma GCC diagnostic ignored "-Wunused-but-set-variable"
  1108. ^
  1109. ../folks/warnings.h:83:32: warning: unknown warning group '-Wsuggest-attribute=format', ignored [-Wunknown-pragmas]
  1110. #pragma GCC diagnostic ignored "-Wsuggest-attribute=format"
  1111. ^
  1112. In file included from <built-in>:162:
  1113. In file included from <command line>:7:
  1114. ../folks/warnings.h:49:32: warning: unknown warning group '-Wunused-but-set-variable', ignored [-Wunknown-pragmas]
  1115. #pragma GCC diagnostic ignored "-Wunused-but-set-variable"
  1116. ^
  1117. ../folks/warnings.h:83:32: warning: unknown warning group '-Wsuggest-attribute=format', ignored [-Wunknown-pragmas]
  1118. #pragma GCC diagnostic ignored "-Wsuggest-attribute=format"
  1119. ^
  1120. In file included from <built-in>:162:
  1121. In file included from <command line>:7:
  1122. ../folks/warnings.h:49:32: warning: unknown warning group '-Wunused-but-set-variable', ignored [-Wunknown-pragmas]
  1123. #pragma GCC diagnostic ignored "-Wunused-but-set-variable"
  1124. ^
  1125. ../folks/warnings.h:83:32: warning: unknown warning group '-Wsuggest-attribute=format', ignored [-Wunknown-pragmas]
  1126. #pragma GCC diagnostic ignored "-Wsuggest-attribute=format"
  1127. ^
  1128. role-details.c:764:9: warning: assigning to 'FolksRole *' (aka 'struct _FolksRole *') from 'gconstpointer' (aka 'const void *') discards qualifiers [-Wincompatible-pointer-types-discards-qualifiers]
  1129. _tmp8_ = _tmp7_;
  1130. ^ ~~~~~~
  1131. role-details.c:767:10: warning: assigning to 'FolksRole *' (aka 'struct _FolksRole *') from 'gconstpointer' (aka 'const void *') discards qualifiers [-Wincompatible-pointer-types-discards-qualifiers]
  1132. _tmp11_ = _tmp10_;
  1133. ^ ~~~~~~~
  1134. role-details.c:794:9: warning: assigning to 'FolksRole *' (aka 'struct _FolksRole *') from 'gconstpointer' (aka 'const void *') discards qualifiers [-Wincompatible-pointer-types-discards-qualifiers]
  1135. _tmp2_ = _tmp1_;
  1136. ^ ~~~~~~
  1137. role-details.c:842:9: warning: assigning to 'FolksRole *' (aka 'struct _FolksRole *') from 'gconstpointer' (aka 'const void *') discards qualifiers [-Wincompatible-pointer-types-discards-qualifiers]
  1138. _tmp7_ = _tmp6_;
  1139. ^ ~~~~~~
  1140. role-details.c:850:11: warning: assigning to 'FolksRole *' (aka 'struct _FolksRole *') from 'gconstpointer' (aka 'const void *') discards qualifiers [-Wincompatible-pointer-types-discards-qualifiers]
  1141. _tmp11_ = _tmp10_;
  1142. ^ ~~~~~~~
  1143. role-details.c:870:9: warning: assigning to 'FolksRole *' (aka 'struct _FolksRole *') from 'gconstpointer' (aka 'const void *') discards qualifiers [-Wincompatible-pointer-types-discards-qualifiers]
  1144. _tmp3_ = _tmp2_;
  1145. ^ ~~~~~~
  1146. role-details.c:879:10: warning: assigning to 'FolksRole *' (aka 'struct _FolksRole *') from 'gconstpointer' (aka 'const void *') discards qualifiers [-Wincompatible-pointer-types-discards-qualifiers]
  1147. _tmp7_ = _tmp6_;
  1148. ^ ~~~~~~
  1149. role-details.c:902:9: warning: assigning to 'FolksRole *' (aka 'struct _FolksRole *') from 'gconstpointer' (aka 'const void *') discards qualifiers [-Wincompatible-pointer-types-discards-qualifiers]
  1150. _tmp1_ = _tmp0_;
  1151. ^ ~~~~~~
  1152. 6 warnings generated.
  1153. CC libfolks_la-types.lo
  1154. In file included from <built-in>:162:
  1155. In file included from <command line>:7:
  1156. ../folks/warnings.h:49:32: warning: unknown warning group '-Wunused-but-set-variable', ignored [-Wunknown-pragmas]
  1157. #pragma GCC diagnostic ignored "-Wunused-but-set-variable"
  1158. ^
  1159. ../folks/warnings.h:83:32: warning: unknown warning group '-Wsuggest-attribute=format', ignored [-Wunknown-pragmas]
  1160. #pragma GCC diagnostic ignored "-Wsuggest-attribute=format"
  1161. ^
  1162. 2 warnings generated.
  1163. CC libfolks_la-debug.lo
  1164. In file included from <built-in>:162:
  1165. In file included from <command line>:7:
  1166. ../folks/warnings.h:49:32: warning: unknown warning group '-Wunused-but-set-variable', ignored [-Wunknown-pragmas]
  1167. #pragma GCC diagnostic ignored "-Wunused-but-set-variable"
  1168. ^
  1169. ../folks/warnings.h:83:32: warning: unknown warning group '-Wsuggest-attribute=format', ignored [-Wunknown-pragmas]
  1170. #pragma GCC diagnostic ignored "-Wsuggest-attribute=format"
  1171. ^
  1172. 10 warnings generated.
  1173. individual.c:3427:23: warning: assigning to 'FolksIndividual_Notifier *' (aka 'struct _FolksIndividual_Notifier *') from 'const FolksIndividual_Notifier [25]' discards qualifiers [-Wincompatible-pointer-types-discards-qualifiers]
  1174. notifier_collection = FOLKS_INDIVIDUAL__notifiers;
  1175. ^ ~~~~~~~~~~~~~~~~~~~~~~~~~~~
  1176. CC libfolks_la-utils.lo
  1177. 2 warnings generated.
  1178. individual.c:3920:74: warning: passing 'const gchar *' (aka 'const char *') to parameter of type 'gchar *' (aka 'char *') discards qualifiers [-Wincompatible-pointer-types-discards-qualifiers]
  1179. a_is_writeable = _vala_string_array_contains (_tmp37_, _tmp37__length1, _tmp34_);
  1180. ^~~~~~~
  1181. individual.c:1665:86: note: passing argument to parameter 'needle' here
  1182. static gboolean _vala_string_array_contains (gchar** stack, int stack_length, gchar* needle) {
  1183. ^
  1184. individual.c:3926:74: warning: passing 'const gchar *' (aka 'const char *') to parameter of type 'gchar *' (aka 'char *') discards qualifiers [-Wincompatible-pointer-types-discards-qualifiers]
  1185. b_is_writeable = _vala_string_array_contains (_tmp41_, _tmp41__length1, _tmp38_);
  1186. ^~~~~~~
  1187. individual.c:1665:86: note: passing argument to parameter 'needle' here
  1188. static gboolean _vala_string_array_contains (gchar** stack, int stack_length, gchar* needle) {
  1189. ^
  1190. individual.c:3968:11: warning: incompatible pointer types assigning to 'GCompareFunc' (aka 'gint (*)(gconstpointer, gconstpointer)') from 'int (const char *, const char *)' [-Wincompatible-pointer-types]
  1191. _tmp55_ = g_strcmp0;
  1192. ^ ~~~~~~~~~
  1193. individual.c:3985:29: warning: passing 'gconstpointer' (aka 'const void *') to parameter of type 'FolksPersona *' (aka 'struct _FolksPersona *') discards qualifiers [-Wincompatible-pointer-types-discards-qualifiers]
  1194. result = __lambda2_ (self, a, b);
  1195. ^
  1196. individual.c:3781:60: note: passing argument to parameter 'a' here
  1197. static gint __lambda2_ (Block2Data* _data2_, FolksPersona* a, FolksPersona* b) {
  1198. ^
  1199. individual.c:3985:32: warning: passing 'gconstpointer' (aka 'const void *') to parameter of type 'FolksPersona *' (aka 'struct _FolksPersona *') discards qualifiers [-Wincompatible-pointer-types-discards-qualifiers]
  1200. result = __lambda2_ (self, a, b);
  1201. ^
  1202. individual.c:3781:77: note: passing argument to parameter 'b' here
  1203. static gint __lambda2_ (Block2Data* _data2_, FolksPersona* a, FolksPersona* b) {
  1204. ^
  1205. individual.c:4108:57: warning: expression result unused; should this cast be to 'void'? [-Wunused-value]
  1206. (primary_compare_func_target_destroy_notify == NULL) ? NULL : (primary_compare_func_target_destroy_notify (primary_compare_func_target), NULL);
  1207. ^
  1208. CC libfolks_la-potential-match.lo
  1209. /usr/include/sys/_null.h:32:15: note: expanded from macro 'NULL'
  1210. #define NULL ((void *)0)
  1211. ^
  1212. 10 warnings generated.
  1213. individual.c:4530:27: warning: incompatible pointer types passing 'void (gconstpointer, gpointer)' to parameter of type 'GFunc' (aka 'void (*)(gpointer, gpointer)') [-Wincompatible-pointer-types]
  1214. g_list_foreach (_tmp77_, ___lambda62__gfunc, _data3_);
  1215. ^~~~~~~~~~~~~~~~~~
  1216. /usr/local/include/glib-2.0/glib/glist.h:133:25: note: passing argument to parameter 'func' here
  1217. GFunc func,
  1218. ^
  1219. individual.c: CC libfolks_la-avatar-cache.lo
  1220. 4588:24: warning: passing 'gconstpointer' (aka 'const void *') to parameter of type 'FolksPersona *' (aka 'struct _FolksPersona *') discards qualifiers [-Wincompatible-pointer-types-discards-qualifiers]
  1221. result = __lambda10_ (a, b);
  1222. ^
  1223. individual.c:4559:40: note: passing argument to parameter 'a' here
  1224. static gint __lambda10_ (FolksPersona* a, FolksPersona* b) {
  1225. ^
  1226. individual.c:4588:27: warning: passing 'gconstpointer' (aka 'const void *') to parameter of type 'FolksPersona *' (aka 'struct _FolksPersona *') discards qualifiers [-Wincompatible-pointer-types-discards-qualifiers]
  1227. result = __lambda10_ (a, b);
  1228. ^
  1229. individual.c:4559:57: note: passing argument to parameter 'b' here
  1230. static gint __lambda10_ (FolksPersona* a, FolksPersona* b) {
  1231. ^
  1232. individual-aggregator.c:1790:15: warning: assigning to 'GPtrArray *' (aka 'struct _GPtrArray *') from 'gconstpointer' (aka 'const void *') discards qualifiers [-Wincompatible-pointer-types-discards-qualifiers]
  1233. individuals = _tmp105_;
  1234. ^ ~~~~~~~~
  1235. individual.c:4829:24: warning: passing 'gconstpointer' (aka 'const void *') to parameter of type 'FolksPersona *' (aka 'struct _FolksPersona *') discards qualifiers [-Wincompatible-pointer-types-discards-qualifiers]
  1236. result = __lambda19_ (a, b);
  1237. ^
  1238. individual.c:4782:40: note: passing argument to parameter 'a' here
  1239. static gint __lambda19_ (FolksPersona* a, FolksPersona* b) {
  1240. ^
  1241. individual.c:4829:27: warning: passing 'gconstpointer' (aka 'const void *') to parameter of type 'FolksPersona *' (aka 'struct _FolksPersona *') discards qualifiers [-Wincompatible-pointer-types-discards-qualifiers]
  1242. result = __lambda19_ (a, b);
  1243. ^
  1244. individual.c:4782:57: note: passing argument to parameter 'b' here
  1245. static gint __lambda19_ (FolksPersona* a, FolksPersona* b) {
  1246. ^
  1247. In file included from <built-in>:162:
  1248. In file included from <command line>:7:
  1249. ../folks/warnings.h:49:32: warning: unknown warning group '-Wunused-but-set-variable', ignored [-Wunknown-pragmas]
  1250. #pragma GCC diagnostic ignored "-Wunused-but-set-variable"individual.c:4881:14: warning: passing 'const gchar *' (aka 'const char *') to parameter of type 'gchar *' (aka 'char *') discards qualifiers [-Wincompatible-pointer-types-discards-qualifiers]
  1251. g_strstrip (_tmp1_);
  1252. ^~~~~~
  1253. /usr/local/include/glib-2.0/glib/gstrfuncs.h:180:53: note: expanded from macro 'g_strstrip'
  1254. #define g_strstrip( string ) g_strchomp (g_strchug (string))
  1255. ^
  1256. /usr/local/include/glib-2.0/glib/gstrfuncs.h:175:55: note: passing argument to parameter 'string' here
  1257. gchar* g_strchug (gchar *string);
  1258. ^
  1259.  
  1260. ^
  1261. ../folks/warnings.h:83:32: warning: unknown warning group '-Wsuggest-attribute=format', ignored [-Wunknown-pragmas]
  1262. #pragma GCC diagnostic ignored "-Wsuggest-attribute=format"
  1263. ^
  1264. individual-aggregator.c:2145:52: warning: incompatible pointer types passing 'GeeMap *' (aka 'struct _GeeMap *') to parameter of type 'GeeAbstractMap *' (aka 'struct _GeeAbstractMap *') [-Wincompatible-pointer-types]
  1265. _data_->_tmp7_ = gee_abstract_map_get_values ((GeeMap*) _data_->_tmp6_);
  1266. ^~~~~~~~~~~~~~~~~~~~~~~~
  1267. /usr/local/include/gee-0.8/gee.h:1457:61: note: passing argument to parameter 'self' here
  1268. GeeCollection* gee_abstract_map_get_values (GeeAbstractMap* self);
  1269. ^
  1270. individual.c:5040:23: warning: passing 'gconstpointer' (aka 'const void *') to parameter of type 'FolksPersona *' (aka 'struct _FolksPersona *') discards qualifiers [-Wincompatible-pointer-types-discards-qualifiers]
  1271. result = __lambda4_ (a, b);
  1272. ^
  1273. individual.c:4921:39: note: passing argument to parameter 'a' here
  1274. static gint __lambda4_ (FolksPersona* a, FolksPersona* b) {
  1275. ^
  1276. individual.c:5040:26: warning: passing 'gconstpointer' (aka 'const void *') to parameter of type 'FolksPersona *' (aka 'struct _FolksPersona *') discards qualifiers [-Wincompatible-pointer-types-discards-qualifiers]
  1277. result = __lambda4_ (a, b);
  1278. ^
  1279. individual.c:4921:56: note: passing argument to parameter 'b' here
  1280. static gint __lambda4_ (FolksPersona* a, FolksPersona* b) {
  1281. ^
  1282. individual.c:5124:23: warning: passing 'gconstpointer' (aka 'const void *') to parameter of type 'FolksPersona *' (aka 'struct _FolksPersona *') discards qualifiers [-Wincompatible-pointer-types-discards-qualifiers]
  1283. result = __lambda7_ (a, b);
  1284. ^
  1285. individual.c:5113:39: note: passing argument to parameter 'a' here
  1286. static gint __lambda7_ (FolksPersona* a, FolksPersona* b) {
  1287. ^
  1288. individual.c:5124:26: warning: passing 'gconstpointer' (aka 'const void *') to parameter of type 'FolksPersona *' (aka 'struct _FolksPersona *') discards qualifiers [-Wincompatible-pointer-types-discards-qualifiers]
  1289. result = __lambda7_ (a, b);
  1290. ^
  1291. individual.c:5113individual-aggregator.c:2362:9: warning: incompatible pointer types assigning to 'FolksIndividual **' (aka 'struct _FolksIndividual **') from 'gpointer *' (aka 'void **') [-Wincompatible-pointer-types]
  1292. _tmp7_ = _tmp6_;
  1293. ^ ~~~~~~
  1294. :56: note: passing argument to parameter 'b' here
  1295. static gint __lambda7_ (FolksPersona* a, FolksPersona* b) {
  1296. ^
  1297. individual.c:5319:53: warning: passing 'gconstpointer' (aka 'const void *') to parameter of type 'FolksAbstractFieldDetails *' (aka 'struct _FolksAbstractFieldDetails *') discards qualifiers [-Wincompatible-pointer-types-discards-qualifiers]
  1298. result = folks_abstract_field_details_hash_static (v);
  1299. ^
  1300. individual.c:1286:76: note: passing argument to parameter 'value' here
  1301. guint folks_abstract_field_details_hash_static (FolksAbstractFieldDetails* value);
  1302. ^
  1303. individual.c:5326:54: warning: passing 'gconstpointer' (aka 'const void *') to parameter of type 'FolksAbstractFieldDetails *' (aka 'struct _FolksAbstractFieldDetails *') discards qualifiers [-Wincompatible-pointer-types-discards-qualifiers]
  1304. result = folks_abstract_field_details_equal_static (a, b);
  1305. ^
  1306. In file included from <built-in>:162:
  1307. In file included from <command line>:7:
  1308. ../folks/warnings.h:49:32: warning: unknown warning group '-Wunused-but-set-variable', ignored [-Wunknown-pragmas]
  1309. #pragma GCC diagnostic ignored "-Wunused-but-set-variable"
  1310. ^
  1311. ../folks/warnings.h:83:32: warning: unknown warning group '-Wsuggest-attribute=format', ignored [-Wunknown-pragmas]
  1312. #pragma GCC diagnostic ignored "-Wsuggest-attribute=format"
  1313. ^
  1314. individual.c:1288:80: note: passing argument to parameter 'left' here
  1315. gboolean folks_abstract_field_details_equal_static (FolksAbstractFieldDetails* left, FolksAbstractFieldDetails* right);
  1316. ^
  1317. individual.c:5326:57: warning: passing 'gconstpointer' (aka 'const void *') to parameter of type 'FolksAbstractFieldDetails *' (aka 'struct _FolksAbstractFieldDetails *') discards qualifiers [-Wincompatible-pointer-types-discards-qualifiers]
  1318. result = folks_abstract_field_details_equal_static (a, b);
  1319. ^
  1320. individual.c:1288:113: note: passing argument to parameter 'right' here
  1321. gboolean folks_abstract_field_details_equal_static (FolksAbstractFieldDetails* left, FolksAbstractFieldDetails* right);
  1322. ^
  1323. individual-aggregator.c:2649:19: warning: incompatible pointer types assigning to 'FolksPersonaStore **' (aka 'struct _FolksPersonaStore **') from 'gpointer *' (aka 'void **') [-Wincompatible-pointer-types]
  1324. _data_->_tmp16_ = _data_->_tmp15_;
  1325. ^ ~~~~~~~~~~~~~~~
  1326. In file included from <built-in>individual.c:5729:24: warning: passing 'gconstpointer' (aka 'const void *') to parameter of type 'FolksPersona *' (aka 'struct _FolksPersona *') discards qualifiers [-Wincompatible-pointer-types-discards-qualifiers]
  1327. result = __lambda22_ (a, b);
  1328. ^
  1329. individual.c:5718:40: note: passing argument to parameter 'a' here
  1330. static gint __lambda22_ (FolksPersona* a, FolksPersona* b) {
  1331. ^
  1332. individual.c:5729:27: warning: passing 'gconstpointer' (aka 'const void *') to parameter of type 'FolksPersona *' (aka 'struct _FolksPersona *') discards qualifiers [-Wincompatible-pointer-types-discards-qualifiers]
  1333. result = __lambda22_ (a, b);
  1334. ^
  1335. individual.c:5718:57: note: passing argument to parameter 'b' here
  1336. static gint __lambda22_ (FolksPersona* a, FolksPersona* b) {
  1337. ^
  1338. :162:
  1339. In file included from <command line>:7:
  1340. ../folks/warnings.h:49:32: warning: unknown warning group '-Wunused-but-set-variable', ignored [-Wunknown-pragmas]
  1341. #pragma GCC diagnostic ignored "-Wunused-but-set-variable"
  1342. ^
  1343. ../folks/warnings.h:83:32: warning: unknown warning group '-Wsuggest-attribute=format', ignored [-Wunknown-pragmas]
  1344. #pragma GCC diagnostic ignored "-Wsuggest-attribute=format"
  1345. ^
  1346. individual.c:5884:24: warning: passing 'gconstpointer' (aka 'const void *') to parameter of type 'FolksPersona *' (aka 'struct _FolksPersona *') discards qualifiers [-Wincompatible-pointer-types-discards-qualifiers]
  1347. result = __lambda25_ (a, b);
  1348. ^
  1349. individual.c:5873:40: note: passing argument to parameter 'a' here
  1350. static gint __lambda25_ (FolksPersona* a, FolksPersona* b) {
  1351. ^
  1352. individual.c:5884:27: warning: passing 'gconstpointer' (aka 'const void *') to parameter of type 'FolksPersona *' (aka 'struct _FolksPersona *') discards qualifiers [-Wincompatible-pointer-types-discards-qualifiers]
  1353. result = __lambda25_ (a, b);
  1354. ^
  1355. individual.c:5873:57: note: passing argument to parameter 'b' here
  1356. static gint __lambda25_ (FolksPersona* a, FolksPersona* b) {
  1357. ^
  1358. individual.c:5981:24: warning: passing 'gconstpointer' (aka 'const void *') to parameter of type 'FolksPersona *' (aka 'struct _FolksPersona *') discards qualifiers [-Wincompatible-pointer-types-discards-qualifiers]
  1359. result = __lambda28_ (a, b);
  1360. ^
  1361. individual.c:5970:40: note: passing argument to parameter 'a' here
  1362. static gint __lambda28_ (FolksPersona* a, FolksPersona* b) {
  1363. ^
  1364. individual.c:5981:27: warning: passing 'gconstpointer' (aka 'const void *') to parameter of type 'FolksPersona *' (aka 'struct _FolksPersona *') discards qualifiers [-Wincompatible-pointer-types-discards-qualifiers]
  1365. result = __lambda28_ (a, b);
  1366. ^
  1367. individual.c:5970:57: note: passing argument to parameter 'b' here
  1368. static gint __lambda28_ (FolksPersona* a, FolksPersona* b) {
  1369. ^
  1370. individual.c:6124:24: warning: passing 'gconstpointer' (aka 'const void *') to parameter of type 'FolksPersona *' (aka 'struct _FolksPersona *') discards qualifiers [-Wincompatible-pointer-types-discards-qualifiers]
  1371. result = __lambda31_ (a, b);
  1372. ^
  1373. individual.c:6113:40: note: passing argument to parameter 'a' here
  1374. static gint __lambda31_ (FolksPersona* a, FolksPersona* b) {
  1375. ^
  1376. individual.c:6124:27: warning: passing 'gconstpointer' (aka 'const void *') to parameter of type 'FolksPersona *' (aka 'struct _FolksPersona *') discards qualifiers [-Wincompatible-pointer-types-discards-qualifiers]
  1377. result = __lambda31_ (a, b);
  1378. ^
  1379. individual.c:6113:57: note: passing argument to parameter 'b' here
  1380. static gint __lambda31_ (FolksPersona* a, FolksPersona* b) {
  1381. ^
  1382. individual-aggregator.c:4112:48: warning: incompatible pointer types passing 'GeeCollection *' (aka 'struct _GeeCollection *') to parameter of type 'GeeAbstractCollection *' (aka 'struct _GeeAbstractCollection *') [-Wincompatible-pointer-types]
  1383. _tmp95_ = gee_abstract_collection_get_size ((GeeCollection*) _tmp94_);
  1384. ^~~~~~~~~~~~~~~~~~~~~~~~
  1385. /usr/local/include/gee-0.8/gee.h:1432:63: note: passing argument to parameter 'self' here
  1386. gint gee_abstract_collection_get_size (GeeAbstractCollection* self);
  1387. ^
  1388. individual-aggregator.c:4162:50: warning: incompatible pointer types passing 'GeeCollection *' (aka 'struct _GeeCollection *') to parameter of type 'GeeAbstractCollection *' (aka 'struct _GeeAbstractCollection *') [-Wincompatible-pointer-types]
  1389. _tmp110_ = gee_abstract_collection_get_size ((GeeCollection*) _tmp109_);
  1390. ^~~~~~~~~~~~~~~~~~~~~~~~~
  1391. /usr/local/include/gee-0.8/gee.h:1432:63: note: passing argument to parameter 'self' here
  1392. gint gee_abstract_collection_get_size (GeeAbstractCollection* self);
  1393. ^
  1394. individual-aggregator.c:4338:51: warning: incompatible pointer types passing 'GeeCollection *' (aka 'struct _GeeCollection *') to parameter of type 'GeeAbstractCollection *' (aka 'struct _GeeAbstractCollection *') [-Wincompatible-pointer-types]
  1395. _tmp167_ = gee_abstract_collection_get_size ((GeeCollection*) _tmp166_);
  1396. ^~~~~~~~~~~~~~~~~~~~~~~~~
  1397. /usr/local/include/gee-0.8/gee.h:1432:63: note: passing argument to parameter 'self' here
  1398. gint gee_abstract_collection_get_size (GeeAbstractCollection* self);
  1399. ^
  1400. individual.c:7312:24: warning: passing 'gconstpointer' (aka 'const void *') to parameter of type 'FolksPersona *' (aka 'struct _FolksPersona *') discards qualifiers [-Wincompatible-pointer-types-discards-qualifiers]
  1401. result = __lambda60_ (a, b);
  1402. ^
  1403. individual.c:7301:40: note: passing argument to parameter 'a' here
  1404. static gint __lambda60_ (FolksPersona* a, FolksPersona* b) {
  1405. ^
  1406. individual.c:7312:27: individual-aggregator.c:4930:8: warning: assigning to 'GPtrArray *' (aka 'struct _GPtrArray *') from 'gconstpointer' (aka 'const void *') discards qualifiers [-Wincompatible-pointer-types-discards-qualifiers]
  1407. inds = _tmp5_;
  1408. ^ ~~~~~~
  1409. warning: passing 'gconstpointer' (aka 'const void *') to parameter of type 'FolksPersona *' (aka 'struct _FolksPersona *') discards qualifiers [-Wincompatible-pointer-types-discards-qualifiers]
  1410. result = __lambda60_ (a, b);
  1411. ^
  1412. individual.c:7301:57: note: passing argument to parameter 'b' here
  1413. static gint __lambda60_ (FolksPersona* a, FolksPersona* b) {
  1414. ^
  1415. individual.c:7722:24: warning: passing 'gconstpointer' (aka 'const void *') to parameter of type 'FolksPersona *' (aka 'struct _FolksPersona *') discards qualifiers [-Wincompatible-pointer-types-discards-qualifiers]
  1416. result = __lambda47_ (a, b);
  1417. ^
  1418. individual.c:7613:40: note: passing argument to parameter 'a' here
  1419. static gint __lambda47_ (FolksPersona* a, FolksPersona* b) {
  1420. ^
  1421. individual.c:7722:27: warning: passing 'gconstpointer' (aka 'const void *') to parameter of type 'FolksPersona *' (aka 'struct _FolksPersona *') discards qualifiers [-Wincompatible-pointer-types-discards-qualifiers]
  1422. result = __lambda47_ (a, b);
  1423. ^
  1424. individual.c:7613:57: note: passing argument to parameter 'b' here
  1425. static gint __lambda47_ (FolksPersona* a, FolksPersona* b) {
  1426. ^
  1427. individual-aggregator.c:5639:9: warning: assigning to 'GPtrArray *' (aka 'struct _GPtrArray *') from 'gconstpointer' (aka 'const void *') discards qualifiers [-Wincompatible-pointer-types-discards-qualifiers]
  1428. inds = _tmp199_;
  1429. ^ ~~~~~~~~
  1430. individual-aggregator.c:6525:26: warning: passing 'gconstpointer' (aka 'const void *') to parameter of type 'GValue *' (aka 'struct _GValue *') discards qualifiers [-Wincompatible-pointer-types-discards-qualifiers]
  1431. __lambda68_ (self, key, value);
  1432. ^~~~~
  1433. individual-aggregator.c:6508:71: note: passing argument to parameter 'v' here
  1434. static void __lambda68_ (Block8Data* _data8_, const gchar* k, GValue* v) {
  1435. ^
  1436. individual-aggregator.c:6547:32: warning: incompatible pointer types passing 'void (gconstpointer, gconstpointer, gpointer)' to parameter of type 'GHFunc' (aka 'void (*)(gpointer, gpointer, gpointer)') [-Wincompatible-pointer-types]
  1437. g_hash_table_foreach (_tmp3_, ___lambda68__gh_func, _data8_);
  1438. ^~~~~~~~~~~~~~~~~~~~
  1439. /usr/local/include/glib-2.0/glib/ghash.h:100:61: note: passing argument to parameter 'func' here
  1440. GHFunc func,
  1441. ^
  1442. 2 warnings generated.
  1443. individual-aggregator.c:7131:53: warning: passing 'gconstpointer' (aka 'const void *') to parameter of type 'FolksAbstractFieldDetails *' (aka 'struct _FolksAbstractFieldDetails *') discards qualifiers [-Wincompatible-pointer-types-discards-qualifiers]
  1444. result = folks_abstract_field_details_hash_static (v);
  1445. ^
  1446. individual-aggregator.c:1071:76: note: passing argument to parameter 'value' here
  1447. guint folks_abstract_field_details_hash_static (FolksAbstractFieldDetails* value);
  1448. ^
  1449. individual-aggregator.c:7138:54: warning: passing 'gconstpointer' (aka 'const void *') to parameter of type 'FolksAbstractFieldDetails *' (aka 'struct _FolksAbstractFieldDetails *') discards qualifiers [-Wincompatible-pointer-types-discards-qualifiers]
  1450. result = folks_abstract_field_details_equal_static (a, b);
  1451. ^
  1452. debug.c:425:16: warning: incompatible pointer types assigning to 'GCompareFunc' (aka 'gint (*)(gconstpointer, gconstpointer)') from 'int (const char *, const char *)' [-Wincompatible-pointer-types]
  1453. _tmp17_ = g_strcmp0;
  1454. ^ ~~~~~~~~~
  1455. individual-aggregator.c:1073:80: note: passing argument to parameter 'left' here
  1456. gboolean folks_abstract_field_details_equal_static (FolksAbstractFieldDetails* left, FolksAbstractFieldDetails* right);
  1457. ^
  1458. individual-aggregator.c:7138:57: warning: passing 'gconstpointer' (aka 'const void *') to parameter of type 'FolksAbstractFieldDetails *' (aka 'struct _FolksAbstractFieldDetails *') discards qualifiers [-Wincompatible-pointer-types-discards-qualifiers]
  1459. result = folks_abstract_field_details_equal_static (a, b);
  1460. ^
  1461. individual-aggregator.c:1073:113: note: passing argument to parameter 'right' here
  1462. gboolean folks_abstract_field_details_equal_static (FolksAbstractFieldDetails* left, FolksAbstractFieldDetails* right);
  1463. ^
  1464. CC libfolks_la-object-cache.lo
  1465. 2 warnings generated.
  1466. individual.c:10232:22: warning: incompatible pointer types assigning to 'void (*)(FolksAliasDetails *, const gchar *, GAsyncReadyCallback, gpointer)' from 'void (*)(FolksAliasDetails *, const gchar *, GError **)' [-Wincompatible-pointer-types]
  1467. iface->change_alias = (void (*)(FolksAliasDetails*, const gchar*, GError**)) folks_individual_real_change_alias;
  1468. ^ ~~~~~~~~~~~~~~~~~~~~~~~~~~~~~~~~~~~~~~~~~~~~~~~~~~~~~~~~~~~~~~~~~~~~~~~~~~~~~~~~~~~~~~~~~
  1469. individual.c:10241:23: warning: incompatible pointer types assigning to 'void (*)(FolksAvatarDetails *, GLoadableIcon *, GAsyncReadyCallback, gpointer)' from 'void (*)(FolksAvatarDetails *, GLoadableIcon *, GError **)' [-Wincompatible-pointer-types]
  1470. iface->change_avatar = (void (*)(FolksAvatarDetails*, GLoadableIcon*, GError**)) folks_individual_real_change_avatar;
  1471. ^ ~~~~~~~~~~~~~~~~~~~~~~~~~~~~~~~~~~~~~~~~~~~~~~~~~~~~~~~~~~~~~~~~~~~~~~~~~~~~~~~~~~~~~~~~~~~~~
  1472. individual.c:10266:29: warning: incompatible pointer types assigning to 'void (*)(FolksFavouriteDetails *, gboolean, GAsyncReadyCallback, gpointer)' from 'void (*)(FolksFavouriteDetails *, gboolean, GError **)' [-Wincompatible-pointer-types]
  1473. iface->change_is_favourite = (void (*)(FolksFavouriteDetails*, gboolean, GError**)) folks_individual_real_change_is_favourite;
  1474. ^ ~~~~~~~~~~~~~~~~~~~~~~~~~~~~~~~~~~~~~~~~~~~~~~~~~~~~~~~~~~~~~~~~~~~~~~~~~~~~~~~~~~~~~~~~~~~~~~~~
  1475. individual.c:10282:23: warning: incompatible pointer types assigning to 'void (*)(FolksGroupDetails *, GeeSet *, GAsyncReadyCallback, gpointer)' from 'void (*)(FolksGroupDetails *, GeeSet *, GError **)' [-Wincompatible-pointer-types]
  1476. iface->change_groups = (void (*)(FolksGroupDetails*, GeeSet*, GError**)) folks_individual_real_change_groups;
  1477. ^ ~~~~~~~~~~~~~~~~~~~~~~~~~~~~~~~~~~~~~~~~~~~~~~~~~~~~~~~~~~~~~~~~~~~~~~~~~~~~~~~~~~~~~
  1478. individual.c:10284:22: warning: incompatible pointer types assigning to 'void (*)(FolksGroupDetails *, const gchar *, gboolean, GAsyncReadyCallback, gpointer)' from 'void (*)(FolksGroupDetails *, const gchar *, gboolean, GError **)' [-Wincompatible-pointer-types]
  1479. iface->change_group = (void (*)(FolksGroupDetails*, const gchar*, gboolean, GError**)) folks_individual_real_change_group;
  1480. ^ ~~~~~~~~~~~~~~~~~~~~~~~~~~~~~~~~~~~~~~~~~~~~~~~~~~~~~~~~~~~~~~~~~~~~~~~~~~~~~~~~~~~~~~~~~~~~~~~~~~~
  1481. individual.c:10323:25: warning: incompatible pointer types assigning to 'void (*)(FolksNameDetails *, const gchar *, GAsyncReadyCallback, gpointer)' from 'void (*)(FolksNameDetails *, const gchar *, GError **)' [-Wincompatible-pointer-types]
  1482. iface->change_nickname = (void (*)(FolksNameDetails*, const gchar*, GError**)) folks_individual_real_change_nickname;
  1483. ^ ~~~~~~~~~~~~~~~~~~~~~~~~~~~~~~~~~~~~~~~~~~~~~~~~~~~~~~~~~~~~~~~~~~~~~~~~~~~~~~~~~~~~~~~~~~~
  1484. CC libfolks_la-anti-linkable.lo
  1485. individual-aggregator.c:7985:77: warning: passing 'const gchar *' (aka 'const char *') to parameter of type 'gchar *' (aka 'char *') discards qualifiers [-Wincompatible-pointer-types-discards-qualifiers]
  1486. if (_vala_string_array_contains (_data_->_tmp9_, _data_->_tmp9__length1, _data_->_tmp6_)) {
  1487. ^~~~~~~~~~~~~~
  1488. individual-aggregator.c:7923:86: note: passing argument to parameter 'needle' here
  1489. static gboolean _vala_string_array_contains (gchar** stack, int stack_length, gchar* needle) {
  1490. ^
  1491. individual-aggregator.c:8027:92: warning: passing 'const gchar *' (aka 'const char *') to parameter of type 'gchar *' (aka 'char *') discards qualifiers [-Wincompatible-pointer-types-discards-qualifiers]
  1492. _data_->_tmp15_ = _vala_string_array_contains (_data_->_tmp20_, _data_->_tmp20__length1, _data_->_tmp17_);
  1493. ^~~~~~~~~~~~~~~
  1494. individual-aggregator.c:7923:86: note: passing argument to parameter 'needle' here
  1495. static gboolean _vala_string_array_contains (gchar** stack, int stack_length, gchar* needle) {
  1496. ^
  1497. individual-aggregator.c:8099:51: warning: incompatible pointer types passing 'GeeMap *' (aka 'struct _GeeMap *') to parameter of type 'GeeAbstractMap *' (aka 'struct _GeeAbstractMap *') [-Wincompatible-pointer-types]
  1498. _data_->_tmp28_ = gee_abstract_map_get_values ((GeeMap*) _data_->_tmp27_);
  1499. ^~~~~~~~~~~~~~~~~~~~~~~~~
  1500. /usr/local/include/gee-0.8/gee.h:1457:61: note: passing argument to parameter 'self' here
  1501. GeeCollection* gee_abstract_map_get_values (GeeAbstractMap* self);
  1502. ^
  1503. individual-aggregator.c:8141:96: warning: passing 'const gchar *' (aka 'const char *') to parameter of type 'gchar *' (aka 'char *') discards qualifiers [-Wincompatible-pointer-types-discards-qualifiers]
  1504. _data_->_tmp37_ = !_vala_string_array_contains (_data_->_tmp43_, _data_->_tmp43__length1, _data_->_tmp40_);
  1505. ^~~~~~~~~~~~~~~
  1506. individual-aggregator.c:7923:86: note: passing argument to parameter 'needle' here
  1507. static gboolean _vala_string_array_contains (gchar** stack, int stack_length, gchar* needle) {
  1508. ^
  1509. In file included from <built-in>:162:
  1510. In file included from <command line>:7:
  1511. ../folks/warnings.h:49:32: warning: unknown warning group '-Wunused-but-set-variable', ignored [-Wunknown-pragmas]
  1512. #pragma GCC diagnostic ignored "-Wunused-but-set-variable"
  1513. ^
  1514. ../folks/warnings.h:83:32: warning: unknown warning group '-Wsuggest-attribute=format', ignored [-Wunknown-pragmas]
  1515. #pragma GCC diagnostic ignored "-Wsuggest-attribute=format"
  1516. ^
  1517. individual-aggregator.c:8594:14: warning: passing 'const gchar *' (aka 'const char *') to parameter of type 'gchar *' (aka 'char *') discards qualifiers [-Wincompatible-pointer-types-discards-qualifiers]
  1518. g_strstrip (_tmp1_);
  1519. ^~~~~~
  1520. /usr/local/include/glib-2.0/glib/gstrfuncs.h:180:53: note: expanded from macro 'g_strstrip'
  1521. #define g_strstrip( string ) g_strchomp (g_strchug (string))
  1522. ^
  1523. /usr/local/include/glib-2.0/glib/gstrfuncs.h:175:55: note: passing argument to parameter 'string' here
  1524. gchar* g_strchug (gchar *string);
  1525. ^
  1526. In file included from <built-in>:162:
  1527. In file included from <command line>:7:
  1528. ../folks/warnings.h:49:32: warning: unknown warning group '-Wunused-but-set-variable', ignored [-Wunknown-pragmas]
  1529. #pragma GCC diagnostic ignored "-Wunused-but-set-variable"
  1530. ^
  1531. ../folks/warnings.h:83:32: warning: unknown warning group '-Wsuggest-attribute=format', ignored [-Wunknown-pragmas]
  1532. #pragma GCC diagnostic ignored "-Wsuggest-attribute=format"
  1533. ^
  1534. 2 warnings generated.
  1535. CC libfolks_internal_la-internal.lo
  1536. 3 warnings generated.
  1537. warning: unknown warning option '-Werror=missing-parameter-type' [-Wunknown-warning-option]
  1538. warning: unknown warning option '-Werror=old-style-declaration'; did you mean '-Werror=out-of-line-declaration'? [-Wunknown-warning-option]
  1539. In file included from <built-in>:162:
  1540. In file included from <command line>:7:
  1541. ../folks/warnings.h:49:32: warning: unknown warning group '-Wunused-but-set-variable', ignored [-Wunknown-pragmas]
  1542. #pragma GCC diagnostic ignored "-Wunused-but-set-variable"
  1543. ^
  1544. ../folks/warnings.h:83:32: warning: unknown warning group '-Wsuggest-attribute=format', ignored [-Wunknown-pragmas]
  1545. #pragma GCC diagnostic ignored "-Wsuggest-attribute=format"
  1546. ^
  1547. CC libfolks_internal_la-small-set.lo
  1548. 2 warnings generated.
  1549. warning: unknown warning option '-Werror=missing-parameter-type' [-Wunknown-warning-option]
  1550. warning: unknown warning option '-Werror=old-style-declaration'; did you mean '-Werror=out-of-line-declaration'? [-Wunknown-warning-option]
  1551. In file included from <built-in>:162:
  1552. In file included from <command line>:7:
  1553. ../folks/warnings.h:49:32: warning: unknown warning group '-Wunused-but-set-variable', ignored [-Wunknown-pragmas]
  1554. #pragma GCC diagnostic ignored "-Wunused-but-set-variable"
  1555. ^
  1556. ../folks/warnings.h:83:32: warning: unknown warning group '-Wsuggest-attribute=format', ignored [-Wunknown-pragmas]
  1557. #pragma GCC diagnostic ignored "-Wsuggest-attribute=format"
  1558. ^
  1559. GEN org.freedesktop.folks.gschema.valid
  1560. object-cache.c:629:63: warning: incompatible pointer types passing 'guint8 **' (aka 'unsigned char **') to parameter of type 'char **' [-Wincompatible-pointer-types]
  1561. g_file_load_contents_finish (_data_->_tmp3_, _data_->_res_, &_data_->_tmp5_, &_data_->_tmp6_, NULL, &_data_->_inner_error_);
  1562. ^~~~~~~~~~~~~~~
  1563. /usr/local/include/glib-2.0/gio/gfile.h:1193:36: note: passing argument to parameter 'contents' here
  1564. char **contents,
  1565. ^
  1566. object-cache.c:793:43: warning: passing 'const GVariantType *' (aka 'const struct _GVariantType *') to parameter of type 'gpointer' (aka 'void *') discards qualifiers [-Wincompatible-pointer-types-discards-qualifiers]
  1567. _data_->_tmp33_ = _g_variant_type_copy0 ((const GVariantType*) _data_->_tmp32_);
  1568. ^~~~~~~~~~~~~~~~~~~~~~~~~~~~~~~~~~~~~
  1569. object-cache.c:576:49: note: passing argument to parameter 'self' here
  1570. static gpointer _g_variant_type_copy0 (gpointer self) {
  1571. ^
  1572. anti-linkable.c:401:23: warning: comparison of distinct pointer types ('FolksPersona *' (aka 'struct _FolksPersona *') and 'FolksAntiLinkable *' (aka 'struct _FolksAntiLinkable *')) [-Wcompare-distinct-pointer-types]
  1573. if (_data_->_tmp9_ == _data_->self) {
  1574. ~~~~~~~~~~~~~~ ^ ~~~~~~~~~~~~
  1575. object-cache.c:1281:52: warning: passing 'guint8 *' (aka 'unsigned char *') to parameter of type 'const char *' converts between pointers to integer types with different sign [-Wpointer-sign]
  1576. g_file_replace_contents_async (_data_->_tmp55_, _data_->_tmp56_, (gsize) _data_->_tmp56__length1, NULL, FALSE, G_FILE_CREATE_PRIVATE, _data_->_tmp57_, folks_object_cache_store_objects_ready, _data_);
  1577. ^~~~~~~~~~~~~~~
  1578. /usr/local/include/glib-2.0/gio/gfile.h:1222:36: note: passing argument to parameter 'contents' here
  1579. const char *contents,
  1580. ^
  1581. object-cache.c:1533:34: warning: passing 'const GVariantType *' (aka 'const struct _GVariantType *') to parameter of type 'gpointer' (aka 'void *') discards qualifiers [-Wincompatible-pointer-types-discards-qualifiers]
  1582. _tmp4_ = _g_variant_type_copy0 ((const GVariantType*) _tmp3_);
  1583. ^~~~~~~~~~~~~~~~~~~~~~~~~~~~
  1584. object-cache.c:576:49: note: passing argument to parameter 'self' here
  1585. static gpointer _g_variant_type_copy0 (gpointer self) {
  1586. ^
  1587. object-cache.c:1536:34: warning: passing 'const GVariantType *' (aka 'const struct _GVariantType *') to parameter of type 'gpointer' (aka 'void *') discards qualifiers [-Wincompatible-pointer-types-discards-qualifiers]
  1588. _tmp6_ = _g_variant_type_copy0 (_tmp5_);
  1589. ^~~~~~
  1590. object-cache.c:576:49: note: passing argument to parameter 'self' here
  1591. static gpointer _g_variant_type_copy0 (gpointer self) {
  1592. ^
  1593. object-cache.c:1538:34: warning: passing 'const GVariantType *' (aka 'const struct _GVariantType *') to parameter of type 'gpointer' (aka 'void *') discards qualifiers [-Wincompatible-pointer-types-discards-qualifiers]
  1594. _tmp8_ = _g_variant_type_copy0 (_tmp7_);
  1595. ^~~~~~
  1596. object-cache.c:576:49: note: passing argument to parameter 'self' here
  1597. static gpointer _g_variant_type_copy0 (gpointer self) {
  1598. ^
  1599. object-cache.c:1547:38: warning: passing 'GVariantType **' (aka 'struct _GVariantType **') to parameter of type 'const GVariantType *const *' (aka 'const struct _GVariantType *const *') discards qualifiers in nested pointer types [-Wincompatible-pointer-types-discards-qualifiers]
  1600. _tmp13_ = g_variant_type_new_tuple (_tmp12_, 3);
  1601. ^~~~~~~
  1602. /usr/local/include/glib-2.0/glib/gvarianttype.h:368:102: note: passing argument to parameter 'items' here
  1603. GVariantType * g_variant_type_new_tuple (const GVariantType * const *items,
  1604. ^
  1605. 3 warnings generated.
  1606. 2 warnings generated.
  1607. 4 warnings generated.
  1608. 9 warnings generated.
  1609. 4 warnings generated.
  1610. CCLD libfolks-internal.la
  1611. 21 warnings generated.
  1612. 40 warnings generated.
  1613. CCLD libfolks.la
  1614. GICOMP Folks-0.6.gir
  1615. /usr/local/share/gir-1.0/Gee-0.8.gir:9:51: warning: element annotation from state 6 is unknown, ignoring
  1616. /usr/local/share/gir-1.0/Gee-0.8.gir:10:53: warning: element annotation from state 6 is unknown, ignoring
  1617. /usr/local/share/gir-1.0/Gee-0.8.gir:60:1: warning: element errordomain from state 6 is unknown, ignoring
  1618. /usr/local/share/gir-1.0/Gee-0.8.gir:3401:50: warning: element annotation from state 15 is unknown, ignoring
  1619. /usr/local/share/gir-1.0/Gee-0.8.gir:3436:50: warning: element annotation from state 15 is unknown, ignoring
  1620. /usr/local/share/gir-1.0/Gee-0.8.gir:3473:50: warning: element annotation from state 15 is unknown, ignoring
  1621. /usr/local/share/gir-1.0/Gee-0.8.gir:3564:50: warning: element annotation from state 15 is unknown, ignoring
  1622. /usr/local/share/gir-1.0/Gee-0.8.gir:3568:50: warning: element annotation from state 15 is unknown, ignoring
  1623. /usr/local/share/gir-1.0/Gee-0.8.gir:3572:50: warning: element annotation from state 15 is unknown, ignoring
  1624. /usr/local/share/gir-1.0/Gee-0.8.gir:3639:50: warning: element annotation from state 15 is unknown, ignoring
  1625. /usr/local/share/gir-1.0/Gee-0.8.gir:3643:50: warning: element annotation from state 15 is unknown, ignoring
  1626. /usr/local/share/gir-1.0/Gee-0.8.gir:3661:72: warning: element annotation from state 9 is unknown, ignoring
  1627. /usr/local/share/gir-1.0/Gee-0.8.gir:3687:83: warning: element annotation from state 9 is unknown, ignoring
  1628. /usr/local/share/gir-1.0/Gee-0.8.gir:3688:55: warning: element annotation from state 9 is unknown, ignoring
  1629. /usr/local/share/gir-1.0/Gee-0.8.gir:3689:66: warning: element annotation from state 9 is unknown, ignoring
  1630. /usr/local/share/gir-1.0/Gee-0.8.gir:3754:50: warning: element annotation from state 15 is unknown, ignoring
  1631. /usr/local/share/gir-1.0/Gee-0.8.gir:3758:50: warning: element annotation from state 15 is unknown, ignoring
  1632. /usr/local/share/gir-1.0/Gee-0.8.gir:4059:1: warning: element property from state 23 is unknown, ignoring
  1633. /usr/local/share/gir-1.0/Gee-0.8.gir:4062:1: warning: element property from state 23 is unknown, ignoring
  1634. /usr/local/share/gir-1.0/Gee-0.8.gir:4103:50: warning: element annotation from state 15 is unknown, ignoring
  1635. /usr/local/share/gir-1.0/Gee-0.8.gir:4162:50: warning: element annotation from state 15 is unknown, ignoring
  1636. /usr/local/share/gir-1.0/Gee-0.8.gir:4199:1: warning: element property from state 23 is unknown, ignoring
  1637. /usr/local/share/gir-1.0/Gee-0.8.gir:4237:50: warning: element annotation from state 15 is unknown, ignoring
  1638. /usr/local/share/gir-1.0/Gee-0.8.gir:4241:50: warning: element annotation from state 15 is unknown, ignoring
  1639. /usr/local/share/gir-1.0/Gee-0.8.gir:4287:50: warning: element annotation from state 15 is unknown, ignoring
  1640. /usr/local/share/gir-1.0/Gee-0.8.gir:4354:50: warning: element annotation from state 15 is unknown, ignoring
  1641. /usr/local/share/gir-1.0/Gee-0.8.gir:4745:48: warning: element annotation from state 9 is unknown, ignoring
  1642. /usr/local/share/gir-1.0/Gee-0.8.gir:4756:48: warning: element annotation from state 9 is unknown, ignoring
  1643. /usr/local/share/gir-1.0/Gee-0.8.gir:4767:48: warning: element annotation from state 9 is unknown, ignoring
  1644. /usr/local/share/gir-1.0/Gee-0.8.gir:4778:48: warning: element annotation from state 9 is unknown, ignoring
  1645. /usr/local/share/gir-1.0/Gee-0.8.gir:4789:48: warning: element annotation from state 9 is unknown, ignoring
  1646. /usr/local/share/gir-1.0/Gee-0.8.gir:4800:48: warning: element annotation from state 9 is unknown, ignoring
  1647. /usr/local/share/gir-1.0/Gee-0.8.gir:4811:48: warning: element annotation from state 9 is unknown, ignoring
  1648. /usr/local/share/gir-1.0/Gee-0.8.gir:4817:48: warning: element annotation from state 9 is unknown, ignoring
  1649. /usr/local/share/gir-1.0/Gee-0.8.gir:4823:48: warning: element annotation from state 9 is unknown, ignoring
  1650. /usr/local/share/gir-1.0/Gee-0.8.gir:4836:48: warning: element annotation from state 9 is unknown, ignoring
  1651. /usr/local/share/gir-1.0/Gee-0.8.gir:4849:48: warning: element annotation from state 9 is unknown, ignoring
  1652. /usr/local/share/gir-1.0/Gee-0.8.gir:4862:48: warning: element annotation from state 9 is unknown, ignoring
  1653. /usr/local/share/gir-1.0/Gee-0.8.gir:4875:48: warning: element annotation from state 9 is unknown, ignoring
  1654. /usr/local/share/gir-1.0/Gee-0.8.gir:4888:48: warning: element annotation from state 9 is unknown, ignoring
  1655. /usr/local/share/gir-1.0/Gee-0.8.gir:4901:48: warning: element annotation from state 9 is unknown, ignoring
  1656. /usr/local/share/gir-1.0/Gee-0.8.gir:4914:48: warning: element annotation from state 9 is unknown, ignoring
  1657. /usr/local/share/gir-1.0/Gee-0.8.gir:4927:48: warning: element annotation from state 9 is unknown, ignoring
  1658. /usr/local/share/gir-1.0/Gee-0.8.gir:4940:48: warning: element annotation from state 9 is unknown, ignoring
  1659. /usr/local/share/gir-1.0/Gee-0.8.gir:4953:49: warning: element annotation from state 9 is unknown, ignoring
  1660. /usr/local/share/gir-1.0/Gee-0.8.gir:4969:49: warning: element annotation from state 9 is unknown, ignoring
  1661. /usr/local/share/gir-1.0/Gee-0.8.gir:4985:49: warning: element annotation from state 9 is unknown, ignoring
  1662. /usr/local/share/gir-1.0/Gee-0.8.gir:5001:49: warning: element annotation from state 9 is unknown, ignoring
  1663. /usr/local/share/gir-1.0/Gee-0.8.gir:5017:49: warning: element annotation from state 9 is unknown, ignoring
  1664. /usr/local/share/gir-1.0/Gee-0.8.gir:5033:49: warning: element annotation from state 9 is unknown, ignoring
  1665. /usr/local/share/gir-1.0/Gee-0.8.gir:5049:49: warning: element annotation from state 9 is unknown, ignoring
  1666. /usr/local/share/gir-1.0/Gee-0.8.gir:5062:49: warning: element annotation from state 9 is unknown, ignoring
  1667. /usr/local/share/gir-1.0/Gee-0.8.gir:5075:49: warning: element annotation from state 9 is unknown, ignoring
  1668. /usr/local/share/gir-1.0/Gee-0.8.gir:5088:49: warning: element annotation from state 9 is unknown, ignoring
  1669. /usr/local/share/gir-1.0/Gee-0.8.gir:5101:49: warning: element annotation from state 9 is unknown, ignoring
  1670. /usr/local/share/gir-1.0/Gee-0.8.gir:5114:49: warning: element annotation from state 9 is unknown, ignoring
  1671. /usr/local/share/gir-1.0/Gee-0.8.gir:5134:48: warning: element annotation from state 17 is unknown, ignoring
  1672. /usr/local/share/gir-1.0/Gee-0.8.gir:5138:49: warning: element annotation from state 17 is unknown, ignoring
  1673. /usr/local/share/gir-1.0/Gee-0.8.gir:5142:49: warning: element annotation from state 17 is unknown, ignoring
  1674. /usr/local/share/gir-1.0/Gee-0.8.gir:5146:49: warning: element annotation from state 17 is unknown, ignoring
  1675. /usr/local/share/gir-1.0/Gee-0.8.gir:5158:49: warning: element annotation from state 9 is unknown, ignoring
  1676. /usr/local/share/gir-1.0/Gee-0.8.gir:5174:49: warning: element annotation from state 9 is unknown, ignoring
  1677. /usr/local/share/gir-1.0/Gee-0.8.gir:5190:49: warning: element annotation from state 9 is unknown, ignoring
  1678. /usr/local/share/gir-1.0/Gee-0.8.gir:5206:49: warning: element annotation from state 9 is unknown, ignoring
  1679. /usr/local/share/gir-1.0/Gee-0.8.gir:5219:49: warning: element annotation from state 9 is unknown, ignoring
  1680. /usr/local/share/gir-1.0/Gee-0.8.gir:5237:49: warning: element annotation from state 9 is unknown, ignoring
  1681. /usr/local/share/gir-1.0/Gee-0.8.gir:5255:49: warning: element annotation from state 9 is unknown, ignoring
  1682. /usr/local/share/gir-1.0/Gee-0.8.gir:5273:49: warning: element annotation from state 9 is unknown, ignoring
  1683. /usr/local/share/gir-1.0/Gee-0.8.gir:5291:49: warning: element annotation from state 9 is unknown, ignoring
  1684. /usr/local/share/gir-1.0/Gee-0.8.gir:5309:50: warning: element annotation from state 9 is unknown, ignoring
  1685. /usr/local/share/gir-1.0/Gee-0.8.gir:5330:50: warning: element annotation from state 9 is unknown, ignoring
  1686. /usr/local/share/gir-1.0/Gee-0.8.gir:5351:50: warning: element annotation from state 9 is unknown, ignoring
  1687. /usr/local/share/gir-1.0/Gee-0.8.gir:5372:50: warning: element annotation from state 9 is unknown, ignoring
  1688. /usr/local/share/gir-1.0/Gee-0.8.gir:5390:50: warning: element annotation from state 9 is unknown, ignoring
  1689. /usr/local/share/gir-1.0/Gee-0.8.gir:5408:50: warning: element annotation from state 9 is unknown, ignoring
  1690. /usr/local/share/gir-1.0/Gee-0.8.gir:5737:48: warning: element annotation from state 9 is unknown, ignoring
  1691. /usr/local/share/gir-1.0/Gee-0.8.gir:5743:48: warning: element annotation from state 9 is unknown, ignoring
  1692. /usr/local/share/gir-1.0/Gee-0.8.gir:5749:48: warning: element annotation from state 9 is unknown, ignoring
  1693. /usr/local/share/gir-1.0/Gee-0.8.gir:5763:48: warning: element annotation from state 9 is unknown, ignoring
  1694. /usr/local/share/gir-1.0/Gee-0.8.gir:5777:48: warning: element annotation from state 9 is unknown, ignoring
  1695. /usr/local/share/gir-1.0/Gee-0.8.gir:5791:48: warning: element annotation from state 9 is unknown, ignoring
  1696. /usr/local/share/gir-1.0/Gee-0.8.gir:5802:48: warning: element annotation from state 9 is unknown, ignoring
  1697. /usr/local/share/gir-1.0/Gee-0.8.gir:5816:48: warning: element annotation from state 9 is unknown, ignoring
  1698. /usr/local/share/gir-1.0/Gee-0.8.gir:5827:48: warning: element annotation from state 9 is unknown, ignoring
  1699. /usr/local/share/gir-1.0/Gee-0.8.gir:5846:48: warning: element annotation from state 9 is unknown, ignoring
  1700. /usr/local/share/gir-1.0/Gee-0.8.gir:5865:70: warning: element annotation from state 9 is unknown, ignoring
  1701. /usr/local/share/gir-1.0/Gee-0.8.gir:5866:64: warning: element annotation from state 9 is unknown, ignoring
  1702. /usr/local/share/gir-1.0/Gee-0.8.gir:5867:49: warning: element annotation from state 9 is unknown, ignoring
  1703. /usr/local/share/gir-1.0/Gee-0.8.gir:5886:70: warning: element annotation from state 9 is unknown, ignoring
  1704. /usr/local/share/gir-1.0/Gee-0.8.gir:5887:64: warning: element annotation from state 9 is unknown, ignoring
  1705. /usr/local/share/gir-1.0/Gee-0.8.gir:5888:49: warning: element annotation from state 9 is unknown, ignoring
  1706. /usr/local/share/gir-1.0/Gee-0.8.gir:5907:64: warning: element annotation from state 9 is unknown, ignoring
  1707. /usr/local/share/gir-1.0/Gee-0.8.gir:5908:58: warning: element annotation from state 9 is unknown, ignoring
  1708. /usr/local/share/gir-1.0/Gee-0.8.gir:5909:48: warning: element annotation from state 9 is unknown, ignoring
  1709. /usr/local/share/gir-1.0/Gee-0.8.gir:5925:64: warning: element annotation from state 9 is unknown, ignoring
  1710. /usr/local/share/gir-1.0/Gee-0.8.gir:5926:58: warning: element annotation from state 9 is unknown, ignoring
  1711. /usr/local/share/gir-1.0/Gee-0.8.gir:5927:48: warning: element annotation from state 9 is unknown, ignoring
  1712. /usr/local/share/gir-1.0/Gee-0.8.gir:5943:48: warning: element annotation from state 9 is unknown, ignoring
  1713. /usr/local/share/gir-1.0/Gee-0.8.gir:5964:48: warning: element annotation from state 9 is unknown, ignoring
  1714. /usr/local/share/gir-1.0/Gee-0.8.gir:5985:48: warning: element annotation from state 9 is unknown, ignoring
  1715. /usr/local/share/gir-1.0/Gee-0.8.gir:6004:48: warning: element annotation from state 9 is unknown, ignoring
  1716. /usr/local/share/gir-1.0/Gee-0.8.gir:6023:48: warning: element annotation from state 17 is unknown, ignoring
  1717. /usr/local/share/gir-1.0/Gee-0.8.gir:6027:48: warning: element annotation from state 17 is unknown, ignoring
  1718. /usr/local/share/gir-1.0/Gee-0.8.gir:6031:48: warning: element annotation from state 17 is unknown, ignoring
  1719. /usr/local/share/gir-1.0/Gee-0.8.gir:6061:49: warning: element annotation from state 9 is unknown, ignoring
  1720. /usr/local/share/gir-1.0/Gee-0.8.gir:6099:49: warning: element annotation from state 9 is unknown, ignoring
  1721. /usr/local/share/gir-1.0/Gee-0.8.gir:6112:49: warning: element annotation from state 9 is unknown, ignoring
  1722. /usr/local/share/gir-1.0/Gee-0.8.gir:6131:49: warning: element annotation from state 9 is unknown, ignoring
  1723. /usr/local/share/gir-1.0/Gee-0.8.gir:6150:49: warning: element annotation from state 9 is unknown, ignoring
  1724. /usr/local/share/gir-1.0/Gee-0.8.gir:6166:49: warning: element annotation from state 9 is unknown, ignoring
  1725. /usr/local/share/gir-1.0/Gee-0.8.gir:6190:71: warning: element annotation from state 9 is unknown, ignoring
  1726. /usr/local/share/gir-1.0/Gee-0.8.gir:6191:65: warning: element annotation from state 9 is unknown, ignoring
  1727. /usr/local/share/gir-1.0/Gee-0.8.gir:6192:50: warning: element annotation from state 9 is unknown, ignoring
  1728. /usr/local/share/gir-1.0/Gee-0.8.gir:6216:65: warning: element annotation from state 9 is unknown, ignoring
  1729. /usr/local/share/gir-1.0/Gee-0.8.gir:6217:59: warning: element annotation from state 9 is unknown, ignoring
  1730. /usr/local/share/gir-1.0/Gee-0.8.gir:6218:49: warning: element annotation from state 9 is unknown, ignoring
  1731. /usr/local/share/gir-1.0/Gee-0.8.gir:6239:49: warning: element annotation from state 9 is unknown, ignoring
  1732. /usr/local/share/gir-1.0/Gee-0.8.gir:6265:49: warning: element annotation from state 9 is unknown, ignoring
  1733. /usr/local/share/gir-1.0/Gee-0.8.gir:7094:66: warning: element annotation from state 9 is unknown, ignoring
  1734. /usr/local/share/gir-1.0/Gee-0.8.gir:7203:64: warning: element annotation from state 9 is unknown, ignoring
  1735. /usr/local/share/gir-1.0/Gee-0.8.gir:7295:68: warning: element annotation from state 9 is unknown, ignoring
  1736. /usr/local/share/gir-1.0/Gee-0.8.gir:7335:66: warning: element annotation from state 9 is unknown, ignoring
  1737. /usr/local/share/gir-1.0/Gee-0.8.gir:8990:48: warning: element annotation from state 9 is unknown, ignoring
  1738. /usr/local/share/gir-1.0/Gee-0.8.gir:9004:48: warning: element annotation from state 9 is unknown, ignoring
  1739. /usr/local/share/gir-1.0/Gee-0.8.gir:9018:48: warning: element annotation from state 9 is unknown, ignoring
  1740. /usr/local/share/gir-1.0/Gee-0.8.gir:9037:48: warning: element annotation from state 9 is unknown, ignoring
  1741. /usr/local/share/gir-1.0/Gee-0.8.gir:9056:48: warning: element annotation from state 9 is unknown, ignoring
  1742. /usr/local/share/gir-1.0/Gee-0.8.gir:9073:48: warning: element annotation from state 9 is unknown, ignoring
  1743. /usr/local/share/gir-1.0/Gee-0.8.gir:9090:48: warning: element annotation from state 9 is unknown, ignoring
  1744. /usr/local/share/gir-1.0/Gee-0.8.gir:9106:48: warning: element annotation from state 9 is unknown, ignoring
  1745. /usr/local/share/gir-1.0/Gee-0.8.gir:9122:48: warning: element annotation from state 9 is unknown, ignoring
  1746. /usr/local/share/gir-1.0/Gee-0.8.gir:9141:48: warning: element annotation from state 9 is unknown, ignoring
  1747. /usr/local/share/gir-1.0/Gee-0.8.gir:9160:48: warning: element annotation from state 9 is unknown, ignoring
  1748. /usr/local/share/gir-1.0/Gee-0.8.gir:9179:48: warning: element annotation from state 9 is unknown, ignoring
  1749. /usr/local/share/gir-1.0/Gee-0.8.gir:9198:48: warning: element annotation from state 9 is unknown, ignoring
  1750. /usr/local/share/gir-1.0/Gee-0.8.gir:9214:48: warning: element annotation from state 9 is unknown, ignoring
  1751. /usr/local/share/gir-1.0/Gee-0.8.gir:9230:48: warning: element annotation from state 9 is unknown, ignoring
  1752. /usr/local/share/gir-1.0/Gee-0.8.gir:9249:48: warning: element annotation from state 9 is unknown, ignoring
  1753. /usr/local/share/gir-1.0/Gee-0.8.gir:9268:48: warning: element annotation from state 9 is unknown, ignoring
  1754. /usr/local/share/gir-1.0/Gee-0.8.gir:9286:48: warning: element annotation from state 9 is unknown, ignoring
  1755. /usr/local/share/gir-1.0/Gee-0.8.gir:9304:48: warning: element annotation from state 17 is unknown, ignoring
  1756. /usr/local/share/gir-1.0/Gee-0.8.gir:9314:49: warning: element annotation from state 9 is unknown, ignoring
  1757. /usr/local/share/gir-1.0/Gee-0.8.gir:9333:49: warning: element annotation from state 9 is unknown, ignoring
  1758. /usr/local/share/gir-1.0/Gee-0.8.gir:9357:49: warning: element annotation from state 9 is unknown, ignoring
  1759. /usr/local/share/gir-1.0/Gee-0.8.gir:9379:49: warning: element annotation from state 9 is unknown, ignoring
  1760. /usr/local/share/gir-1.0/Gee-0.8.gir:9400:49: warning: element annotation from state 9 is unknown, ignoring
  1761. /usr/local/share/gir-1.0/Gee-0.8.gir:9424:49: warning: element annotation from state 9 is unknown, ignoring
  1762. /usr/local/share/gir-1.0/Gee-0.8.gir:9448:49: warning: element annotation from state 9 is unknown, ignoring
  1763. /usr/local/share/gir-1.0/Gee-0.8.gir:9469:49: warning: element annotation from state 9 is unknown, ignoring
  1764. /usr/local/share/gir-1.0/Gee-0.8.gir:9493:49: warning: element annotation from state 9 is unknown, ignoring
  1765. /usr/local/share/gir-1.0/Gee-0.8.gir:9591:48: warning: element annotation from state 9 is unknown, ignoring
  1766. Folks-0.6.gir:12:51: warning: element annotation from state 6 is unknown, ignoring
  1767. Folks-0.6.gir:13:55: warning: element annotation from state 6 is unknown, ignoring
  1768. Folks-0.6.gir:82:1: warning: element errordomain from state 6 is unknown, ignoring
  1769. Folks-0.6.gir:87:1: warning: element errordomain from state 6 is unknown, ignoring
  1770. Folks-0.6.gir:96:1: warning: element errordomain from state 6 is unknown, ignoring
  1771. Folks-0.6.gir:104:1: warning: element errordomain from state 6 is unknown, ignoring
  1772. Folks-0.6.gir:1126:78: warning: element annotation from state 15 is unknown, ignoring
  1773. Folks-0.6.gir:1127:54: warning: element annotation from state 15 is unknown, ignoring
  1774. Folks-0.6.gir:1258:78: warning: element annotation from state 15 is unknown, ignoring
  1775. Folks-0.6.gir:1259:54: warning: element annotation from state 15 is unknown, ignoring
  1776. Folks-0.6.gir:1365:78: warning: element annotation from state 15 is unknown, ignoring
  1777. Folks-0.6.gir:1366:54: warning: element annotation from state 15 is unknown, ignoring
  1778. Folks-0.6.gir:1567:79: warning: element annotation from state 9 is unknown, ignoring
  1779. Folks-0.6.gir:1568:54: warning: element annotation from state 9 is unknown, ignoring
  1780. Folks-0.6.gir:1584:98: warning: element annotation from state 9 is unknown, ignoring
  1781. Folks-0.6.gir:1585:54: warning: element annotation from state 9 is unknown, ignoring
  1782. Folks-0.6.gir:1888:104: warning: element annotation from state 9 is unknown, ignoring
  1783. Folks-0.6.gir:1889:54: warning: element annotation from state 9 is unknown, ignoring
  1784. Folks-0.6.gir:2342:95: warning: element annotation from state 15 is unknown, ignoring
  1785. Folks-0.6.gir:2343:56: warning: element annotation from state 15 is unknown, ignoring
  1786. Folks-0.6.gir:2347:95: warning: element annotation from state 15 is unknown, ignoring
  1787. Folks-0.6.gir:2348:56: warning: element annotation from state 15 is unknown, ignoring
  1788. Folks-0.6.gir:2361:84: warning: element annotation from state 15 is unknown, ignoring
  1789. Folks-0.6.gir:2362:54: warning: element annotation from state 15 is unknown, ignoring
  1790. Folks-0.6.gir:2627:66: warning: element annotation from state 9 is unknown, ignoring
  1791. Folks-0.6.gir:2628:54: warning: element annotation from state 9 is unknown, ignoring
  1792. gmake[3]: Leaving directory `/wrkdirs/usr/ports/net-im/folks/work/folks-0.9.6/folks'
  1793. Making all in backends
  1794. gmake[3]: Entering directory `/wrkdirs/usr/ports/net-im/folks/work/folks-0.9.6/backends'
  1795. Making all in key-file
  1796. gmake[4]: Entering directory `/wrkdirs/usr/ports/net-im/folks/work/folks-0.9.6/backends/key-file'
  1797. CC key_file_la-kf-backend.lo
  1798. CC key_file_la-kf-backend-factory.lo
  1799. CC key_file_la-kf-persona.lo
  1800. CC key_file_la-kf-persona-store.lo
  1801. warningwarningwarning: : unknown warning option '-Werror=missing-parameter-type' [-Wunknown-warning-option]warning: :
  1802. unknown warning option '-Werror=missing-parameter-type' [-Wunknown-warning-option]unknown warning option '-Werror=missing-parameter-type' [-Wunknown-warning-option]
  1803. unknown warning option '-Werror=missing-parameter-type' [-Wunknown-warning-option]
  1804.  
  1805. warning: unknown warning option '-Werror=old-style-declaration'; did you mean '-Werror=out-of-line-declaration'? [-Wunknown-warning-option]
  1806. warning: unknown warning option '-Werror=old-style-declaration'; did you mean '-Werror=out-of-line-declaration'? [-Wunknown-warning-option]
  1807. warning: warningunknown warning option '-Werror=old-style-declaration'; did you mean '-Werror=out-of-line-declaration'? [-Wunknown-warning-option]
  1808. : unknown warning option '-Werror=old-style-declaration'; did you mean '-Werror=out-of-line-declaration'? [-Wunknown-warning-option]
  1809. In file included from <built-in>:162:
  1810. In file included from <command line>:7:
  1811. ../../folks/warnings.h:49:32: warning: unknown warning group '-Wunused-but-set-variable', ignored [-Wunknown-pragmas]
  1812. #pragma GCC diagnostic ignored "-Wunused-but-set-variable"
  1813. ^
  1814. ../../folks/warnings.h:83:32: warning: unknown warning group '-Wsuggest-attribute=format', ignored [-Wunknown-pragmas]
  1815. #pragma GCC diagnostic ignored "-Wsuggest-attribute=format"
  1816. ^
  1817. In file included from <built-in>:162:
  1818. In file included from <command line>:7:
  1819. ../../folks/warnings.h:49:32: warning: unknown warning group '-Wunused-but-set-variable', ignored [-Wunknown-pragmas]
  1820. #pragma GCC diagnostic ignored "-Wunused-but-set-variable"
  1821. ^
  1822. ../../folks/warnings.hIn file included from :<built-in>83::162:
  1823. In file included from <command line>:327:
  1824. :../../folks/warnings.h warning:: 49unknown warning group '-Wsuggest-attribute=format', ignored [-Wunknown-pragmas]:
  1825. 32: warning: unknown warning group '-Wunused-but-set-variable', ignored [-Wunknown-pragmas]
  1826. #pragma GCC diagnostic ignored "-Wsuggest-attribute=format"
  1827. ^
  1828. In file included from <built-in>:162:
  1829. In file included from <command line>:7:
  1830. ../../folks/warnings.h:49:32: warning: unknown warning group '-Wunused-but-set-variable', ignored [-Wunknown-pragmas]#pragma GCC diagnostic ignored "-Wunused-but-set-variable"
  1831.  
  1832. ^
  1833. #pragma GCC diagnostic ignored "-Wunused-but-set-variable"
  1834. ^
  1835. ../../folks/warnings.h:83:32: warning: unknown warning group '-Wsuggest-attribute=format', ignored [-Wunknown-pragmas]
  1836. #pragma GCC diagnostic ignored "-Wsuggest-attribute=format"
  1837. ../../folks/warnings.h ^:
  1838. 83:32: warning: unknown warning group '-Wsuggest-attribute=format', ignored [-Wunknown-pragmas]
  1839. #pragma GCC diagnostic ignored "-Wsuggest-attribute=format"
  1840. ^
  1841. kf-backend.c:351:42: warning: incompatible pointer types passing 'GeeMap *' (aka 'struct _GeeMap *') to parameter of type 'GeeAbstractMap *' (aka 'struct _GeeAbstractMap *') [-Wincompatible-pointer-types]
  1842. _tmp16_ = gee_abstract_map_get_values ((GeeMap*) _tmp15_);
  1843. ^~~~~~~~~~~~~~~~~
  1844. /usr/local/include/gee-0.8/gee.h:1457:61: note: passing argument to parameter 'self' here
  1845. GeeCollection* gee_abstract_map_get_values (GeeAbstractMap* self);
  1846. ^
  1847. kf-persona-store.c:521:65: warning: incompatible pointer types passing 'guint8 **' (aka 'unsigned char **') to parameter of type 'char **' [-Wincompatible-pointer-types]
  1848. g_file_load_contents_finish (_data_->_tmp9_, _data_->_res_, &_data_->_tmp10_, &_data_->_tmp11_, NULL, &_data_->_inner_error_);
  1849. ^~~~~~~~~~~~~~~~
  1850. /usr/local/include/glib-2.0/gio/gfile.h:1193:36: note: passing argument to parameter 'contents' here
  1851. char **contents,
  1852. ^
  1853. kf-persona.c:570:53: warning: passing 'gconstpointer' (aka 'const void *') to parameter of type 'FolksAbstractFieldDetails *' (aka 'struct _FolksAbstractFieldDetails *') discards qualifiers [-Wincompatible-pointer-types-discards-qualifiers]
  1854. result = folks_abstract_field_details_hash_static (v);
  1855. ^
  1856. ../../folks/folks.h:1036:76: note: passing argument to parameter 'value' here
  1857. guint folks_abstract_field_details_hash_static (FolksAbstractFieldDetails* value);
  1858. ^
  1859. kf-persona.c:577:54: warning: passing 'gconstpointer' (aka 'const void *') to parameter of type 'FolksAbstractFieldDetails *' (aka 'struct _FolksAbstractFieldDetails *') discards qualifiers [-Wincompatible-pointer-types-discards-qualifiers]
  1860. result = folks_abstract_field_details_equal_static (a, b);
  1861. ^
  1862. ../../folks/folks.h:1032:80: note: passing argument to parameter 'left' here
  1863. gboolean folks_abstract_field_details_equal_static (FolksAbstractFieldDetails* left, FolksAbstractFieldDetails* right);
  1864. ^
  1865. kf-persona.c:577:57: warning: passing 'gconstpointer' (aka 'const void *') to parameter of type 'FolksAbstractFieldDetails *' (aka 'struct _FolksAbstractFieldDetails *') discards qualifiers [-Wincompatible-pointer-types-discards-qualifiers]
  1866. result = folks_abstract_field_details_equal_static (a, b);
  1867. ^
  1868. ../../folks/folks.h:1032:113: note: passing argument to parameter 'right' here
  1869. gboolean folks_abstract_field_details_equal_static (FolksAbstractFieldDetails* left, FolksAbstractFieldDetails* right);
  1870. ^
  1871. 4 warnings generated.
  1872. kf-persona-store.c:811:48: warning: incompatible pointer types passing 'GeeMap *' (aka 'struct _GeeMap *') to parameter of type 'GeeAbstractMap *' (aka 'struct _GeeAbstractMap *') [-Wincompatible-pointer-types]
  1873. _data_->_tmp64_ = gee_abstract_map_get_size ((GeeMap*) _data_->_tmp63_);
  1874. ^~~~~~~~~~~~~~~~~~~~~~~~~
  1875. /usr/local/include/gee-0.8/gee.h:1454:49: note: passing argument to parameter 'self' here
  1876. gint gee_abstract_map_get_size (GeeAbstractMap* self);
  1877. ^
  1878. kf-backend.c:742:50: warning: incompatible pointer types passing 'GeeMap *' (aka 'struct _GeeMap *') to parameter of type 'GeeAbstractMap *' (aka 'struct _GeeAbstractMap *') [-Wincompatible-pointer-types]
  1879. _data_->_tmp5_ = gee_abstract_map_get_values ((GeeMap*) _data_->_tmp4_);
  1880. ^~~~~~~~~~~~~~~~~~~~~~~~
  1881. /usr/local/include/gee-0.8/gee.h:1457:61: note: passing argument to parameter 'self' here
  1882. GeeCollection* gee_abstract_map_get_values (GeeAbstractMap* self);
  1883. ^
  1884. kf-persona.c:1355:18: warning: incompatible pointer types assigning to 'gchar **' (aka 'char **') from 'gpointer *' (aka 'void **') [-Wincompatible-pointer-types]
  1885. _data_->_tmp16_ = _data_->_tmp15_;
  1886. ^ ~~~~~~~~~~~~~~~
  1887. kf-persona-store.c:1482:50: warning: passing 'guint8 *' (aka 'unsigned char *') to parameter of type 'const char *' converts between pointers to integer types with different sign [-Wpointer-sign]
  1888. g_file_replace_contents_async (_data_->_tmp9_, _data_->_tmp12_, (gsize) _data_->_tmp12__length1, NULL, FALSE, G_FILE_CREATE_PRIVATE, _data_->_tmp13_, folks_backends_kf_persona_store_save_key_file_ready, _data_);
  1889. ^~~~~~~~~~~~~~~
  1890. /usr/local/include/glib-2.0/gio/gfile.h:1222:36: note: passing argument to parameter 'contents' here
  1891. const char *contents,
  1892. ^
  1893. kf-persona-store.c:1615:9: warning: assigning to 'gchar **' (aka 'char **') from 'const gchar *[5]' discards qualifiers in nested pointer types [-Wincompatible-pointer-types-discards-qualifiers]
  1894. _tmp0_ = FOLKS_BACKENDS_KF_PERSONA_STORE__always_writeable_properties;
  1895. ^ ~~~~~~~~~~~~~~~~~~~~~~~~~~~~~~~~~~~~~~~~~~~~~~~~~~~~~~~~~~~~
  1896. kf-persona.c:1577:9: warning: assigning to 'gchar **' (aka 'char **') from 'const gchar *[3]' discards qualifiers in nested pointer types [-Wincompatible-pointer-types-discards-qualifiers]
  1897. _tmp0_ = FOLKS_BACKENDS_KF_PERSONA__linkable_properties;
  1898. ^ ~~~~~~~~~~~~~~~~~~~~~~~~~~~~~~~~~~~~~~~~~~~~~~
  1899. kf-persona.c:1593:9: warning: assigning to 'gchar **' (aka 'char **') from 'const gchar *[5]' discards qualifiers in nested pointer types [-Wincompatible-pointer-types-discards-qualifiers]
  1900. _tmp0_ = FOLKS_BACKENDS_KF_PERSONA__writeable_properties;
  1901. ^ ~~~~~~~~~~~~~~~~~~~~~~~~~~~~~~~~~~~~~~~~~~~~~~~
  1902. kf-persona.c:2190:22: warning: incompatible pointer types assigning to 'void (*)(FolksAliasDetails *, const gchar *, GAsyncReadyCallback, gpointer)' from 'void (*)(FolksAliasDetails *, const gchar *, GError **)' [-Wincompatible-pointer-types]
  1903. iface->change_alias = (void (*)(FolksAliasDetails*, const gchar*, GError**)) folks_backends_kf_persona_real_change_alias;
  1904. ^ ~~~~~~~~~~~~~~~~~~~~~~~~~~~~~~~~~~~~~~~~~~~~~~~~~~~~~~~~~~~~~~~~~~~~~~~~~~~~~~~~~~~~~~~~~~~~~~~~~~
  1905. kf-persona.c:2199:27: warning: incompatible pointer types assigning to 'void (*)(FolksAntiLinkable *, GeeSet *, GAsyncReadyCallback, gpointer)' from 'void (*)(FolksAntiLinkable *, GeeSet *, GError **)' [-Wincompatible-pointer-types]
  1906. iface->change_anti_links = (void (*)(FolksAntiLinkable*, GeeSet*, GError**)) folks_backends_kf_persona_real_change_anti_links;
  1907. ^ ~~~~~~~~~~~~~~~~~~~~~~~~~~~~~~~~~~~~~~~~~~~~~~~~~~~~~~~~~~~~~~~~~~~~~~~~~~~~~~~~~~~~~~~~~~~~~~~~~~
  1908. kf-persona.c:2208:29: warning: incompatible pointer types assigning to 'void (*)(FolksImDetails *, GeeMultiMap *, GAsyncReadyCallback, gpointer)' from 'void (*)(FolksImDetails *, GeeMultiMap *, GError **)' [-Wincompatible-pointer-types]
  1909. iface->change_im_addresses = (void (*)(FolksImDetails*, GeeMultiMap*, GError**)) folks_backends_kf_persona_real_change_im_addresses;
  1910. ^ ~~~~~~~~~~~~~~~~~~~~~~~~~~~~~~~~~~~~~~~~~~~~~~~~~~~~~~~~~~~~~~~~~~~~~~~~~~~~~~~~~~~~~~~~~~~~~~~~~~~~~~
  1911. kf-persona.c:2217:38: warning: incompatible pointer types assigning to 'void (*)(FolksWebServiceDetails *, GeeMultiMap *, GAsyncReadyCallback, gpointer)' from 'void (*)(FolksWebServiceDetails *, GeeMultiMap *, GError **)' [-Wincompatible-pointer-types]
  1912. iface->change_web_service_addresses = (void (*)(FolksWebServiceDetails*, GeeMultiMap*, GError**)) folks_backends_kf_persona_real_change_web_service_addresses;
  1913. ^ ~~~~~~~~~~~~~~~~~~~~~~~~~~~~~~~~~~~~~~~~~~~~~~~~~~~~~~~~~~~~~~~~~~~~~~~~~~~~~~~~~~~~~~~~~~~~~~~~~~~~~~~~~~~~~~~~~~~~~~~
  1914. 6 warnings generated.
  1915. 8 warnings generated.
  1916. 14 warnings generated.
  1917. CCLD key-file.la
  1918. gmake[4]: Leaving directory `/wrkdirs/usr/ports/net-im/folks/work/folks-0.9.6/backends/key-file'
  1919. Making all in telepathy
  1920. gmake[4]: Entering directory `/wrkdirs/usr/ports/net-im/folks/work/folks-0.9.6/backends/telepathy'
  1921. Making all in lib
  1922. gmake[5]: Entering directory `/wrkdirs/usr/ports/net-im/folks/work/folks-0.9.6/backends/telepathy/lib'
  1923. CC libtp_lowlevel_la-tp-lowlevel.lo
  1924. CC libfolks_telepathy_la-tp-lowlevel.lo
  1925. CC libtp_zeitgeist_dummy_la-tp-zeitgeist-dummy.lo
  1926. warning: unknown warning option '-Werror=missing-parameter-type' [-Wunknown-warning-option]
  1927. warning: unknown warning option '-Werror=old-style-declaration'; did you mean '-Werror=out-of-line-declaration'? [-Wunknown-warning-option]
  1928. In file included from <built-in>:162:
  1929. In file included from <command line>:9:
  1930. ../../../folks/warnings.h:49:32: warning: unknown warning group '-Wunused-but-set-variable', ignored [-Wunknown-pragmas]
  1931. #pragma GCC diagnostic ignored "-Wunused-but-set-variable"
  1932. ^
  1933. ../../../folks/warnings.h:83:32: warning: unknown warning group '-Wsuggest-attribute=format', ignored [-Wunknown-pragmas]
  1934. #pragma GCC diagnostic ignored "-Wsuggest-attribute=format"
  1935. ^
  1936. warning: unknown warning option '-Werror=missing-parameter-type' [-Wunknown-warning-option]
  1937. warning: unknown warning option '-Werror=old-style-declaration'; did you mean '-Werror=out-of-line-declaration'? [-Wunknown-warning-option]
  1938. In file included from <built-in>:162:
  1939. In file included from <command line>:12:
  1940. ../../../folks/warnings.h:49:32: warning: unknown warning group '-Wunused-but-set-variable', ignored [-Wunknown-pragmas]
  1941. #pragma GCC diagnostic ignored "-Wunused-but-set-variable"
  1942. ^
  1943. ../../../folks/warnings.h:83:32: warning: unknown warning group '-Wsuggest-attribute=format', ignored [-Wunknown-pragmas]
  1944. #pragma GCC diagnostic ignored "-Wsuggest-attribute=format"
  1945. ^
  1946. 2 warnings generated.
  1947. 2 warnings generated.
  1948. CCLD libtp-lowlevel.la
  1949. 4 warnings generated.
  1950. CCLD libtp-zeitgeist-dummy.la
  1951. GISCAN TpLowlevel-0.6.gir
  1952. gmake TpLowlevel-0.6.gir
  1953. GICOMP TpLowlevel-0.6.gir
  1954. gmake[6]: Entering directory `/wrkdirs/usr/ports/net-im/folks/work/folks-0.9.6/backends/telepathy/lib'
  1955. gmake[6]: `TpLowlevel-0.6.gir' is up to date.
  1956. gmake[6]: Leaving directory `/wrkdirs/usr/ports/net-im/folks/work/folks-0.9.6/backends/telepathy/lib'
  1957. GEN tp-lowlevel.vapi
  1958. Generation succeeded - 0 warning(s)
  1959. touch tp-lowlevel.vapi
  1960. VALAC libfolks_telepathy_la_vala.stamp
  1961. tpf-persona.vala:981.26-981.49: warning: TelepathyGLib.Contact.get_contact_info is deprecated
  1962. tpf-persona-store.vala:398.11-398.30: warning: TelepathyGLib.Account.get_protocol is deprecated
  1963. tpf-persona-store.vala:399.11-399.30: warning: TelepathyGLib.Account.get_protocol is deprecated
  1964. tpf-persona-store.vala:854.17-854.60: warning: TelepathyGLib.Connection.get_contact_info_supported_fields is deprecated
  1965. tpf-persona.vala:772.20-772.39: warning: TelepathyGLib.Account.get_protocol is deprecated
  1966. tpf-persona.vala:775.42-775.63: warning: TelepathyGLib.Connection.self_handle is deprecated
  1967. tpf-persona.vala:822.15-822.34: warning: TelepathyGLib.Account.get_protocol is deprecated
  1968. tpf-persona.vala:824.35-824.54: warning: TelepathyGLib.Account.get_protocol is deprecated
  1969. Compilation failed: 0 error(s), 8 warning(s)
  1970. gmake[5]: *** [libfolks_telepathy_la_vala.stamp] Error 1
  1971. gmake[5]: Leaving directory `/wrkdirs/usr/ports/net-im/folks/work/folks-0.9.6/backends/telepathy/lib'
  1972. gmake[4]: *** [all-recursive] Error 1
  1973. gmake[4]: Leaving directory `/wrkdirs/usr/ports/net-im/folks/work/folks-0.9.6/backends/telepathy'
  1974. gmake[3]: *** [all-recursive] Error 1
  1975. gmake[3]: Leaving directory `/wrkdirs/usr/ports/net-im/folks/work/folks-0.9.6/backends'
  1976. gmake[2]: *** [all-recursive] Error 1
  1977. gmake[2]: Leaving directory `/wrkdirs/usr/ports/net-im/folks/work/folks-0.9.6'
  1978. gmake[1]: *** [all] Error 2
  1979. gmake[1]: Leaving directory `/wrkdirs/usr/ports/net-im/folks/work/folks-0.9.6'
  1980. ===> Compilation failed unexpectedly.
  1981. Try to set MAKE_JOBS_UNSAFE=yes and rebuild before reporting the failure to
  1982. the maintainer.
  1983. *** Error code 1
  1984.  
  1985. Stop.
  1986. make: stopped in /usr/ports/net-im/folks
  1987. ====>> Saved folks-0.9.6 wrkdir to: /usr/local/poudriere_data/wrkdirs/head_amd64_gnome-xorg-gnome-mc-exp/xorg-gnome-mc-exp/folks-0.9.6.tbz
  1988. =======================<phase: Interactive >============================
Advertisement
Add Comment
Please, Sign In to add comment