Guest User

Untitled

a guest
Jun 24th, 2020
37
Never
Not a member of Pastebin yet? Sign Up, it unlocks many cool features!
text 182.32 KB | None
  1. Running org.openmrs.module.aijar.AijarServiceTest
  2. Tests run: 5, Failures: 0, Errors: 5, Skipped: 0, Time elapsed: 45.051 sec <<< FAILURE!
  3. generateAndSaveUICForPatientsWithOut_shouldGenerateUICForPatientWithoutUIC(org.openmrs.module.aijar.AijarServiceTest) Time elapsed: 0 sec <<< ERROR!
  4. java.lang.IllegalStateException: Failed to load ApplicationContext
  5. at org.springframework.test.context.DefaultCacheAwareContextLoaderDelegate.loadContext(DefaultCacheAwareContextLoaderDelegate.java:94)
  6. at org.springframework.test.context.DefaultTestContext.getApplicationContext(DefaultTestContext.java:72)
  7. at org.springframework.test.context.support.DependencyInjectionTestExecutionListener.injectDependencies(DependencyInjectionTestExecutionListener.java:117)
  8. at org.springframework.test.context.support.DependencyInjectionTestExecutionListener.prepareTestInstance(DependencyInjectionTestExecutionListener.java:83)
  9. at org.springframework.test.context.TestContextManager.prepareTestInstance(TestContextManager.java:212)
  10. at org.springframework.test.context.junit4.SpringJUnit4ClassRunner.createTest(SpringJUnit4ClassRunner.java:200)
  11. at org.springframework.test.context.junit4.SpringJUnit4ClassRunner$1.runReflectiveCall(SpringJUnit4ClassRunner.java:252)
  12. at org.junit.internal.runners.model.ReflectiveCallable.run(ReflectiveCallable.java:12)
  13. at org.springframework.test.context.junit4.SpringJUnit4ClassRunner.methodBlock(SpringJUnit4ClassRunner.java:254)
  14. at org.springframework.test.context.junit4.SpringJUnit4ClassRunner.runChild(SpringJUnit4ClassRunner.java:217)
  15. at org.springframework.test.context.junit4.SpringJUnit4ClassRunner.runChild(SpringJUnit4ClassRunner.java:83)
  16. at org.junit.runners.ParentRunner$3.run(ParentRunner.java:290)
  17. at org.junit.runners.ParentRunner$1.schedule(ParentRunner.java:71)
  18. at org.junit.runners.ParentRunner.runChildren(ParentRunner.java:288)
  19. at org.junit.runners.ParentRunner.access$000(ParentRunner.java:58)
  20. at org.junit.runners.ParentRunner$2.evaluate(ParentRunner.java:268)
  21. at org.springframework.test.context.junit4.statements.RunBeforeTestClassCallbacks.evaluate(RunBeforeTestClassCallbacks.java:61)
  22. at org.junit.internal.runners.statements.RunAfters.evaluate(RunAfters.java:27)
  23. at org.springframework.test.context.junit4.statements.RunAfterTestClassCallbacks.evaluate(RunAfterTestClassCallbacks.java:68)
  24. at org.junit.runners.ParentRunner.run(ParentRunner.java:363)
  25. at org.springframework.test.context.junit4.SpringJUnit4ClassRunner.run(SpringJUnit4ClassRunner.java:163)
  26. at org.apache.maven.surefire.junit4.JUnit4Provider.execute(JUnit4Provider.java:252)
  27. at org.apache.maven.surefire.junit4.JUnit4Provider.executeTestSet(JUnit4Provider.java:141)
  28. at org.apache.maven.surefire.junit4.JUnit4Provider.invoke(JUnit4Provider.java:112)
  29. at sun.reflect.NativeMethodAccessorImpl.invoke0(Native Method)
  30. at sun.reflect.NativeMethodAccessorImpl.invoke(NativeMethodAccessorImpl.java:62)
  31. at sun.reflect.DelegatingMethodAccessorImpl.invoke(DelegatingMethodAccessorImpl.java:43)
  32. at java.lang.reflect.Method.invoke(Method.java:498)
  33. at org.apache.maven.surefire.util.ReflectionUtils.invokeMethodWithArray(ReflectionUtils.java:189)
  34. at org.apache.maven.surefire.booter.ProviderFactory$ProviderProxy.invoke(ProviderFactory.java:165)
  35. at org.apache.maven.surefire.booter.ProviderFactory.invokeProvider(ProviderFactory.java:85)
  36. at org.apache.maven.surefire.booter.ForkedBooter.runSuitesInProcess(ForkedBooter.java:115)
  37. at org.apache.maven.surefire.booter.ForkedBooter.main(ForkedBooter.java:75)
  38. Caused by: org.springframework.beans.factory.BeanCreationException: Error creating bean with name 'stringToHtmlFormConverter': Injection of autowired dependencies failed; nested exception is org.springframework.beans.factory.BeanCreationException: Could not autowire field: org.openmrs.module.htmlformentry.HtmlFormEntryService org.openmrs.module.htmlformentryui.converter.StringToHtmlFormConverter.htmlFormEntryService; nested exception is org.springframework.beans.factory.NoSuchBeanDefinitionException: No qualifying bean of type [org.openmrs.module.htmlformentry.HtmlFormEntryService] found for dependency: expected at least 1 bean which qualifies as autowire candidate for this dependency. Dependency annotations: {@org.springframework.beans.factory.annotation.Autowired(required=true), @org.springframework.beans.factory.annotation.Qualifier(value=htmlFormEntryService)}
  39. Related cause: org.springframework.beans.factory.BeanCreationException: Error creating bean with name 'htmlFormEntryService' defined in URL [jar:file:/C:/Users/lenovo/.m2/repository/org/openmrs/module/htmlformentry-api/3.11.0/htmlformentry-api-3.11.0.jar!/moduleApplicationContext.xml]: Cannot create inner bean 'org.openmrs.module.htmlformentry.impl.HtmlFormEntryServiceImpl#4e789704' of type [org.openmrs.module.htmlformentry.impl.HtmlFormEntryServiceImpl] while setting bean property 'target'; nested exception is org.springframework.beans.factory.BeanCreationException: Error creating bean with name 'org.openmrs.module.htmlformentry.impl.HtmlFormEntryServiceImpl#4e789704' defined in URL [jar:file:/C:/Users/lenovo/.m2/repository/org/openmrs/module/htmlformentry-api/3.11.0/htmlformentry-api-3.11.0.jar!/moduleApplicationContext.xml]: Cannot create inner bean 'org.openmrs.module.htmlformentry.handler.ConditionTagHandler#54e06788' of type [org.openmrs.module.htmlformentry.handler.ConditionTagHandler] while setting bean property 'handlers' with key [TypedStringValue: value [condition], target type [null]]; nested exception is org.springframework.beans.factory.BeanCreationException: Error creating bean with name 'org.openmrs.module.htmlformentry.handler.ConditionTagHandler#54e06788': Injection of autowired dependencies failed; nested exception is org.springframework.beans.factory.BeanCreationException: Could not autowire field: private org.openmrs.module.htmlformentry.handler.ConditionTagHandlerSupport org.openmrs.module.htmlformentry.handler.ConditionTagHandler.handler; nested exception is org.springframework.beans.factory.NoSuchBeanDefinitionException: No qualifying bean of type [org.openmrs.module.htmlformentry.handler.ConditionTagHandlerSupport] found for dependency: expected at least 1 bean which qualifies as autowire candidate for this dependency. Dependency annotations: {@org.springframework.beans.factory.annotation.Autowired(required=true)}
  40. at org.springframework.beans.factory.annotation.AutowiredAnnotationBeanPostProcessor.postProcessPropertyValues(AutowiredAnnotationBeanPostProcessor.java:334)
  41. at org.springframework.beans.factory.support.AbstractAutowireCapableBeanFactory.populateBean(AbstractAutowireCapableBeanFactory.java:1202)
  42. at org.springframework.beans.factory.support.AbstractAutowireCapableBeanFactory.doCreateBean(AbstractAutowireCapableBeanFactory.java:537)
  43. at org.springframework.beans.factory.support.AbstractAutowireCapableBeanFactory.createBean(AbstractAutowireCapableBeanFactory.java:476)
  44. at org.springframework.beans.factory.support.AbstractBeanFactory$1.getObject(AbstractBeanFactory.java:303)
  45. at org.springframework.beans.factory.support.DefaultSingletonBeanRegistry.getSingleton(DefaultSingletonBeanRegistry.java:230)
  46. at org.springframework.beans.factory.support.AbstractBeanFactory.doGetBean(AbstractBeanFactory.java:299)
  47. at org.springframework.beans.factory.support.AbstractBeanFactory.getBean(AbstractBeanFactory.java:194)
  48. at org.springframework.beans.factory.support.DefaultListableBeanFactory.preInstantiateSingletons(DefaultListableBeanFactory.java:762)
  49. at org.springframework.context.support.AbstractApplicationContext.finishBeanFactoryInitialization(AbstractApplicationContext.java:757)
  50. at org.springframework.context.support.AbstractApplicationContext.refresh(AbstractApplicationContext.java:480)
  51. at org.springframework.test.context.support.AbstractGenericContextLoader.loadContext(AbstractGenericContextLoader.java:125)
  52. at org.springframework.test.context.support.AbstractGenericContextLoader.loadContext(AbstractGenericContextLoader.java:60)
  53. at org.springframework.test.context.support.AbstractDelegatingSmartContextLoader.delegateLoading(AbstractDelegatingSmartContextLoader.java:109)
  54. at org.springframework.test.context.support.AbstractDelegatingSmartContextLoader.loadContext(AbstractDelegatingSmartContextLoader.java:261)
  55. at org.springframework.test.context.DefaultCacheAwareContextLoaderDelegate.loadContextInternal(DefaultCacheAwareContextLoaderDelegate.java:68)
  56. at org.springframework.test.context.DefaultCacheAwareContextLoaderDelegate.loadContext(DefaultCacheAwareContextLoaderDelegate.java:86)
  57. ... 32 more
  58. Caused by: org.springframework.beans.factory.BeanCreationException: Could not autowire field: org.openmrs.module.htmlformentry.HtmlFormEntryService org.openmrs.module.htmlformentryui.converter.StringToHtmlFormConverter.htmlFormEntryService; nested exception is org.springframework.beans.factory.NoSuchBeanDefinitionException: No qualifying bean of type [org.openmrs.module.htmlformentry.HtmlFormEntryService] found for dependency: expected at least 1 bean which qualifies as autowire candidate for this dependency. Dependency annotations: {@org.springframework.beans.factory.annotation.Autowired(required=true), @org.springframework.beans.factory.annotation.Qualifier(value=htmlFormEntryService)}
  59. at org.springframework.beans.factory.annotation.AutowiredAnnotationBeanPostProcessor$AutowiredFieldElement.inject(AutowiredAnnotationBeanPostProcessor.java:561)
  60. at org.springframework.beans.factory.annotation.InjectionMetadata.inject(InjectionMetadata.java:88)
  61. at org.springframework.beans.factory.annotation.AutowiredAnnotationBeanPostProcessor.postProcessPropertyValues(AutowiredAnnotationBeanPostProcessor.java:331)
  62. ... 48 more
  63. Caused by: org.springframework.beans.factory.NoSuchBeanDefinitionException: No qualifying bean of type [org.openmrs.module.htmlformentry.HtmlFormEntryService] found for dependency: expected at least 1 bean which qualifies as autowire candidate for this dependency. Dependency annotations: {@org.springframework.beans.factory.annotation.Autowired(required=true), @org.springframework.beans.factory.annotation.Qualifier(value=htmlFormEntryService)}
  64. at org.springframework.beans.factory.support.DefaultListableBeanFactory.raiseNoSuchBeanDefinitionException(DefaultListableBeanFactory.java:1308)
  65. at org.springframework.beans.factory.support.DefaultListableBeanFactory.doResolveDependency(DefaultListableBeanFactory.java:1054)
  66. at org.springframework.beans.factory.support.DefaultListableBeanFactory.resolveDependency(DefaultListableBeanFactory.java:949)
  67. at org.springframework.beans.factory.annotation.AutowiredAnnotationBeanPostProcessor$AutowiredFieldElement.inject(AutowiredAnnotationBeanPostProcessor.java:533)
  68. ... 50 more
  69.  
  70. isTransferredOut_ShouldReturnFalseWhenPatientIsNotTransferredOut(org.openmrs.module.aijar.AijarServiceTest) Time elapsed: 0.015 sec <<< ERROR!
  71. java.lang.IllegalStateException: Failed to load ApplicationContext
  72. at org.springframework.test.context.DefaultCacheAwareContextLoaderDelegate.loadContext(DefaultCacheAwareContextLoaderDelegate.java:94)
  73. at org.springframework.test.context.DefaultTestContext.getApplicationContext(DefaultTestContext.java:72)
  74. at org.springframework.test.context.support.DependencyInjectionTestExecutionListener.injectDependencies(DependencyInjectionTestExecutionListener.java:117)
  75. at org.springframework.test.context.support.DependencyInjectionTestExecutionListener.prepareTestInstance(DependencyInjectionTestExecutionListener.java:83)
  76. at org.springframework.test.context.TestContextManager.prepareTestInstance(TestContextManager.java:212)
  77. at org.springframework.test.context.junit4.SpringJUnit4ClassRunner.createTest(SpringJUnit4ClassRunner.java:200)
  78. at org.springframework.test.context.junit4.SpringJUnit4ClassRunner$1.runReflectiveCall(SpringJUnit4ClassRunner.java:252)
  79. at org.junit.internal.runners.model.ReflectiveCallable.run(ReflectiveCallable.java:12)
  80. at org.springframework.test.context.junit4.SpringJUnit4ClassRunner.methodBlock(SpringJUnit4ClassRunner.java:254)
  81. at org.springframework.test.context.junit4.SpringJUnit4ClassRunner.runChild(SpringJUnit4ClassRunner.java:217)
  82. at org.springframework.test.context.junit4.SpringJUnit4ClassRunner.runChild(SpringJUnit4ClassRunner.java:83)
  83. at org.junit.runners.ParentRunner$3.run(ParentRunner.java:290)
  84. at org.junit.runners.ParentRunner$1.schedule(ParentRunner.java:71)
  85. at org.junit.runners.ParentRunner.runChildren(ParentRunner.java:288)
  86. at org.junit.runners.ParentRunner.access$000(ParentRunner.java:58)
  87. at org.junit.runners.ParentRunner$2.evaluate(ParentRunner.java:268)
  88. at org.springframework.test.context.junit4.statements.RunBeforeTestClassCallbacks.evaluate(RunBeforeTestClassCallbacks.java:61)
  89. at org.junit.internal.runners.statements.RunAfters.evaluate(RunAfters.java:27)
  90. at org.springframework.test.context.junit4.statements.RunAfterTestClassCallbacks.evaluate(RunAfterTestClassCallbacks.java:68)
  91. at org.junit.runners.ParentRunner.run(ParentRunner.java:363)
  92. at org.springframework.test.context.junit4.SpringJUnit4ClassRunner.run(SpringJUnit4ClassRunner.java:163)
  93. at org.apache.maven.surefire.junit4.JUnit4Provider.execute(JUnit4Provider.java:252)
  94. at org.apache.maven.surefire.junit4.JUnit4Provider.executeTestSet(JUnit4Provider.java:141)
  95. at org.apache.maven.surefire.junit4.JUnit4Provider.invoke(JUnit4Provider.java:112)
  96. at sun.reflect.NativeMethodAccessorImpl.invoke0(Native Method)
  97. at sun.reflect.NativeMethodAccessorImpl.invoke(NativeMethodAccessorImpl.java:62)
  98. at sun.reflect.DelegatingMethodAccessorImpl.invoke(DelegatingMethodAccessorImpl.java:43)
  99. at java.lang.reflect.Method.invoke(Method.java:498)
  100. at org.apache.maven.surefire.util.ReflectionUtils.invokeMethodWithArray(ReflectionUtils.java:189)
  101. at org.apache.maven.surefire.booter.ProviderFactory$ProviderProxy.invoke(ProviderFactory.java:165)
  102. at org.apache.maven.surefire.booter.ProviderFactory.invokeProvider(ProviderFactory.java:85)
  103. at org.apache.maven.surefire.booter.ForkedBooter.runSuitesInProcess(ForkedBooter.java:115)
  104. at org.apache.maven.surefire.booter.ForkedBooter.main(ForkedBooter.java:75)
  105. Caused by: org.springframework.beans.factory.BeanCreationException: Error creating bean with name 'stringToHtmlFormConverter': Injection of autowired dependencies failed; nested exception is org.springframework.beans.factory.BeanCreationException: Could not autowire field: org.openmrs.module.htmlformentry.HtmlFormEntryService org.openmrs.module.htmlformentryui.converter.StringToHtmlFormConverter.htmlFormEntryService; nested exception is org.springframework.beans.factory.NoSuchBeanDefinitionException: No qualifying bean of type [org.openmrs.module.htmlformentry.HtmlFormEntryService] found for dependency: expected at least 1 bean which qualifies as autowire candidate for this dependency. Dependency annotations: {@org.springframework.beans.factory.annotation.Autowired(required=true), @org.springframework.beans.factory.annotation.Qualifier(value=htmlFormEntryService)}
  106. Related cause: org.springframework.beans.factory.BeanCreationException: Error creating bean with name 'htmlFormEntryService' defined in URL [jar:file:/C:/Users/lenovo/.m2/repository/org/openmrs/module/htmlformentry-api/3.11.0/htmlformentry-api-3.11.0.jar!/moduleApplicationContext.xml]: Cannot create inner bean 'org.openmrs.module.htmlformentry.impl.HtmlFormEntryServiceImpl#2e866270' of type [org.openmrs.module.htmlformentry.impl.HtmlFormEntryServiceImpl] while setting bean property 'target'; nested exception is org.springframework.beans.factory.BeanCreationException: Error creating bean with name 'org.openmrs.module.htmlformentry.impl.HtmlFormEntryServiceImpl#2e866270' defined in URL [jar:file:/C:/Users/lenovo/.m2/repository/org/openmrs/module/htmlformentry-api/3.11.0/htmlformentry-api-3.11.0.jar!/moduleApplicationContext.xml]: Cannot create inner bean 'org.openmrs.module.htmlformentry.handler.ConditionTagHandler#3a1575f8' of type [org.openmrs.module.htmlformentry.handler.ConditionTagHandler] while setting bean property 'handlers' with key [TypedStringValue: value [condition], target type [null]]; nested exception is org.springframework.beans.factory.BeanCreationException: Error creating bean with name 'org.openmrs.module.htmlformentry.handler.ConditionTagHandler#3a1575f8': Injection of autowired dependencies failed; nested exception is org.springframework.beans.factory.BeanCreationException: Could not autowire field: private org.openmrs.module.htmlformentry.handler.ConditionTagHandlerSupport org.openmrs.module.htmlformentry.handler.ConditionTagHandler.handler; nested exception is org.springframework.beans.factory.NoSuchBeanDefinitionException: No qualifying bean of type [org.openmrs.module.htmlformentry.handler.ConditionTagHandlerSupport] found for dependency: expected at least 1 bean which qualifies as autowire candidate for this dependency. Dependency annotations: {@org.springframework.beans.factory.annotation.Autowired(required=true)}
  107. at org.springframework.beans.factory.annotation.AutowiredAnnotationBeanPostProcessor.postProcessPropertyValues(AutowiredAnnotationBeanPostProcessor.java:334)
  108. at org.springframework.beans.factory.support.AbstractAutowireCapableBeanFactory.populateBean(AbstractAutowireCapableBeanFactory.java:1202)
  109. at org.springframework.beans.factory.support.AbstractAutowireCapableBeanFactory.doCreateBean(AbstractAutowireCapableBeanFactory.java:537)
  110. at org.springframework.beans.factory.support.AbstractAutowireCapableBeanFactory.createBean(AbstractAutowireCapableBeanFactory.java:476)
  111. at org.springframework.beans.factory.support.AbstractBeanFactory$1.getObject(AbstractBeanFactory.java:303)
  112. at org.springframework.beans.factory.support.DefaultSingletonBeanRegistry.getSingleton(DefaultSingletonBeanRegistry.java:230)
  113. at org.springframework.beans.factory.support.AbstractBeanFactory.doGetBean(AbstractBeanFactory.java:299)
  114. at org.springframework.beans.factory.support.AbstractBeanFactory.getBean(AbstractBeanFactory.java:194)
  115. at org.springframework.beans.factory.support.DefaultListableBeanFactory.preInstantiateSingletons(DefaultListableBeanFactory.java:762)
  116. at org.springframework.context.support.AbstractApplicationContext.finishBeanFactoryInitialization(AbstractApplicationContext.java:757)
  117. at org.springframework.context.support.AbstractApplicationContext.refresh(AbstractApplicationContext.java:480)
  118. at org.springframework.test.context.support.AbstractGenericContextLoader.loadContext(AbstractGenericContextLoader.java:125)
  119. at org.springframework.test.context.support.AbstractGenericContextLoader.loadContext(AbstractGenericContextLoader.java:60)
  120. at org.springframework.test.context.support.AbstractDelegatingSmartContextLoader.delegateLoading(AbstractDelegatingSmartContextLoader.java:109)
  121. at org.springframework.test.context.support.AbstractDelegatingSmartContextLoader.loadContext(AbstractDelegatingSmartContextLoader.java:261)
  122. at org.springframework.test.context.DefaultCacheAwareContextLoaderDelegate.loadContextInternal(DefaultCacheAwareContextLoaderDelegate.java:68)
  123. at org.springframework.test.context.DefaultCacheAwareContextLoaderDelegate.loadContext(DefaultCacheAwareContextLoaderDelegate.java:86)
  124. ... 32 more
  125. Caused by: org.springframework.beans.factory.BeanCreationException: Could not autowire field: org.openmrs.module.htmlformentry.HtmlFormEntryService org.openmrs.module.htmlformentryui.converter.StringToHtmlFormConverter.htmlFormEntryService; nested exception is org.springframework.beans.factory.NoSuchBeanDefinitionException: No qualifying bean of type [org.openmrs.module.htmlformentry.HtmlFormEntryService] found for dependency: expected at least 1 bean which qualifies as autowire candidate for this dependency. Dependency annotations: {@org.springframework.beans.factory.annotation.Autowired(required=true), @org.springframework.beans.factory.annotation.Qualifier(value=htmlFormEntryService)}
  126. at org.springframework.beans.factory.annotation.AutowiredAnnotationBeanPostProcessor$AutowiredFieldElement.inject(AutowiredAnnotationBeanPostProcessor.java:561)
  127. at org.springframework.beans.factory.annotation.InjectionMetadata.inject(InjectionMetadata.java:88)
  128. at org.springframework.beans.factory.annotation.AutowiredAnnotationBeanPostProcessor.postProcessPropertyValues(AutowiredAnnotationBeanPostProcessor.java:331)
  129. ... 48 more
  130. Caused by: org.springframework.beans.factory.NoSuchBeanDefinitionException: No qualifying bean of type [org.openmrs.module.htmlformentry.HtmlFormEntryService] found for dependency: expected at least 1 bean which qualifies as autowire candidate for this dependency. Dependency annotations: {@org.springframework.beans.factory.annotation.Autowired(required=true), @org.springframework.beans.factory.annotation.Qualifier(value=htmlFormEntryService)}
  131. at org.springframework.beans.factory.support.DefaultListableBeanFactory.raiseNoSuchBeanDefinitionException(DefaultListableBeanFactory.java:1308)
  132. at org.springframework.beans.factory.support.DefaultListableBeanFactory.doResolveDependency(DefaultListableBeanFactory.java:1054)
  133. at org.springframework.beans.factory.support.DefaultListableBeanFactory.resolveDependency(DefaultListableBeanFactory.java:949)
  134. at org.springframework.beans.factory.annotation.AutowiredAnnotationBeanPostProcessor$AutowiredFieldElement.inject(AutowiredAnnotationBeanPostProcessor.java:533)
  135. ... 50 more
  136.  
  137. generatePatientUIC_shouldGenerateUIC(org.openmrs.module.aijar.AijarServiceTest) Time elapsed: 0.001 sec <<< ERROR!
  138. java.lang.IllegalStateException: Failed to load ApplicationContext
  139. at org.springframework.test.context.DefaultCacheAwareContextLoaderDelegate.loadContext(DefaultCacheAwareContextLoaderDelegate.java:94)
  140. at org.springframework.test.context.DefaultTestContext.getApplicationContext(DefaultTestContext.java:72)
  141. at org.springframework.test.context.support.DependencyInjectionTestExecutionListener.injectDependencies(DependencyInjectionTestExecutionListener.java:117)
  142. at org.springframework.test.context.support.DependencyInjectionTestExecutionListener.prepareTestInstance(DependencyInjectionTestExecutionListener.java:83)
  143. at org.springframework.test.context.TestContextManager.prepareTestInstance(TestContextManager.java:212)
  144. at org.springframework.test.context.junit4.SpringJUnit4ClassRunner.createTest(SpringJUnit4ClassRunner.java:200)
  145. at org.springframework.test.context.junit4.SpringJUnit4ClassRunner$1.runReflectiveCall(SpringJUnit4ClassRunner.java:252)
  146. at org.junit.internal.runners.model.ReflectiveCallable.run(ReflectiveCallable.java:12)
  147. at org.springframework.test.context.junit4.SpringJUnit4ClassRunner.methodBlock(SpringJUnit4ClassRunner.java:254)
  148. at org.springframework.test.context.junit4.SpringJUnit4ClassRunner.runChild(SpringJUnit4ClassRunner.java:217)
  149. at org.springframework.test.context.junit4.SpringJUnit4ClassRunner.runChild(SpringJUnit4ClassRunner.java:83)
  150. at org.junit.runners.ParentRunner$3.run(ParentRunner.java:290)
  151. at org.junit.runners.ParentRunner$1.schedule(ParentRunner.java:71)
  152. at org.junit.runners.ParentRunner.runChildren(ParentRunner.java:288)
  153. at org.junit.runners.ParentRunner.access$000(ParentRunner.java:58)
  154. at org.junit.runners.ParentRunner$2.evaluate(ParentRunner.java:268)
  155. at org.springframework.test.context.junit4.statements.RunBeforeTestClassCallbacks.evaluate(RunBeforeTestClassCallbacks.java:61)
  156. at org.junit.internal.runners.statements.RunAfters.evaluate(RunAfters.java:27)
  157. at org.springframework.test.context.junit4.statements.RunAfterTestClassCallbacks.evaluate(RunAfterTestClassCallbacks.java:68)
  158. at org.junit.runners.ParentRunner.run(ParentRunner.java:363)
  159. at org.springframework.test.context.junit4.SpringJUnit4ClassRunner.run(SpringJUnit4ClassRunner.java:163)
  160. at org.apache.maven.surefire.junit4.JUnit4Provider.execute(JUnit4Provider.java:252)
  161. at org.apache.maven.surefire.junit4.JUnit4Provider.executeTestSet(JUnit4Provider.java:141)
  162. at org.apache.maven.surefire.junit4.JUnit4Provider.invoke(JUnit4Provider.java:112)
  163. at sun.reflect.NativeMethodAccessorImpl.invoke0(Native Method)
  164. at sun.reflect.NativeMethodAccessorImpl.invoke(NativeMethodAccessorImpl.java:62)
  165. at sun.reflect.DelegatingMethodAccessorImpl.invoke(DelegatingMethodAccessorImpl.java:43)
  166. at java.lang.reflect.Method.invoke(Method.java:498)
  167. at org.apache.maven.surefire.util.ReflectionUtils.invokeMethodWithArray(ReflectionUtils.java:189)
  168. at org.apache.maven.surefire.booter.ProviderFactory$ProviderProxy.invoke(ProviderFactory.java:165)
  169. at org.apache.maven.surefire.booter.ProviderFactory.invokeProvider(ProviderFactory.java:85)
  170. at org.apache.maven.surefire.booter.ForkedBooter.runSuitesInProcess(ForkedBooter.java:115)
  171. at org.apache.maven.surefire.booter.ForkedBooter.main(ForkedBooter.java:75)
  172. Caused by: org.springframework.beans.factory.BeanCreationException: Error creating bean with name 'stringToHtmlFormConverter': Injection of autowired dependencies failed; nested exception is org.springframework.beans.factory.BeanCreationException: Could not autowire field: org.openmrs.module.htmlformentry.HtmlFormEntryService org.openmrs.module.htmlformentryui.converter.StringToHtmlFormConverter.htmlFormEntryService; nested exception is org.springframework.beans.factory.NoSuchBeanDefinitionException: No qualifying bean of type [org.openmrs.module.htmlformentry.HtmlFormEntryService] found for dependency: expected at least 1 bean which qualifies as autowire candidate for this dependency. Dependency annotations: {@org.springframework.beans.factory.annotation.Autowired(required=true), @org.springframework.beans.factory.annotation.Qualifier(value=htmlFormEntryService)}
  173. Related cause: org.springframework.beans.factory.BeanCreationException: Error creating bean with name 'htmlFormEntryService' defined in URL [jar:file:/C:/Users/lenovo/.m2/repository/org/openmrs/module/htmlformentry-api/3.11.0/htmlformentry-api-3.11.0.jar!/moduleApplicationContext.xml]: Cannot create inner bean 'org.openmrs.module.htmlformentry.impl.HtmlFormEntryServiceImpl#12cfd3a5' of type [org.openmrs.module.htmlformentry.impl.HtmlFormEntryServiceImpl] while setting bean property 'target'; nested exception is org.springframework.beans.factory.BeanCreationException: Error creating bean with name 'org.openmrs.module.htmlformentry.impl.HtmlFormEntryServiceImpl#12cfd3a5' defined in URL [jar:file:/C:/Users/lenovo/.m2/repository/org/openmrs/module/htmlformentry-api/3.11.0/htmlformentry-api-3.11.0.jar!/moduleApplicationContext.xml]: Cannot create inner bean 'org.openmrs.module.htmlformentry.handler.ConditionTagHandler#2e4bc941' of type [org.openmrs.module.htmlformentry.handler.ConditionTagHandler] while setting bean property 'handlers' with key [TypedStringValue: value [condition], target type [null]]; nested exception is org.springframework.beans.factory.BeanCreationException: Error creating bean with name 'org.openmrs.module.htmlformentry.handler.ConditionTagHandler#2e4bc941': Injection of autowired dependencies failed; nested exception is org.springframework.beans.factory.BeanCreationException: Could not autowire field: private org.openmrs.module.htmlformentry.handler.ConditionTagHandlerSupport org.openmrs.module.htmlformentry.handler.ConditionTagHandler.handler; nested exception is org.springframework.beans.factory.NoSuchBeanDefinitionException: No qualifying bean of type [org.openmrs.module.htmlformentry.handler.ConditionTagHandlerSupport] found for dependency: expected at least 1 bean which qualifies as autowire candidate for this dependency. Dependency annotations: {@org.springframework.beans.factory.annotation.Autowired(required=true)}
  174. at org.springframework.beans.factory.annotation.AutowiredAnnotationBeanPostProcessor.postProcessPropertyValues(AutowiredAnnotationBeanPostProcessor.java:334)
  175. at org.springframework.beans.factory.support.AbstractAutowireCapableBeanFactory.populateBean(AbstractAutowireCapableBeanFactory.java:1202)
  176. at org.springframework.beans.factory.support.AbstractAutowireCapableBeanFactory.doCreateBean(AbstractAutowireCapableBeanFactory.java:537)
  177. at org.springframework.beans.factory.support.AbstractAutowireCapableBeanFactory.createBean(AbstractAutowireCapableBeanFactory.java:476)
  178. at org.springframework.beans.factory.support.AbstractBeanFactory$1.getObject(AbstractBeanFactory.java:303)
  179. at org.springframework.beans.factory.support.DefaultSingletonBeanRegistry.getSingleton(DefaultSingletonBeanRegistry.java:230)
  180. at org.springframework.beans.factory.support.AbstractBeanFactory.doGetBean(AbstractBeanFactory.java:299)
  181. at org.springframework.beans.factory.support.AbstractBeanFactory.getBean(AbstractBeanFactory.java:194)
  182. at org.springframework.beans.factory.support.DefaultListableBeanFactory.preInstantiateSingletons(DefaultListableBeanFactory.java:762)
  183. at org.springframework.context.support.AbstractApplicationContext.finishBeanFactoryInitialization(AbstractApplicationContext.java:757)
  184. at org.springframework.context.support.AbstractApplicationContext.refresh(AbstractApplicationContext.java:480)
  185. at org.springframework.test.context.support.AbstractGenericContextLoader.loadContext(AbstractGenericContextLoader.java:125)
  186. at org.springframework.test.context.support.AbstractGenericContextLoader.loadContext(AbstractGenericContextLoader.java:60)
  187. at org.springframework.test.context.support.AbstractDelegatingSmartContextLoader.delegateLoading(AbstractDelegatingSmartContextLoader.java:109)
  188. at org.springframework.test.context.support.AbstractDelegatingSmartContextLoader.loadContext(AbstractDelegatingSmartContextLoader.java:261)
  189. at org.springframework.test.context.DefaultCacheAwareContextLoaderDelegate.loadContextInternal(DefaultCacheAwareContextLoaderDelegate.java:68)
  190. at org.springframework.test.context.DefaultCacheAwareContextLoaderDelegate.loadContext(DefaultCacheAwareContextLoaderDelegate.java:86)
  191. ... 32 more
  192. Caused by: org.springframework.beans.factory.BeanCreationException: Could not autowire field: org.openmrs.module.htmlformentry.HtmlFormEntryService org.openmrs.module.htmlformentryui.converter.StringToHtmlFormConverter.htmlFormEntryService; nested exception is org.springframework.beans.factory.NoSuchBeanDefinitionException: No qualifying bean of type [org.openmrs.module.htmlformentry.HtmlFormEntryService] found for dependency: expected at least 1 bean which qualifies as autowire candidate for this dependency. Dependency annotations: {@org.springframework.beans.factory.annotation.Autowired(required=true), @org.springframework.beans.factory.annotation.Qualifier(value=htmlFormEntryService)}
  193. at org.springframework.beans.factory.annotation.AutowiredAnnotationBeanPostProcessor$AutowiredFieldElement.inject(AutowiredAnnotationBeanPostProcessor.java:561)
  194. at org.springframework.beans.factory.annotation.InjectionMetadata.inject(InjectionMetadata.java:88)
  195. at org.springframework.beans.factory.annotation.AutowiredAnnotationBeanPostProcessor.postProcessPropertyValues(AutowiredAnnotationBeanPostProcessor.java:331)
  196. ... 48 more
  197. Caused by: org.springframework.beans.factory.NoSuchBeanDefinitionException: No qualifying bean of type [org.openmrs.module.htmlformentry.HtmlFormEntryService] found for dependency: expected at least 1 bean which qualifies as autowire candidate for this dependency. Dependency annotations: {@org.springframework.beans.factory.annotation.Autowired(required=true), @org.springframework.beans.factory.annotation.Qualifier(value=htmlFormEntryService)}
  198. at org.springframework.beans.factory.support.DefaultListableBeanFactory.raiseNoSuchBeanDefinitionException(DefaultListableBeanFactory.java:1308)
  199. at org.springframework.beans.factory.support.DefaultListableBeanFactory.doResolveDependency(DefaultListableBeanFactory.java:1054)
  200. at org.springframework.beans.factory.support.DefaultListableBeanFactory.resolveDependency(DefaultListableBeanFactory.java:949)
  201. at org.springframework.beans.factory.annotation.AutowiredAnnotationBeanPostProcessor$AutowiredFieldElement.inject(AutowiredAnnotationBeanPostProcessor.java:533)
  202. ... 50 more
  203.  
  204. isTransferredIn_ShouldReturnFalseWhenPatientIsNotTransferIn(org.openmrs.module.aijar.AijarServiceTest) Time elapsed: 0.036 sec <<< ERROR!
  205. java.lang.IllegalStateException: Failed to load ApplicationContext
  206. at org.springframework.test.context.DefaultCacheAwareContextLoaderDelegate.loadContext(DefaultCacheAwareContextLoaderDelegate.java:94)
  207. at org.springframework.test.context.DefaultTestContext.getApplicationContext(DefaultTestContext.java:72)
  208. at org.springframework.test.context.support.DependencyInjectionTestExecutionListener.injectDependencies(DependencyInjectionTestExecutionListener.java:117)
  209. at org.springframework.test.context.support.DependencyInjectionTestExecutionListener.prepareTestInstance(DependencyInjectionTestExecutionListener.java:83)
  210. at org.springframework.test.context.TestContextManager.prepareTestInstance(TestContextManager.java:212)
  211. at org.springframework.test.context.junit4.SpringJUnit4ClassRunner.createTest(SpringJUnit4ClassRunner.java:200)
  212. at org.springframework.test.context.junit4.SpringJUnit4ClassRunner$1.runReflectiveCall(SpringJUnit4ClassRunner.java:252)
  213. at org.junit.internal.runners.model.ReflectiveCallable.run(ReflectiveCallable.java:12)
  214. at org.springframework.test.context.junit4.SpringJUnit4ClassRunner.methodBlock(SpringJUnit4ClassRunner.java:254)
  215. at org.springframework.test.context.junit4.SpringJUnit4ClassRunner.runChild(SpringJUnit4ClassRunner.java:217)
  216. at org.springframework.test.context.junit4.SpringJUnit4ClassRunner.runChild(SpringJUnit4ClassRunner.java:83)
  217. at org.junit.runners.ParentRunner$3.run(ParentRunner.java:290)
  218. at org.junit.runners.ParentRunner$1.schedule(ParentRunner.java:71)
  219. at org.junit.runners.ParentRunner.runChildren(ParentRunner.java:288)
  220. at org.junit.runners.ParentRunner.access$000(ParentRunner.java:58)
  221. at org.junit.runners.ParentRunner$2.evaluate(ParentRunner.java:268)
  222. at org.springframework.test.context.junit4.statements.RunBeforeTestClassCallbacks.evaluate(RunBeforeTestClassCallbacks.java:61)
  223. at org.junit.internal.runners.statements.RunAfters.evaluate(RunAfters.java:27)
  224. at org.springframework.test.context.junit4.statements.RunAfterTestClassCallbacks.evaluate(RunAfterTestClassCallbacks.java:68)
  225. at org.junit.runners.ParentRunner.run(ParentRunner.java:363)
  226. at org.springframework.test.context.junit4.SpringJUnit4ClassRunner.run(SpringJUnit4ClassRunner.java:163)
  227. at org.apache.maven.surefire.junit4.JUnit4Provider.execute(JUnit4Provider.java:252)
  228. at org.apache.maven.surefire.junit4.JUnit4Provider.executeTestSet(JUnit4Provider.java:141)
  229. at org.apache.maven.surefire.junit4.JUnit4Provider.invoke(JUnit4Provider.java:112)
  230. at sun.reflect.NativeMethodAccessorImpl.invoke0(Native Method)
  231. at sun.reflect.NativeMethodAccessorImpl.invoke(NativeMethodAccessorImpl.java:62)
  232. at sun.reflect.DelegatingMethodAccessorImpl.invoke(DelegatingMethodAccessorImpl.java:43)
  233. at java.lang.reflect.Method.invoke(Method.java:498)
  234. at org.apache.maven.surefire.util.ReflectionUtils.invokeMethodWithArray(ReflectionUtils.java:189)
  235. at org.apache.maven.surefire.booter.ProviderFactory$ProviderProxy.invoke(ProviderFactory.java:165)
  236. at org.apache.maven.surefire.booter.ProviderFactory.invokeProvider(ProviderFactory.java:85)
  237. at org.apache.maven.surefire.booter.ForkedBooter.runSuitesInProcess(ForkedBooter.java:115)
  238. at org.apache.maven.surefire.booter.ForkedBooter.main(ForkedBooter.java:75)
  239. Caused by: org.springframework.beans.factory.BeanCreationException: Error creating bean with name 'stringToHtmlFormConverter': Injection of autowired dependencies failed; nested exception is org.springframework.beans.factory.BeanCreationException: Could not autowire field: org.openmrs.module.htmlformentry.HtmlFormEntryService org.openmrs.module.htmlformentryui.converter.StringToHtmlFormConverter.htmlFormEntryService; nested exception is org.springframework.beans.factory.NoSuchBeanDefinitionException: No qualifying bean of type [org.openmrs.module.htmlformentry.HtmlFormEntryService] found for dependency: expected at least 1 bean which qualifies as autowire candidate for this dependency. Dependency annotations: {@org.springframework.beans.factory.annotation.Autowired(required=true), @org.springframework.beans.factory.annotation.Qualifier(value=htmlFormEntryService)}
  240. Related cause: org.springframework.beans.factory.BeanCreationException: Error creating bean with name 'htmlFormEntryService' defined in URL [jar:file:/C:/Users/lenovo/.m2/repository/org/openmrs/module/htmlformentry-api/3.11.0/htmlformentry-api-3.11.0.jar!/moduleApplicationContext.xml]: Cannot create inner bean 'org.openmrs.module.htmlformentry.impl.HtmlFormEntryServiceImpl#66216e1' of type [org.openmrs.module.htmlformentry.impl.HtmlFormEntryServiceImpl] while setting bean property 'target'; nested exception is org.springframework.beans.factory.BeanCreationException: Error creating bean with name 'org.openmrs.module.htmlformentry.impl.HtmlFormEntryServiceImpl#66216e1' defined in URL [jar:file:/C:/Users/lenovo/.m2/repository/org/openmrs/module/htmlformentry-api/3.11.0/htmlformentry-api-3.11.0.jar!/moduleApplicationContext.xml]: Cannot create inner bean 'org.openmrs.module.htmlformentry.handler.ConditionTagHandler#1b27f497' of type [org.openmrs.module.htmlformentry.handler.ConditionTagHandler] while setting bean property 'handlers' with key [TypedStringValue: value [condition], target type [null]]; nested exception is org.springframework.beans.factory.BeanCreationException: Error creating bean with name 'org.openmrs.module.htmlformentry.handler.ConditionTagHandler#1b27f497': Injection of autowired dependencies failed; nested exception is org.springframework.beans.factory.BeanCreationException: Could not autowire field: private org.openmrs.module.htmlformentry.handler.ConditionTagHandlerSupport org.openmrs.module.htmlformentry.handler.ConditionTagHandler.handler; nested exception is org.springframework.beans.factory.NoSuchBeanDefinitionException: No qualifying bean of type [org.openmrs.module.htmlformentry.handler.ConditionTagHandlerSupport] found for dependency: expected at least 1 bean which qualifies as autowire candidate for this dependency. Dependency annotations: {@org.springframework.beans.factory.annotation.Autowired(required=true)}
  241. at org.springframework.beans.factory.annotation.AutowiredAnnotationBeanPostProcessor.postProcessPropertyValues(AutowiredAnnotationBeanPostProcessor.java:334)
  242. at org.springframework.beans.factory.support.AbstractAutowireCapableBeanFactory.populateBean(AbstractAutowireCapableBeanFactory.java:1202)
  243. at org.springframework.beans.factory.support.AbstractAutowireCapableBeanFactory.doCreateBean(AbstractAutowireCapableBeanFactory.java:537)
  244. at org.springframework.beans.factory.support.AbstractAutowireCapableBeanFactory.createBean(AbstractAutowireCapableBeanFactory.java:476)
  245. at org.springframework.beans.factory.support.AbstractBeanFactory$1.getObject(AbstractBeanFactory.java:303)
  246. at org.springframework.beans.factory.support.DefaultSingletonBeanRegistry.getSingleton(DefaultSingletonBeanRegistry.java:230)
  247. at org.springframework.beans.factory.support.AbstractBeanFactory.doGetBean(AbstractBeanFactory.java:299)
  248. at org.springframework.beans.factory.support.AbstractBeanFactory.getBean(AbstractBeanFactory.java:194)
  249. at org.springframework.beans.factory.support.DefaultListableBeanFactory.preInstantiateSingletons(DefaultListableBeanFactory.java:762)
  250. at org.springframework.context.support.AbstractApplicationContext.finishBeanFactoryInitialization(AbstractApplicationContext.java:757)
  251. at org.springframework.context.support.AbstractApplicationContext.refresh(AbstractApplicationContext.java:480)
  252. at org.springframework.test.context.support.AbstractGenericContextLoader.loadContext(AbstractGenericContextLoader.java:125)
  253. at org.springframework.test.context.support.AbstractGenericContextLoader.loadContext(AbstractGenericContextLoader.java:60)
  254. at org.springframework.test.context.support.AbstractDelegatingSmartContextLoader.delegateLoading(AbstractDelegatingSmartContextLoader.java:109)
  255. at org.springframework.test.context.support.AbstractDelegatingSmartContextLoader.loadContext(AbstractDelegatingSmartContextLoader.java:261)
  256. at org.springframework.test.context.DefaultCacheAwareContextLoaderDelegate.loadContextInternal(DefaultCacheAwareContextLoaderDelegate.java:68)
  257. at org.springframework.test.context.DefaultCacheAwareContextLoaderDelegate.loadContext(DefaultCacheAwareContextLoaderDelegate.java:86)
  258. ... 32 more
  259. Caused by: org.springframework.beans.factory.BeanCreationException: Could not autowire field: org.openmrs.module.htmlformentry.HtmlFormEntryService org.openmrs.module.htmlformentryui.converter.StringToHtmlFormConverter.htmlFormEntryService; nested exception is org.springframework.beans.factory.NoSuchBeanDefinitionException: No qualifying bean of type [org.openmrs.module.htmlformentry.HtmlFormEntryService] found for dependency: expected at least 1 bean which qualifies as autowire candidate for this dependency. Dependency annotations: {@org.springframework.beans.factory.annotation.Autowired(required=true), @org.springframework.beans.factory.annotation.Qualifier(value=htmlFormEntryService)}
  260. at org.springframework.beans.factory.annotation.AutowiredAnnotationBeanPostProcessor$AutowiredFieldElement.inject(AutowiredAnnotationBeanPostProcessor.java:561)
  261. at org.springframework.beans.factory.annotation.InjectionMetadata.inject(InjectionMetadata.java:88)
  262. at org.springframework.beans.factory.annotation.AutowiredAnnotationBeanPostProcessor.postProcessPropertyValues(AutowiredAnnotationBeanPostProcessor.java:331)
  263. ... 48 more
  264. Caused by: org.springframework.beans.factory.NoSuchBeanDefinitionException: No qualifying bean of type [org.openmrs.module.htmlformentry.HtmlFormEntryService] found for dependency: expected at least 1 bean which qualifies as autowire candidate for this dependency. Dependency annotations: {@org.springframework.beans.factory.annotation.Autowired(required=true), @org.springframework.beans.factory.annotation.Qualifier(value=htmlFormEntryService)}
  265. at org.springframework.beans.factory.support.DefaultListableBeanFactory.raiseNoSuchBeanDefinitionException(DefaultListableBeanFactory.java:1308)
  266. at org.springframework.beans.factory.support.DefaultListableBeanFactory.doResolveDependency(DefaultListableBeanFactory.java:1054)
  267. at org.springframework.beans.factory.support.DefaultListableBeanFactory.resolveDependency(DefaultListableBeanFactory.java:949)
  268. at org.springframework.beans.factory.annotation.AutowiredAnnotationBeanPostProcessor$AutowiredFieldElement.inject(AutowiredAnnotationBeanPostProcessor.java:533)
  269. ... 50 more
  270.  
  271. stopActiveOutPatientVisits_shouldCompleteAllVisitOfSetTypeInGlobalProperty(org.openmrs.module.aijar.AijarServiceTest) Time elapsed: 0.001 sec <<< ERROR!
  272. java.lang.IllegalStateException: Failed to load ApplicationContext
  273. at org.springframework.test.context.DefaultCacheAwareContextLoaderDelegate.loadContext(DefaultCacheAwareContextLoaderDelegate.java:94)
  274. at org.springframework.test.context.DefaultTestContext.getApplicationContext(DefaultTestContext.java:72)
  275. at org.springframework.test.context.support.DependencyInjectionTestExecutionListener.injectDependencies(DependencyInjectionTestExecutionListener.java:117)
  276. at org.springframework.test.context.support.DependencyInjectionTestExecutionListener.prepareTestInstance(DependencyInjectionTestExecutionListener.java:83)
  277. at org.springframework.test.context.TestContextManager.prepareTestInstance(TestContextManager.java:212)
  278. at org.springframework.test.context.junit4.SpringJUnit4ClassRunner.createTest(SpringJUnit4ClassRunner.java:200)
  279. at org.springframework.test.context.junit4.SpringJUnit4ClassRunner$1.runReflectiveCall(SpringJUnit4ClassRunner.java:252)
  280. at org.junit.internal.runners.model.ReflectiveCallable.run(ReflectiveCallable.java:12)
  281. at org.springframework.test.context.junit4.SpringJUnit4ClassRunner.methodBlock(SpringJUnit4ClassRunner.java:254)
  282. at org.springframework.test.context.junit4.SpringJUnit4ClassRunner.runChild(SpringJUnit4ClassRunner.java:217)
  283. at org.springframework.test.context.junit4.SpringJUnit4ClassRunner.runChild(SpringJUnit4ClassRunner.java:83)
  284. at org.junit.runners.ParentRunner$3.run(ParentRunner.java:290)
  285. at org.junit.runners.ParentRunner$1.schedule(ParentRunner.java:71)
  286. at org.junit.runners.ParentRunner.runChildren(ParentRunner.java:288)
  287. at org.junit.runners.ParentRunner.access$000(ParentRunner.java:58)
  288. at org.junit.runners.ParentRunner$2.evaluate(ParentRunner.java:268)
  289. at org.springframework.test.context.junit4.statements.RunBeforeTestClassCallbacks.evaluate(RunBeforeTestClassCallbacks.java:61)
  290. at org.junit.internal.runners.statements.RunAfters.evaluate(RunAfters.java:27)
  291. at org.springframework.test.context.junit4.statements.RunAfterTestClassCallbacks.evaluate(RunAfterTestClassCallbacks.java:68)
  292. at org.junit.runners.ParentRunner.run(ParentRunner.java:363)
  293. at org.springframework.test.context.junit4.SpringJUnit4ClassRunner.run(SpringJUnit4ClassRunner.java:163)
  294. at org.apache.maven.surefire.junit4.JUnit4Provider.execute(JUnit4Provider.java:252)
  295. at org.apache.maven.surefire.junit4.JUnit4Provider.executeTestSet(JUnit4Provider.java:141)
  296. at org.apache.maven.surefire.junit4.JUnit4Provider.invoke(JUnit4Provider.java:112)
  297. at sun.reflect.NativeMethodAccessorImpl.invoke0(Native Method)
  298. at sun.reflect.NativeMethodAccessorImpl.invoke(NativeMethodAccessorImpl.java:62)
  299. at sun.reflect.DelegatingMethodAccessorImpl.invoke(DelegatingMethodAccessorImpl.java:43)
  300. at java.lang.reflect.Method.invoke(Method.java:498)
  301. at org.apache.maven.surefire.util.ReflectionUtils.invokeMethodWithArray(ReflectionUtils.java:189)
  302. at org.apache.maven.surefire.booter.ProviderFactory$ProviderProxy.invoke(ProviderFactory.java:165)
  303. at org.apache.maven.surefire.booter.ProviderFactory.invokeProvider(ProviderFactory.java:85)
  304. at org.apache.maven.surefire.booter.ForkedBooter.runSuitesInProcess(ForkedBooter.java:115)
  305. at org.apache.maven.surefire.booter.ForkedBooter.main(ForkedBooter.java:75)
  306. Caused by: org.springframework.beans.factory.BeanCreationException: Error creating bean with name 'stringToHtmlFormConverter': Injection of autowired dependencies failed; nested exception is org.springframework.beans.factory.BeanCreationException: Could not autowire field: org.openmrs.module.htmlformentry.HtmlFormEntryService org.openmrs.module.htmlformentryui.converter.StringToHtmlFormConverter.htmlFormEntryService; nested exception is org.springframework.beans.factory.NoSuchBeanDefinitionException: No qualifying bean of type [org.openmrs.module.htmlformentry.HtmlFormEntryService] found for dependency: expected at least 1 bean which qualifies as autowire candidate for this dependency. Dependency annotations: {@org.springframework.beans.factory.annotation.Autowired(required=true), @org.springframework.beans.factory.annotation.Qualifier(value=htmlFormEntryService)}
  307. Related cause: org.springframework.beans.factory.BeanCreationException: Error creating bean with name 'htmlFormEntryService' defined in URL [jar:file:/C:/Users/lenovo/.m2/repository/org/openmrs/module/htmlformentry-api/3.11.0/htmlformentry-api-3.11.0.jar!/moduleApplicationContext.xml]: Cannot create inner bean 'org.openmrs.module.htmlformentry.impl.HtmlFormEntryServiceImpl#2d864c49' of type [org.openmrs.module.htmlformentry.impl.HtmlFormEntryServiceImpl] while setting bean property 'target'; nested exception is org.springframework.beans.factory.BeanCreationException: Error creating bean with name 'org.openmrs.module.htmlformentry.impl.HtmlFormEntryServiceImpl#2d864c49' defined in URL [jar:file:/C:/Users/lenovo/.m2/repository/org/openmrs/module/htmlformentry-api/3.11.0/htmlformentry-api-3.11.0.jar!/moduleApplicationContext.xml]: Cannot create inner bean 'org.openmrs.module.htmlformentry.handler.ConditionTagHandler#2ef07569' of type [org.openmrs.module.htmlformentry.handler.ConditionTagHandler] while setting bean property 'handlers' with key [TypedStringValue: value [condition], target type [null]]; nested exception is org.springframework.beans.factory.BeanCreationException: Error creating bean with name 'org.openmrs.module.htmlformentry.handler.ConditionTagHandler#2ef07569': Injection of autowired dependencies failed; nested exception is org.springframework.beans.factory.BeanCreationException: Could not autowire field: private org.openmrs.module.htmlformentry.handler.ConditionTagHandlerSupport org.openmrs.module.htmlformentry.handler.ConditionTagHandler.handler; nested exception is org.springframework.beans.factory.NoSuchBeanDefinitionException: No qualifying bean of type [org.openmrs.module.htmlformentry.handler.ConditionTagHandlerSupport] found for dependency: expected at least 1 bean which qualifies as autowire candidate for this dependency. Dependency annotations: {@org.springframework.beans.factory.annotation.Autowired(required=true)}
  308. at org.springframework.beans.factory.annotation.AutowiredAnnotationBeanPostProcessor.postProcessPropertyValues(AutowiredAnnotationBeanPostProcessor.java:334)
  309. at org.springframework.beans.factory.support.AbstractAutowireCapableBeanFactory.populateBean(AbstractAutowireCapableBeanFactory.java:1202)
  310. at org.springframework.beans.factory.support.AbstractAutowireCapableBeanFactory.doCreateBean(AbstractAutowireCapableBeanFactory.java:537)
  311. at org.springframework.beans.factory.support.AbstractAutowireCapableBeanFactory.createBean(AbstractAutowireCapableBeanFactory.java:476)
  312. at org.springframework.beans.factory.support.AbstractBeanFactory$1.getObject(AbstractBeanFactory.java:303)
  313. at org.springframework.beans.factory.support.DefaultSingletonBeanRegistry.getSingleton(DefaultSingletonBeanRegistry.java:230)
  314. at org.springframework.beans.factory.support.AbstractBeanFactory.doGetBean(AbstractBeanFactory.java:299)
  315. at org.springframework.beans.factory.support.AbstractBeanFactory.getBean(AbstractBeanFactory.java:194)
  316. at org.springframework.beans.factory.support.DefaultListableBeanFactory.preInstantiateSingletons(DefaultListableBeanFactory.java:762)
  317. at org.springframework.context.support.AbstractApplicationContext.finishBeanFactoryInitialization(AbstractApplicationContext.java:757)
  318. at org.springframework.context.support.AbstractApplicationContext.refresh(AbstractApplicationContext.java:480)
  319. at org.springframework.test.context.support.AbstractGenericContextLoader.loadContext(AbstractGenericContextLoader.java:125)
  320. at org.springframework.test.context.support.AbstractGenericContextLoader.loadContext(AbstractGenericContextLoader.java:60)
  321. at org.springframework.test.context.support.AbstractDelegatingSmartContextLoader.delegateLoading(AbstractDelegatingSmartContextLoader.java:109)
  322. at org.springframework.test.context.support.AbstractDelegatingSmartContextLoader.loadContext(AbstractDelegatingSmartContextLoader.java:261)
  323. at org.springframework.test.context.DefaultCacheAwareContextLoaderDelegate.loadContextInternal(DefaultCacheAwareContextLoaderDelegate.java:68)
  324. at org.springframework.test.context.DefaultCacheAwareContextLoaderDelegate.loadContext(DefaultCacheAwareContextLoaderDelegate.java:86)
  325. ... 32 more
  326. Caused by: org.springframework.beans.factory.BeanCreationException: Could not autowire field: org.openmrs.module.htmlformentry.HtmlFormEntryService org.openmrs.module.htmlformentryui.converter.StringToHtmlFormConverter.htmlFormEntryService; nested exception is org.springframework.beans.factory.NoSuchBeanDefinitionException: No qualifying bean of type [org.openmrs.module.htmlformentry.HtmlFormEntryService] found for dependency: expected at least 1 bean which qualifies as autowire candidate for this dependency. Dependency annotations: {@org.springframework.beans.factory.annotation.Autowired(required=true), @org.springframework.beans.factory.annotation.Qualifier(value=htmlFormEntryService)}
  327. at org.springframework.beans.factory.annotation.AutowiredAnnotationBeanPostProcessor$AutowiredFieldElement.inject(AutowiredAnnotationBeanPostProcessor.java:561)
  328. at org.springframework.beans.factory.annotation.InjectionMetadata.inject(InjectionMetadata.java:88)
  329. at org.springframework.beans.factory.annotation.AutowiredAnnotationBeanPostProcessor.postProcessPropertyValues(AutowiredAnnotationBeanPostProcessor.java:331)
  330. ... 48 more
  331. Caused by: org.springframework.beans.factory.NoSuchBeanDefinitionException: No qualifying bean of type [org.openmrs.module.htmlformentry.HtmlFormEntryService] found for dependency: expected at least 1 bean which qualifies as autowire candidate for this dependency. Dependency annotations: {@org.springframework.beans.factory.annotation.Autowired(required=true), @org.springframework.beans.factory.annotation.Qualifier(value=htmlFormEntryService)}
  332. at org.springframework.beans.factory.support.DefaultListableBeanFactory.raiseNoSuchBeanDefinitionException(DefaultListableBeanFactory.java:1308)
  333. at org.springframework.beans.factory.support.DefaultListableBeanFactory.doResolveDependency(DefaultListableBeanFactory.java:1054)
  334. at org.springframework.beans.factory.support.DefaultListableBeanFactory.resolveDependency(DefaultListableBeanFactory.java:949)
  335. at org.springframework.beans.factory.annotation.AutowiredAnnotationBeanPostProcessor$AutowiredFieldElement.inject(AutowiredAnnotationBeanPostProcessor.java:533)
  336. ... 50 more
  337.  
  338. Running org.openmrs.module.aijar.dataintegrity.IncompleteExposedInfantInformationTest
  339. Tests run: 4, Failures: 0, Errors: 4, Skipped: 0, Time elapsed: 19.798 sec <<< FAILURE!
  340. testExposedInfantsOlderThan18MonthsWithNoFinalOutcome(org.openmrs.module.aijar.dataintegrity.IncompleteExposedInfantInformationTest) Time elapsed: 0 sec <<< ERROR!
  341. java.lang.IllegalStateException: Failed to load ApplicationContext
  342. at org.springframework.test.context.DefaultCacheAwareContextLoaderDelegate.loadContext(DefaultCacheAwareContextLoaderDelegate.java:94)
  343. at org.springframework.test.context.DefaultTestContext.getApplicationContext(DefaultTestContext.java:72)
  344. at org.springframework.test.context.support.DependencyInjectionTestExecutionListener.injectDependencies(DependencyInjectionTestExecutionListener.java:117)
  345. at org.springframework.test.context.support.DependencyInjectionTestExecutionListener.prepareTestInstance(DependencyInjectionTestExecutionListener.java:83)
  346. at org.springframework.test.context.TestContextManager.prepareTestInstance(TestContextManager.java:212)
  347. at org.springframework.test.context.junit4.SpringJUnit4ClassRunner.createTest(SpringJUnit4ClassRunner.java:200)
  348. at org.springframework.test.context.junit4.SpringJUnit4ClassRunner$1.runReflectiveCall(SpringJUnit4ClassRunner.java:252)
  349. at org.junit.internal.runners.model.ReflectiveCallable.run(ReflectiveCallable.java:12)
  350. at org.springframework.test.context.junit4.SpringJUnit4ClassRunner.methodBlock(SpringJUnit4ClassRunner.java:254)
  351. at org.springframework.test.context.junit4.SpringJUnit4ClassRunner.runChild(SpringJUnit4ClassRunner.java:217)
  352. at org.springframework.test.context.junit4.SpringJUnit4ClassRunner.runChild(SpringJUnit4ClassRunner.java:83)
  353. at org.junit.runners.ParentRunner$3.run(ParentRunner.java:290)
  354. at org.junit.runners.ParentRunner$1.schedule(ParentRunner.java:71)
  355. at org.junit.runners.ParentRunner.runChildren(ParentRunner.java:288)
  356. at org.junit.runners.ParentRunner.access$000(ParentRunner.java:58)
  357. at org.junit.runners.ParentRunner$2.evaluate(ParentRunner.java:268)
  358. at org.springframework.test.context.junit4.statements.RunBeforeTestClassCallbacks.evaluate(RunBeforeTestClassCallbacks.java:61)
  359. at org.junit.internal.runners.statements.RunAfters.evaluate(RunAfters.java:27)
  360. at org.springframework.test.context.junit4.statements.RunAfterTestClassCallbacks.evaluate(RunAfterTestClassCallbacks.java:68)
  361. at org.junit.runners.ParentRunner.run(ParentRunner.java:363)
  362. at org.springframework.test.context.junit4.SpringJUnit4ClassRunner.run(SpringJUnit4ClassRunner.java:163)
  363. at org.apache.maven.surefire.junit4.JUnit4Provider.execute(JUnit4Provider.java:252)
  364. at org.apache.maven.surefire.junit4.JUnit4Provider.executeTestSet(JUnit4Provider.java:141)
  365. at org.apache.maven.surefire.junit4.JUnit4Provider.invoke(JUnit4Provider.java:112)
  366. at sun.reflect.NativeMethodAccessorImpl.invoke0(Native Method)
  367. at sun.reflect.NativeMethodAccessorImpl.invoke(NativeMethodAccessorImpl.java:62)
  368. at sun.reflect.DelegatingMethodAccessorImpl.invoke(DelegatingMethodAccessorImpl.java:43)
  369. at java.lang.reflect.Method.invoke(Method.java:498)
  370. at org.apache.maven.surefire.util.ReflectionUtils.invokeMethodWithArray(ReflectionUtils.java:189)
  371. at org.apache.maven.surefire.booter.ProviderFactory$ProviderProxy.invoke(ProviderFactory.java:165)
  372. at org.apache.maven.surefire.booter.ProviderFactory.invokeProvider(ProviderFactory.java:85)
  373. at org.apache.maven.surefire.booter.ForkedBooter.runSuitesInProcess(ForkedBooter.java:115)
  374. at org.apache.maven.surefire.booter.ForkedBooter.main(ForkedBooter.java:75)
  375. Caused by: org.springframework.beans.factory.BeanCreationException: Error creating bean with name 'stringToHtmlFormConverter': Injection of autowired dependencies failed; nested exception is org.springframework.beans.factory.BeanCreationException: Could not autowire field: org.openmrs.module.htmlformentry.HtmlFormEntryService org.openmrs.module.htmlformentryui.converter.StringToHtmlFormConverter.htmlFormEntryService; nested exception is org.springframework.beans.factory.NoSuchBeanDefinitionException: No qualifying bean of type [org.openmrs.module.htmlformentry.HtmlFormEntryService] found for dependency: expected at least 1 bean which qualifies as autowire candidate for this dependency. Dependency annotations: {@org.springframework.beans.factory.annotation.Autowired(required=true), @org.springframework.beans.factory.annotation.Qualifier(value=htmlFormEntryService)}
  376. Related cause: org.springframework.beans.factory.BeanCreationException: Error creating bean with name 'htmlFormEntryService' defined in URL [jar:file:/C:/Users/lenovo/.m2/repository/org/openmrs/module/htmlformentry-api/3.11.0/htmlformentry-api-3.11.0.jar!/moduleApplicationContext.xml]: Cannot create inner bean 'org.openmrs.module.htmlformentry.impl.HtmlFormEntryServiceImpl#691d92eb' of type [org.openmrs.module.htmlformentry.impl.HtmlFormEntryServiceImpl] while setting bean property 'target'; nested exception is org.springframework.beans.factory.BeanCreationException: Error creating bean with name 'org.openmrs.module.htmlformentry.impl.HtmlFormEntryServiceImpl#691d92eb' defined in URL [jar:file:/C:/Users/lenovo/.m2/repository/org/openmrs/module/htmlformentry-api/3.11.0/htmlformentry-api-3.11.0.jar!/moduleApplicationContext.xml]: Cannot create inner bean 'org.openmrs.module.htmlformentry.handler.ConditionTagHandler#3fe4a8f8' of type [org.openmrs.module.htmlformentry.handler.ConditionTagHandler] while setting bean property 'handlers' with key [TypedStringValue: value [condition], target type [null]]; nested exception is org.springframework.beans.factory.BeanCreationException: Error creating bean with name 'org.openmrs.module.htmlformentry.handler.ConditionTagHandler#3fe4a8f8': Injection of autowired dependencies failed; nested exception is org.springframework.beans.factory.BeanCreationException: Could not autowire field: private org.openmrs.module.htmlformentry.handler.ConditionTagHandlerSupport org.openmrs.module.htmlformentry.handler.ConditionTagHandler.handler; nested exception is org.springframework.beans.factory.NoSuchBeanDefinitionException: No qualifying bean of type [org.openmrs.module.htmlformentry.handler.ConditionTagHandlerSupport] found for dependency: expected at least 1 bean which qualifies as autowire candidate for this dependency. Dependency annotations: {@org.springframework.beans.factory.annotation.Autowired(required=true)}
  377. at org.springframework.beans.factory.annotation.AutowiredAnnotationBeanPostProcessor.postProcessPropertyValues(AutowiredAnnotationBeanPostProcessor.java:334)
  378. at org.springframework.beans.factory.support.AbstractAutowireCapableBeanFactory.populateBean(AbstractAutowireCapableBeanFactory.java:1202)
  379. at org.springframework.beans.factory.support.AbstractAutowireCapableBeanFactory.doCreateBean(AbstractAutowireCapableBeanFactory.java:537)
  380. at org.springframework.beans.factory.support.AbstractAutowireCapableBeanFactory.createBean(AbstractAutowireCapableBeanFactory.java:476)
  381. at org.springframework.beans.factory.support.AbstractBeanFactory$1.getObject(AbstractBeanFactory.java:303)
  382. at org.springframework.beans.factory.support.DefaultSingletonBeanRegistry.getSingleton(DefaultSingletonBeanRegistry.java:230)
  383. at org.springframework.beans.factory.support.AbstractBeanFactory.doGetBean(AbstractBeanFactory.java:299)
  384. at org.springframework.beans.factory.support.AbstractBeanFactory.getBean(AbstractBeanFactory.java:194)
  385. at org.springframework.beans.factory.support.DefaultListableBeanFactory.preInstantiateSingletons(DefaultListableBeanFactory.java:762)
  386. at org.springframework.context.support.AbstractApplicationContext.finishBeanFactoryInitialization(AbstractApplicationContext.java:757)
  387. at org.springframework.context.support.AbstractApplicationContext.refresh(AbstractApplicationContext.java:480)
  388. at org.springframework.test.context.support.AbstractGenericContextLoader.loadContext(AbstractGenericContextLoader.java:125)
  389. at org.springframework.test.context.support.AbstractGenericContextLoader.loadContext(AbstractGenericContextLoader.java:60)
  390. at org.springframework.test.context.support.AbstractDelegatingSmartContextLoader.delegateLoading(AbstractDelegatingSmartContextLoader.java:109)
  391. at org.springframework.test.context.support.AbstractDelegatingSmartContextLoader.loadContext(AbstractDelegatingSmartContextLoader.java:261)
  392. at org.springframework.test.context.DefaultCacheAwareContextLoaderDelegate.loadContextInternal(DefaultCacheAwareContextLoaderDelegate.java:68)
  393. at org.springframework.test.context.DefaultCacheAwareContextLoaderDelegate.loadContext(DefaultCacheAwareContextLoaderDelegate.java:86)
  394. ... 32 more
  395. Caused by: org.springframework.beans.factory.BeanCreationException: Could not autowire field: org.openmrs.module.htmlformentry.HtmlFormEntryService org.openmrs.module.htmlformentryui.converter.StringToHtmlFormConverter.htmlFormEntryService; nested exception is org.springframework.beans.factory.NoSuchBeanDefinitionException: No qualifying bean of type [org.openmrs.module.htmlformentry.HtmlFormEntryService] found for dependency: expected at least 1 bean which qualifies as autowire candidate for this dependency. Dependency annotations: {@org.springframework.beans.factory.annotation.Autowired(required=true), @org.springframework.beans.factory.annotation.Qualifier(value=htmlFormEntryService)}
  396. at org.springframework.beans.factory.annotation.AutowiredAnnotationBeanPostProcessor$AutowiredFieldElement.inject(AutowiredAnnotationBeanPostProcessor.java:561)
  397. at org.springframework.beans.factory.annotation.InjectionMetadata.inject(InjectionMetadata.java:88)
  398. at org.springframework.beans.factory.annotation.AutowiredAnnotationBeanPostProcessor.postProcessPropertyValues(AutowiredAnnotationBeanPostProcessor.java:331)
  399. ... 48 more
  400. Caused by: org.springframework.beans.factory.NoSuchBeanDefinitionException: No qualifying bean of type [org.openmrs.module.htmlformentry.HtmlFormEntryService] found for dependency: expected at least 1 bean which qualifies as autowire candidate for this dependency. Dependency annotations: {@org.springframework.beans.factory.annotation.Autowired(required=true), @org.springframework.beans.factory.annotation.Qualifier(value=htmlFormEntryService)}
  401. at org.springframework.beans.factory.support.DefaultListableBeanFactory.raiseNoSuchBeanDefinitionException(DefaultListableBeanFactory.java:1308)
  402. at org.springframework.beans.factory.support.DefaultListableBeanFactory.doResolveDependency(DefaultListableBeanFactory.java:1054)
  403. at org.springframework.beans.factory.support.DefaultListableBeanFactory.resolveDependency(DefaultListableBeanFactory.java:949)
  404. at org.springframework.beans.factory.annotation.AutowiredAnnotationBeanPostProcessor$AutowiredFieldElement.inject(AutowiredAnnotationBeanPostProcessor.java:533)
  405. ... 50 more
  406.  
  407. testExposedInfantsWithNoMotherARTNumber(org.openmrs.module.aijar.dataintegrity.IncompleteExposedInfantInformationTest) Time elapsed: 0 sec <<< ERROR!
  408. java.lang.IllegalStateException: Failed to load ApplicationContext
  409. at org.springframework.test.context.DefaultCacheAwareContextLoaderDelegate.loadContext(DefaultCacheAwareContextLoaderDelegate.java:94)
  410. at org.springframework.test.context.DefaultTestContext.getApplicationContext(DefaultTestContext.java:72)
  411. at org.springframework.test.context.support.DependencyInjectionTestExecutionListener.injectDependencies(DependencyInjectionTestExecutionListener.java:117)
  412. at org.springframework.test.context.support.DependencyInjectionTestExecutionListener.prepareTestInstance(DependencyInjectionTestExecutionListener.java:83)
  413. at org.springframework.test.context.TestContextManager.prepareTestInstance(TestContextManager.java:212)
  414. at org.springframework.test.context.junit4.SpringJUnit4ClassRunner.createTest(SpringJUnit4ClassRunner.java:200)
  415. at org.springframework.test.context.junit4.SpringJUnit4ClassRunner$1.runReflectiveCall(SpringJUnit4ClassRunner.java:252)
  416. at org.junit.internal.runners.model.ReflectiveCallable.run(ReflectiveCallable.java:12)
  417. at org.springframework.test.context.junit4.SpringJUnit4ClassRunner.methodBlock(SpringJUnit4ClassRunner.java:254)
  418. at org.springframework.test.context.junit4.SpringJUnit4ClassRunner.runChild(SpringJUnit4ClassRunner.java:217)
  419. at org.springframework.test.context.junit4.SpringJUnit4ClassRunner.runChild(SpringJUnit4ClassRunner.java:83)
  420. at org.junit.runners.ParentRunner$3.run(ParentRunner.java:290)
  421. at org.junit.runners.ParentRunner$1.schedule(ParentRunner.java:71)
  422. at org.junit.runners.ParentRunner.runChildren(ParentRunner.java:288)
  423. at org.junit.runners.ParentRunner.access$000(ParentRunner.java:58)
  424. at org.junit.runners.ParentRunner$2.evaluate(ParentRunner.java:268)
  425. at org.springframework.test.context.junit4.statements.RunBeforeTestClassCallbacks.evaluate(RunBeforeTestClassCallbacks.java:61)
  426. at org.junit.internal.runners.statements.RunAfters.evaluate(RunAfters.java:27)
  427. at org.springframework.test.context.junit4.statements.RunAfterTestClassCallbacks.evaluate(RunAfterTestClassCallbacks.java:68)
  428. at org.junit.runners.ParentRunner.run(ParentRunner.java:363)
  429. at org.springframework.test.context.junit4.SpringJUnit4ClassRunner.run(SpringJUnit4ClassRunner.java:163)
  430. at org.apache.maven.surefire.junit4.JUnit4Provider.execute(JUnit4Provider.java:252)
  431. at org.apache.maven.surefire.junit4.JUnit4Provider.executeTestSet(JUnit4Provider.java:141)
  432. at org.apache.maven.surefire.junit4.JUnit4Provider.invoke(JUnit4Provider.java:112)
  433. at sun.reflect.NativeMethodAccessorImpl.invoke0(Native Method)
  434. at sun.reflect.NativeMethodAccessorImpl.invoke(NativeMethodAccessorImpl.java:62)
  435. at sun.reflect.DelegatingMethodAccessorImpl.invoke(DelegatingMethodAccessorImpl.java:43)
  436. at java.lang.reflect.Method.invoke(Method.java:498)
  437. at org.apache.maven.surefire.util.ReflectionUtils.invokeMethodWithArray(ReflectionUtils.java:189)
  438. at org.apache.maven.surefire.booter.ProviderFactory$ProviderProxy.invoke(ProviderFactory.java:165)
  439. at org.apache.maven.surefire.booter.ProviderFactory.invokeProvider(ProviderFactory.java:85)
  440. at org.apache.maven.surefire.booter.ForkedBooter.runSuitesInProcess(ForkedBooter.java:115)
  441. at org.apache.maven.surefire.booter.ForkedBooter.main(ForkedBooter.java:75)
  442. Caused by: org.springframework.beans.factory.BeanCreationException: Error creating bean with name 'stringToHtmlFormConverter': Injection of autowired dependencies failed; nested exception is org.springframework.beans.factory.BeanCreationException: Could not autowire field: org.openmrs.module.htmlformentry.HtmlFormEntryService org.openmrs.module.htmlformentryui.converter.StringToHtmlFormConverter.htmlFormEntryService; nested exception is org.springframework.beans.factory.NoSuchBeanDefinitionException: No qualifying bean of type [org.openmrs.module.htmlformentry.HtmlFormEntryService] found for dependency: expected at least 1 bean which qualifies as autowire candidate for this dependency. Dependency annotations: {@org.springframework.beans.factory.annotation.Autowired(required=true), @org.springframework.beans.factory.annotation.Qualifier(value=htmlFormEntryService)}
  443. Related cause: org.springframework.beans.factory.BeanCreationException: Error creating bean with name 'htmlFormEntryService' defined in URL [jar:file:/C:/Users/lenovo/.m2/repository/org/openmrs/module/htmlformentry-api/3.11.0/htmlformentry-api-3.11.0.jar!/moduleApplicationContext.xml]: Cannot create inner bean 'org.openmrs.module.htmlformentry.impl.HtmlFormEntryServiceImpl#4ca34b41' of type [org.openmrs.module.htmlformentry.impl.HtmlFormEntryServiceImpl] while setting bean property 'target'; nested exception is org.springframework.beans.factory.BeanCreationException: Error creating bean with name 'org.openmrs.module.htmlformentry.impl.HtmlFormEntryServiceImpl#4ca34b41' defined in URL [jar:file:/C:/Users/lenovo/.m2/repository/org/openmrs/module/htmlformentry-api/3.11.0/htmlformentry-api-3.11.0.jar!/moduleApplicationContext.xml]: Cannot create inner bean 'org.openmrs.module.htmlformentry.handler.ConditionTagHandler#5c4c6b6b' of type [org.openmrs.module.htmlformentry.handler.ConditionTagHandler] while setting bean property 'handlers' with key [TypedStringValue: value [condition], target type [null]]; nested exception is org.springframework.beans.factory.BeanCreationException: Error creating bean with name 'org.openmrs.module.htmlformentry.handler.ConditionTagHandler#5c4c6b6b': Injection of autowired dependencies failed; nested exception is org.springframework.beans.factory.BeanCreationException: Could not autowire field: private org.openmrs.module.htmlformentry.handler.ConditionTagHandlerSupport org.openmrs.module.htmlformentry.handler.ConditionTagHandler.handler; nested exception is org.springframework.beans.factory.NoSuchBeanDefinitionException: No qualifying bean of type [org.openmrs.module.htmlformentry.handler.ConditionTagHandlerSupport] found for dependency: expected at least 1 bean which qualifies as autowire candidate for this dependency. Dependency annotations: {@org.springframework.beans.factory.annotation.Autowired(required=true)}
  444. at org.springframework.beans.factory.annotation.AutowiredAnnotationBeanPostProcessor.postProcessPropertyValues(AutowiredAnnotationBeanPostProcessor.java:334)
  445. at org.springframework.beans.factory.support.AbstractAutowireCapableBeanFactory.populateBean(AbstractAutowireCapableBeanFactory.java:1202)
  446. at org.springframework.beans.factory.support.AbstractAutowireCapableBeanFactory.doCreateBean(AbstractAutowireCapableBeanFactory.java:537)
  447. at org.springframework.beans.factory.support.AbstractAutowireCapableBeanFactory.createBean(AbstractAutowireCapableBeanFactory.java:476)
  448. at org.springframework.beans.factory.support.AbstractBeanFactory$1.getObject(AbstractBeanFactory.java:303)
  449. at org.springframework.beans.factory.support.DefaultSingletonBeanRegistry.getSingleton(DefaultSingletonBeanRegistry.java:230)
  450. at org.springframework.beans.factory.support.AbstractBeanFactory.doGetBean(AbstractBeanFactory.java:299)
  451. at org.springframework.beans.factory.support.AbstractBeanFactory.getBean(AbstractBeanFactory.java:194)
  452. at org.springframework.beans.factory.support.DefaultListableBeanFactory.preInstantiateSingletons(DefaultListableBeanFactory.java:762)
  453. at org.springframework.context.support.AbstractApplicationContext.finishBeanFactoryInitialization(AbstractApplicationContext.java:757)
  454. at org.springframework.context.support.AbstractApplicationContext.refresh(AbstractApplicationContext.java:480)
  455. at org.springframework.test.context.support.AbstractGenericContextLoader.loadContext(AbstractGenericContextLoader.java:125)
  456. at org.springframework.test.context.support.AbstractGenericContextLoader.loadContext(AbstractGenericContextLoader.java:60)
  457. at org.springframework.test.context.support.AbstractDelegatingSmartContextLoader.delegateLoading(AbstractDelegatingSmartContextLoader.java:109)
  458. at org.springframework.test.context.support.AbstractDelegatingSmartContextLoader.loadContext(AbstractDelegatingSmartContextLoader.java:261)
  459. at org.springframework.test.context.DefaultCacheAwareContextLoaderDelegate.loadContextInternal(DefaultCacheAwareContextLoaderDelegate.java:68)
  460. at org.springframework.test.context.DefaultCacheAwareContextLoaderDelegate.loadContext(DefaultCacheAwareContextLoaderDelegate.java:86)
  461. ... 32 more
  462. Caused by: org.springframework.beans.factory.BeanCreationException: Could not autowire field: org.openmrs.module.htmlformentry.HtmlFormEntryService org.openmrs.module.htmlformentryui.converter.StringToHtmlFormConverter.htmlFormEntryService; nested exception is org.springframework.beans.factory.NoSuchBeanDefinitionException: No qualifying bean of type [org.openmrs.module.htmlformentry.HtmlFormEntryService] found for dependency: expected at least 1 bean which qualifies as autowire candidate for this dependency. Dependency annotations: {@org.springframework.beans.factory.annotation.Autowired(required=true), @org.springframework.beans.factory.annotation.Qualifier(value=htmlFormEntryService)}
  463. at org.springframework.beans.factory.annotation.AutowiredAnnotationBeanPostProcessor$AutowiredFieldElement.inject(AutowiredAnnotationBeanPostProcessor.java:561)
  464. at org.springframework.beans.factory.annotation.InjectionMetadata.inject(InjectionMetadata.java:88)
  465. at org.springframework.beans.factory.annotation.AutowiredAnnotationBeanPostProcessor.postProcessPropertyValues(AutowiredAnnotationBeanPostProcessor.java:331)
  466. ... 48 more
  467. Caused by: org.springframework.beans.factory.NoSuchBeanDefinitionException: No qualifying bean of type [org.openmrs.module.htmlformentry.HtmlFormEntryService] found for dependency: expected at least 1 bean which qualifies as autowire candidate for this dependency. Dependency annotations: {@org.springframework.beans.factory.annotation.Autowired(required=true), @org.springframework.beans.factory.annotation.Qualifier(value=htmlFormEntryService)}
  468. at org.springframework.beans.factory.support.DefaultListableBeanFactory.raiseNoSuchBeanDefinitionException(DefaultListableBeanFactory.java:1308)
  469. at org.springframework.beans.factory.support.DefaultListableBeanFactory.doResolveDependency(DefaultListableBeanFactory.java:1054)
  470. at org.springframework.beans.factory.support.DefaultListableBeanFactory.resolveDependency(DefaultListableBeanFactory.java:949)
  471. at org.springframework.beans.factory.annotation.AutowiredAnnotationBeanPostProcessor$AutowiredFieldElement.inject(AutowiredAnnotationBeanPostProcessor.java:533)
  472. ... 50 more
  473.  
  474. testExposedInfantsWithEncountersAndNOSummaryPage(org.openmrs.module.aijar.dataintegrity.IncompleteExposedInfantInformationTest) Time elapsed: 0.004 sec <<< ERROR!
  475. java.lang.IllegalStateException: Failed to load ApplicationContext
  476. at org.springframework.test.context.DefaultCacheAwareContextLoaderDelegate.loadContext(DefaultCacheAwareContextLoaderDelegate.java:94)
  477. at org.springframework.test.context.DefaultTestContext.getApplicationContext(DefaultTestContext.java:72)
  478. at org.springframework.test.context.support.DependencyInjectionTestExecutionListener.injectDependencies(DependencyInjectionTestExecutionListener.java:117)
  479. at org.springframework.test.context.support.DependencyInjectionTestExecutionListener.prepareTestInstance(DependencyInjectionTestExecutionListener.java:83)
  480. at org.springframework.test.context.TestContextManager.prepareTestInstance(TestContextManager.java:212)
  481. at org.springframework.test.context.junit4.SpringJUnit4ClassRunner.createTest(SpringJUnit4ClassRunner.java:200)
  482. at org.springframework.test.context.junit4.SpringJUnit4ClassRunner$1.runReflectiveCall(SpringJUnit4ClassRunner.java:252)
  483. at org.junit.internal.runners.model.ReflectiveCallable.run(ReflectiveCallable.java:12)
  484. at org.springframework.test.context.junit4.SpringJUnit4ClassRunner.methodBlock(SpringJUnit4ClassRunner.java:254)
  485. at org.springframework.test.context.junit4.SpringJUnit4ClassRunner.runChild(SpringJUnit4ClassRunner.java:217)
  486. at org.springframework.test.context.junit4.SpringJUnit4ClassRunner.runChild(SpringJUnit4ClassRunner.java:83)
  487. at org.junit.runners.ParentRunner$3.run(ParentRunner.java:290)
  488. at org.junit.runners.ParentRunner$1.schedule(ParentRunner.java:71)
  489. at org.junit.runners.ParentRunner.runChildren(ParentRunner.java:288)
  490. at org.junit.runners.ParentRunner.access$000(ParentRunner.java:58)
  491. at org.junit.runners.ParentRunner$2.evaluate(ParentRunner.java:268)
  492. at org.springframework.test.context.junit4.statements.RunBeforeTestClassCallbacks.evaluate(RunBeforeTestClassCallbacks.java:61)
  493. at org.junit.internal.runners.statements.RunAfters.evaluate(RunAfters.java:27)
  494. at org.springframework.test.context.junit4.statements.RunAfterTestClassCallbacks.evaluate(RunAfterTestClassCallbacks.java:68)
  495. at org.junit.runners.ParentRunner.run(ParentRunner.java:363)
  496. at org.springframework.test.context.junit4.SpringJUnit4ClassRunner.run(SpringJUnit4ClassRunner.java:163)
  497. at org.apache.maven.surefire.junit4.JUnit4Provider.execute(JUnit4Provider.java:252)
  498. at org.apache.maven.surefire.junit4.JUnit4Provider.executeTestSet(JUnit4Provider.java:141)
  499. at org.apache.maven.surefire.junit4.JUnit4Provider.invoke(JUnit4Provider.java:112)
  500. at sun.reflect.NativeMethodAccessorImpl.invoke0(Native Method)
  501. at sun.reflect.NativeMethodAccessorImpl.invoke(NativeMethodAccessorImpl.java:62)
  502. at sun.reflect.DelegatingMethodAccessorImpl.invoke(DelegatingMethodAccessorImpl.java:43)
  503. at java.lang.reflect.Method.invoke(Method.java:498)
  504. at org.apache.maven.surefire.util.ReflectionUtils.invokeMethodWithArray(ReflectionUtils.java:189)
  505. at org.apache.maven.surefire.booter.ProviderFactory$ProviderProxy.invoke(ProviderFactory.java:165)
  506. at org.apache.maven.surefire.booter.ProviderFactory.invokeProvider(ProviderFactory.java:85)
  507. at org.apache.maven.surefire.booter.ForkedBooter.runSuitesInProcess(ForkedBooter.java:115)
  508. at org.apache.maven.surefire.booter.ForkedBooter.main(ForkedBooter.java:75)
  509. Caused by: org.springframework.beans.factory.BeanCreationException: Error creating bean with name 'stringToHtmlFormConverter': Injection of autowired dependencies failed; nested exception is org.springframework.beans.factory.BeanCreationException: Could not autowire field: org.openmrs.module.htmlformentry.HtmlFormEntryService org.openmrs.module.htmlformentryui.converter.StringToHtmlFormConverter.htmlFormEntryService; nested exception is org.springframework.beans.factory.NoSuchBeanDefinitionException: No qualifying bean of type [org.openmrs.module.htmlformentry.HtmlFormEntryService] found for dependency: expected at least 1 bean which qualifies as autowire candidate for this dependency. Dependency annotations: {@org.springframework.beans.factory.annotation.Autowired(required=true), @org.springframework.beans.factory.annotation.Qualifier(value=htmlFormEntryService)}
  510. Related cause: org.springframework.beans.factory.BeanCreationException: Error creating bean with name 'htmlFormEntryService' defined in URL [jar:file:/C:/Users/lenovo/.m2/repository/org/openmrs/module/htmlformentry-api/3.11.0/htmlformentry-api-3.11.0.jar!/moduleApplicationContext.xml]: Cannot create inner bean 'org.openmrs.module.htmlformentry.impl.HtmlFormEntryServiceImpl#6a81f3a8' of type [org.openmrs.module.htmlformentry.impl.HtmlFormEntryServiceImpl] while setting bean property 'target'; nested exception is org.springframework.beans.factory.BeanCreationException: Error creating bean with name 'org.openmrs.module.htmlformentry.impl.HtmlFormEntryServiceImpl#6a81f3a8' defined in URL [jar:file:/C:/Users/lenovo/.m2/repository/org/openmrs/module/htmlformentry-api/3.11.0/htmlformentry-api-3.11.0.jar!/moduleApplicationContext.xml]: Cannot create inner bean 'org.openmrs.module.htmlformentry.handler.ConditionTagHandler#a5ebbec' of type [org.openmrs.module.htmlformentry.handler.ConditionTagHandler] while setting bean property 'handlers' with key [TypedStringValue: value [condition], target type [null]]; nested exception is org.springframework.beans.factory.BeanCreationException: Error creating bean with name 'org.openmrs.module.htmlformentry.handler.ConditionTagHandler#a5ebbec': Injection of autowired dependencies failed; nested exception is org.springframework.beans.factory.BeanCreationException: Could not autowire field: private org.openmrs.module.htmlformentry.handler.ConditionTagHandlerSupport org.openmrs.module.htmlformentry.handler.ConditionTagHandler.handler; nested exception is org.springframework.beans.factory.NoSuchBeanDefinitionException: No qualifying bean of type [org.openmrs.module.htmlformentry.handler.ConditionTagHandlerSupport] found for dependency: expected at least 1 bean which qualifies as autowire candidate for this dependency. Dependency annotations: {@org.springframework.beans.factory.annotation.Autowired(required=true)}
  511. at org.springframework.beans.factory.annotation.AutowiredAnnotationBeanPostProcessor.postProcessPropertyValues(AutowiredAnnotationBeanPostProcessor.java:334)
  512. at org.springframework.beans.factory.support.AbstractAutowireCapableBeanFactory.populateBean(AbstractAutowireCapableBeanFactory.java:1202)
  513. at org.springframework.beans.factory.support.AbstractAutowireCapableBeanFactory.doCreateBean(AbstractAutowireCapableBeanFactory.java:537)
  514. at org.springframework.beans.factory.support.AbstractAutowireCapableBeanFactory.createBean(AbstractAutowireCapableBeanFactory.java:476)
  515. at org.springframework.beans.factory.support.AbstractBeanFactory$1.getObject(AbstractBeanFactory.java:303)
  516. at org.springframework.beans.factory.support.DefaultSingletonBeanRegistry.getSingleton(DefaultSingletonBeanRegistry.java:230)
  517. at org.springframework.beans.factory.support.AbstractBeanFactory.doGetBean(AbstractBeanFactory.java:299)
  518. at org.springframework.beans.factory.support.AbstractBeanFactory.getBean(AbstractBeanFactory.java:194)
  519. at org.springframework.beans.factory.support.DefaultListableBeanFactory.preInstantiateSingletons(DefaultListableBeanFactory.java:762)
  520. at org.springframework.context.support.AbstractApplicationContext.finishBeanFactoryInitialization(AbstractApplicationContext.java:757)
  521. at org.springframework.context.support.AbstractApplicationContext.refresh(AbstractApplicationContext.java:480)
  522. at org.springframework.test.context.support.AbstractGenericContextLoader.loadContext(AbstractGenericContextLoader.java:125)
  523. at org.springframework.test.context.support.AbstractGenericContextLoader.loadContext(AbstractGenericContextLoader.java:60)
  524. at org.springframework.test.context.support.AbstractDelegatingSmartContextLoader.delegateLoading(AbstractDelegatingSmartContextLoader.java:109)
  525. at org.springframework.test.context.support.AbstractDelegatingSmartContextLoader.loadContext(AbstractDelegatingSmartContextLoader.java:261)
  526. at org.springframework.test.context.DefaultCacheAwareContextLoaderDelegate.loadContextInternal(DefaultCacheAwareContextLoaderDelegate.java:68)
  527. at org.springframework.test.context.DefaultCacheAwareContextLoaderDelegate.loadContext(DefaultCacheAwareContextLoaderDelegate.java:86)
  528. ... 32 more
  529. Caused by: org.springframework.beans.factory.BeanCreationException: Could not autowire field: org.openmrs.module.htmlformentry.HtmlFormEntryService org.openmrs.module.htmlformentryui.converter.StringToHtmlFormConverter.htmlFormEntryService; nested exception is org.springframework.beans.factory.NoSuchBeanDefinitionException: No qualifying bean of type [org.openmrs.module.htmlformentry.HtmlFormEntryService] found for dependency: expected at least 1 bean which qualifies as autowire candidate for this dependency. Dependency annotations: {@org.springframework.beans.factory.annotation.Autowired(required=true), @org.springframework.beans.factory.annotation.Qualifier(value=htmlFormEntryService)}
  530. at org.springframework.beans.factory.annotation.AutowiredAnnotationBeanPostProcessor$AutowiredFieldElement.inject(AutowiredAnnotationBeanPostProcessor.java:561)
  531. at org.springframework.beans.factory.annotation.InjectionMetadata.inject(InjectionMetadata.java:88)
  532. at org.springframework.beans.factory.annotation.AutowiredAnnotationBeanPostProcessor.postProcessPropertyValues(AutowiredAnnotationBeanPostProcessor.java:331)
  533. ... 48 more
  534. Caused by: org.springframework.beans.factory.NoSuchBeanDefinitionException: No qualifying bean of type [org.openmrs.module.htmlformentry.HtmlFormEntryService] found for dependency: expected at least 1 bean which qualifies as autowire candidate for this dependency. Dependency annotations: {@org.springframework.beans.factory.annotation.Autowired(required=true), @org.springframework.beans.factory.annotation.Qualifier(value=htmlFormEntryService)}
  535. at org.springframework.beans.factory.support.DefaultListableBeanFactory.raiseNoSuchBeanDefinitionException(DefaultListableBeanFactory.java:1308)
  536. at org.springframework.beans.factory.support.DefaultListableBeanFactory.doResolveDependency(DefaultListableBeanFactory.java:1054)
  537. at org.springframework.beans.factory.support.DefaultListableBeanFactory.resolveDependency(DefaultListableBeanFactory.java:949)
  538. at org.springframework.beans.factory.annotation.AutowiredAnnotationBeanPostProcessor$AutowiredFieldElement.inject(AutowiredAnnotationBeanPostProcessor.java:533)
  539. ... 50 more
  540.  
  541. testExposedInfantsWithSummaryPageNoEncounters(org.openmrs.module.aijar.dataintegrity.IncompleteExposedInfantInformationTest) Time elapsed: 0.002 sec <<< ERROR!
  542. java.lang.IllegalStateException: Failed to load ApplicationContext
  543. at org.springframework.test.context.DefaultCacheAwareContextLoaderDelegate.loadContext(DefaultCacheAwareContextLoaderDelegate.java:94)
  544. at org.springframework.test.context.DefaultTestContext.getApplicationContext(DefaultTestContext.java:72)
  545. at org.springframework.test.context.support.DependencyInjectionTestExecutionListener.injectDependencies(DependencyInjectionTestExecutionListener.java:117)
  546. at org.springframework.test.context.support.DependencyInjectionTestExecutionListener.prepareTestInstance(DependencyInjectionTestExecutionListener.java:83)
  547. at org.springframework.test.context.TestContextManager.prepareTestInstance(TestContextManager.java:212)
  548. at org.springframework.test.context.junit4.SpringJUnit4ClassRunner.createTest(SpringJUnit4ClassRunner.java:200)
  549. at org.springframework.test.context.junit4.SpringJUnit4ClassRunner$1.runReflectiveCall(SpringJUnit4ClassRunner.java:252)
  550. at org.junit.internal.runners.model.ReflectiveCallable.run(ReflectiveCallable.java:12)
  551. at org.springframework.test.context.junit4.SpringJUnit4ClassRunner.methodBlock(SpringJUnit4ClassRunner.java:254)
  552. at org.springframework.test.context.junit4.SpringJUnit4ClassRunner.runChild(SpringJUnit4ClassRunner.java:217)
  553. at org.springframework.test.context.junit4.SpringJUnit4ClassRunner.runChild(SpringJUnit4ClassRunner.java:83)
  554. at org.junit.runners.ParentRunner$3.run(ParentRunner.java:290)
  555. at org.junit.runners.ParentRunner$1.schedule(ParentRunner.java:71)
  556. at org.junit.runners.ParentRunner.runChildren(ParentRunner.java:288)
  557. at org.junit.runners.ParentRunner.access$000(ParentRunner.java:58)
  558. at org.junit.runners.ParentRunner$2.evaluate(ParentRunner.java:268)
  559. at org.springframework.test.context.junit4.statements.RunBeforeTestClassCallbacks.evaluate(RunBeforeTestClassCallbacks.java:61)
  560. at org.junit.internal.runners.statements.RunAfters.evaluate(RunAfters.java:27)
  561. at org.springframework.test.context.junit4.statements.RunAfterTestClassCallbacks.evaluate(RunAfterTestClassCallbacks.java:68)
  562. at org.junit.runners.ParentRunner.run(ParentRunner.java:363)
  563. at org.springframework.test.context.junit4.SpringJUnit4ClassRunner.run(SpringJUnit4ClassRunner.java:163)
  564. at org.apache.maven.surefire.junit4.JUnit4Provider.execute(JUnit4Provider.java:252)
  565. at org.apache.maven.surefire.junit4.JUnit4Provider.executeTestSet(JUnit4Provider.java:141)
  566. at org.apache.maven.surefire.junit4.JUnit4Provider.invoke(JUnit4Provider.java:112)
  567. at sun.reflect.NativeMethodAccessorImpl.invoke0(Native Method)
  568. at sun.reflect.NativeMethodAccessorImpl.invoke(NativeMethodAccessorImpl.java:62)
  569. at sun.reflect.DelegatingMethodAccessorImpl.invoke(DelegatingMethodAccessorImpl.java:43)
  570. at java.lang.reflect.Method.invoke(Method.java:498)
  571. at org.apache.maven.surefire.util.ReflectionUtils.invokeMethodWithArray(ReflectionUtils.java:189)
  572. at org.apache.maven.surefire.booter.ProviderFactory$ProviderProxy.invoke(ProviderFactory.java:165)
  573. at org.apache.maven.surefire.booter.ProviderFactory.invokeProvider(ProviderFactory.java:85)
  574. at org.apache.maven.surefire.booter.ForkedBooter.runSuitesInProcess(ForkedBooter.java:115)
  575. at org.apache.maven.surefire.booter.ForkedBooter.main(ForkedBooter.java:75)
  576. Caused by: org.springframework.beans.factory.BeanCreationException: Error creating bean with name 'stringToHtmlFormConverter': Injection of autowired dependencies failed; nested exception is org.springframework.beans.factory.BeanCreationException: Could not autowire field: org.openmrs.module.htmlformentry.HtmlFormEntryService org.openmrs.module.htmlformentryui.converter.StringToHtmlFormConverter.htmlFormEntryService; nested exception is org.springframework.beans.factory.NoSuchBeanDefinitionException: No qualifying bean of type [org.openmrs.module.htmlformentry.HtmlFormEntryService] found for dependency: expected at least 1 bean which qualifies as autowire candidate for this dependency. Dependency annotations: {@org.springframework.beans.factory.annotation.Autowired(required=true), @org.springframework.beans.factory.annotation.Qualifier(value=htmlFormEntryService)}
  577. Related cause: org.springframework.beans.factory.BeanCreationException: Error creating bean with name 'htmlFormEntryService' defined in URL [jar:file:/C:/Users/lenovo/.m2/repository/org/openmrs/module/htmlformentry-api/3.11.0/htmlformentry-api-3.11.0.jar!/moduleApplicationContext.xml]: Cannot create inner bean 'org.openmrs.module.htmlformentry.impl.HtmlFormEntryServiceImpl#4425963' of type [org.openmrs.module.htmlformentry.impl.HtmlFormEntryServiceImpl] while setting bean property 'target'; nested exception is org.springframework.beans.factory.BeanCreationException: Error creating bean with name 'org.openmrs.module.htmlformentry.impl.HtmlFormEntryServiceImpl#4425963' defined in URL [jar:file:/C:/Users/lenovo/.m2/repository/org/openmrs/module/htmlformentry-api/3.11.0/htmlformentry-api-3.11.0.jar!/moduleApplicationContext.xml]: Cannot create inner bean 'org.openmrs.module.htmlformentry.handler.ConditionTagHandler#3a92f9b3' of type [org.openmrs.module.htmlformentry.handler.ConditionTagHandler] while setting bean property 'handlers' with key [TypedStringValue: value [condition], target type [null]]; nested exception is org.springframework.beans.factory.BeanCreationException: Error creating bean with name 'org.openmrs.module.htmlformentry.handler.ConditionTagHandler#3a92f9b3': Injection of autowired dependencies failed; nested exception is org.springframework.beans.factory.BeanCreationException: Could not autowire field: private org.openmrs.module.htmlformentry.handler.ConditionTagHandlerSupport org.openmrs.module.htmlformentry.handler.ConditionTagHandler.handler; nested exception is org.springframework.beans.factory.NoSuchBeanDefinitionException: No qualifying bean of type [org.openmrs.module.htmlformentry.handler.ConditionTagHandlerSupport] found for dependency: expected at least 1 bean which qualifies as autowire candidate for this dependency. Dependency annotations: {@org.springframework.beans.factory.annotation.Autowired(required=true)}
  578. at org.springframework.beans.factory.annotation.AutowiredAnnotationBeanPostProcessor.postProcessPropertyValues(AutowiredAnnotationBeanPostProcessor.java:334)
  579. at org.springframework.beans.factory.support.AbstractAutowireCapableBeanFactory.populateBean(AbstractAutowireCapableBeanFactory.java:1202)
  580. at org.springframework.beans.factory.support.AbstractAutowireCapableBeanFactory.doCreateBean(AbstractAutowireCapableBeanFactory.java:537)
  581. at org.springframework.beans.factory.support.AbstractAutowireCapableBeanFactory.createBean(AbstractAutowireCapableBeanFactory.java:476)
  582. at org.springframework.beans.factory.support.AbstractBeanFactory$1.getObject(AbstractBeanFactory.java:303)
  583. at org.springframework.beans.factory.support.DefaultSingletonBeanRegistry.getSingleton(DefaultSingletonBeanRegistry.java:230)
  584. at org.springframework.beans.factory.support.AbstractBeanFactory.doGetBean(AbstractBeanFactory.java:299)
  585. at org.springframework.beans.factory.support.AbstractBeanFactory.getBean(AbstractBeanFactory.java:194)
  586. at org.springframework.beans.factory.support.DefaultListableBeanFactory.preInstantiateSingletons(DefaultListableBeanFactory.java:762)
  587. at org.springframework.context.support.AbstractApplicationContext.finishBeanFactoryInitialization(AbstractApplicationContext.java:757)
  588. at org.springframework.context.support.AbstractApplicationContext.refresh(AbstractApplicationContext.java:480)
  589. at org.springframework.test.context.support.AbstractGenericContextLoader.loadContext(AbstractGenericContextLoader.java:125)
  590. at org.springframework.test.context.support.AbstractGenericContextLoader.loadContext(AbstractGenericContextLoader.java:60)
  591. at org.springframework.test.context.support.AbstractDelegatingSmartContextLoader.delegateLoading(AbstractDelegatingSmartContextLoader.java:109)
  592. at org.springframework.test.context.support.AbstractDelegatingSmartContextLoader.loadContext(AbstractDelegatingSmartContextLoader.java:261)
  593. at org.springframework.test.context.DefaultCacheAwareContextLoaderDelegate.loadContextInternal(DefaultCacheAwareContextLoaderDelegate.java:68)
  594. at org.springframework.test.context.DefaultCacheAwareContextLoaderDelegate.loadContext(DefaultCacheAwareContextLoaderDelegate.java:86)
  595. ... 32 more
  596. Caused by: org.springframework.beans.factory.BeanCreationException: Could not autowire field: org.openmrs.module.htmlformentry.HtmlFormEntryService org.openmrs.module.htmlformentryui.converter.StringToHtmlFormConverter.htmlFormEntryService; nested exception is org.springframework.beans.factory.NoSuchBeanDefinitionException: No qualifying bean of type [org.openmrs.module.htmlformentry.HtmlFormEntryService] found for dependency: expected at least 1 bean which qualifies as autowire candidate for this dependency. Dependency annotations: {@org.springframework.beans.factory.annotation.Autowired(required=true), @org.springframework.beans.factory.annotation.Qualifier(value=htmlFormEntryService)}
  597. at org.springframework.beans.factory.annotation.AutowiredAnnotationBeanPostProcessor$AutowiredFieldElement.inject(AutowiredAnnotationBeanPostProcessor.java:561)
  598. at org.springframework.beans.factory.annotation.InjectionMetadata.inject(InjectionMetadata.java:88)
  599. at org.springframework.beans.factory.annotation.AutowiredAnnotationBeanPostProcessor.postProcessPropertyValues(AutowiredAnnotationBeanPostProcessor.java:331)
  600. ... 48 more
  601. Caused by: org.springframework.beans.factory.NoSuchBeanDefinitionException: No qualifying bean of type [org.openmrs.module.htmlformentry.HtmlFormEntryService] found for dependency: expected at least 1 bean which qualifies as autowire candidate for this dependency. Dependency annotations: {@org.springframework.beans.factory.annotation.Autowired(required=true), @org.springframework.beans.factory.annotation.Qualifier(value=htmlFormEntryService)}
  602. at org.springframework.beans.factory.support.DefaultListableBeanFactory.raiseNoSuchBeanDefinitionException(DefaultListableBeanFactory.java:1308)
  603. at org.springframework.beans.factory.support.DefaultListableBeanFactory.doResolveDependency(DefaultListableBeanFactory.java:1054)
  604. at org.springframework.beans.factory.support.DefaultListableBeanFactory.resolveDependency(DefaultListableBeanFactory.java:949)
  605. at org.springframework.beans.factory.annotation.AutowiredAnnotationBeanPostProcessor$AutowiredFieldElement.inject(AutowiredAnnotationBeanPostProcessor.java:533)
  606. ... 50 more
  607.  
  608. Running org.openmrs.module.aijar.dataintegrity.InvalidTBEncountersTest
  609. Tests run: 5, Failures: 0, Errors: 5, Skipped: 0, Time elapsed: 34.589 sec <<< FAILURE!
  610. patientsWithNoFinalOutcomeNineMonthsAfterStartOfTreatmentTest(org.openmrs.module.aijar.dataintegrity.InvalidTBEncountersTest) Time elapsed: 0 sec <<< ERROR!
  611. java.lang.IllegalStateException: Failed to load ApplicationContext
  612. at org.springframework.test.context.DefaultCacheAwareContextLoaderDelegate.loadContext(DefaultCacheAwareContextLoaderDelegate.java:94)
  613. at org.springframework.test.context.DefaultTestContext.getApplicationContext(DefaultTestContext.java:72)
  614. at org.springframework.test.context.support.DependencyInjectionTestExecutionListener.injectDependencies(DependencyInjectionTestExecutionListener.java:117)
  615. at org.springframework.test.context.support.DependencyInjectionTestExecutionListener.prepareTestInstance(DependencyInjectionTestExecutionListener.java:83)
  616. at org.springframework.test.context.TestContextManager.prepareTestInstance(TestContextManager.java:212)
  617. at org.springframework.test.context.junit4.SpringJUnit4ClassRunner.createTest(SpringJUnit4ClassRunner.java:200)
  618. at org.springframework.test.context.junit4.SpringJUnit4ClassRunner$1.runReflectiveCall(SpringJUnit4ClassRunner.java:252)
  619. at org.junit.internal.runners.model.ReflectiveCallable.run(ReflectiveCallable.java:12)
  620. at org.springframework.test.context.junit4.SpringJUnit4ClassRunner.methodBlock(SpringJUnit4ClassRunner.java:254)
  621. at org.springframework.test.context.junit4.SpringJUnit4ClassRunner.runChild(SpringJUnit4ClassRunner.java:217)
  622. at org.springframework.test.context.junit4.SpringJUnit4ClassRunner.runChild(SpringJUnit4ClassRunner.java:83)
  623. at org.junit.runners.ParentRunner$3.run(ParentRunner.java:290)
  624. at org.junit.runners.ParentRunner$1.schedule(ParentRunner.java:71)
  625. at org.junit.runners.ParentRunner.runChildren(ParentRunner.java:288)
  626. at org.junit.runners.ParentRunner.access$000(ParentRunner.java:58)
  627. at org.junit.runners.ParentRunner$2.evaluate(ParentRunner.java:268)
  628. at org.springframework.test.context.junit4.statements.RunBeforeTestClassCallbacks.evaluate(RunBeforeTestClassCallbacks.java:61)
  629. at org.junit.internal.runners.statements.RunAfters.evaluate(RunAfters.java:27)
  630. at org.springframework.test.context.junit4.statements.RunAfterTestClassCallbacks.evaluate(RunAfterTestClassCallbacks.java:68)
  631. at org.junit.runners.ParentRunner.run(ParentRunner.java:363)
  632. at org.springframework.test.context.junit4.SpringJUnit4ClassRunner.run(SpringJUnit4ClassRunner.java:163)
  633. at org.apache.maven.surefire.junit4.JUnit4Provider.execute(JUnit4Provider.java:252)
  634. at org.apache.maven.surefire.junit4.JUnit4Provider.executeTestSet(JUnit4Provider.java:141)
  635. at org.apache.maven.surefire.junit4.JUnit4Provider.invoke(JUnit4Provider.java:112)
  636. at sun.reflect.NativeMethodAccessorImpl.invoke0(Native Method)
  637. at sun.reflect.NativeMethodAccessorImpl.invoke(NativeMethodAccessorImpl.java:62)
  638. at sun.reflect.DelegatingMethodAccessorImpl.invoke(DelegatingMethodAccessorImpl.java:43)
  639. at java.lang.reflect.Method.invoke(Method.java:498)
  640. at org.apache.maven.surefire.util.ReflectionUtils.invokeMethodWithArray(ReflectionUtils.java:189)
  641. at org.apache.maven.surefire.booter.ProviderFactory$ProviderProxy.invoke(ProviderFactory.java:165)
  642. at org.apache.maven.surefire.booter.ProviderFactory.invokeProvider(ProviderFactory.java:85)
  643. at org.apache.maven.surefire.booter.ForkedBooter.runSuitesInProcess(ForkedBooter.java:115)
  644. at org.apache.maven.surefire.booter.ForkedBooter.main(ForkedBooter.java:75)
  645. Caused by: org.springframework.beans.factory.BeanCreationException: Error creating bean with name 'stringToHtmlFormConverter': Injection of autowired dependencies failed; nested exception is org.springframework.beans.factory.BeanCreationException: Could not autowire field: org.openmrs.module.htmlformentry.HtmlFormEntryService org.openmrs.module.htmlformentryui.converter.StringToHtmlFormConverter.htmlFormEntryService; nested exception is org.springframework.beans.factory.NoSuchBeanDefinitionException: No qualifying bean of type [org.openmrs.module.htmlformentry.HtmlFormEntryService] found for dependency: expected at least 1 bean which qualifies as autowire candidate for this dependency. Dependency annotations: {@org.springframework.beans.factory.annotation.Autowired(required=true), @org.springframework.beans.factory.annotation.Qualifier(value=htmlFormEntryService)}
  646. Related cause: org.springframework.beans.factory.BeanCreationException: Error creating bean with name 'htmlFormEntryService' defined in URL [jar:file:/C:/Users/lenovo/.m2/repository/org/openmrs/module/htmlformentry-api/3.11.0/htmlformentry-api-3.11.0.jar!/moduleApplicationContext.xml]: Cannot create inner bean 'org.openmrs.module.htmlformentry.impl.HtmlFormEntryServiceImpl#3099fd47' of type [org.openmrs.module.htmlformentry.impl.HtmlFormEntryServiceImpl] while setting bean property 'target'; nested exception is org.springframework.beans.factory.BeanCreationException: Error creating bean with name 'org.openmrs.module.htmlformentry.impl.HtmlFormEntryServiceImpl#3099fd47' defined in URL [jar:file:/C:/Users/lenovo/.m2/repository/org/openmrs/module/htmlformentry-api/3.11.0/htmlformentry-api-3.11.0.jar!/moduleApplicationContext.xml]: Cannot create inner bean 'org.openmrs.module.htmlformentry.handler.ConditionTagHandler#8cad5fc' of type [org.openmrs.module.htmlformentry.handler.ConditionTagHandler] while setting bean property 'handlers' with key [TypedStringValue: value [condition], target type [null]]; nested exception is org.springframework.beans.factory.BeanCreationException: Error creating bean with name 'org.openmrs.module.htmlformentry.handler.ConditionTagHandler#8cad5fc': Injection of autowired dependencies failed; nested exception is org.springframework.beans.factory.BeanCreationException: Could not autowire field: private org.openmrs.module.htmlformentry.handler.ConditionTagHandlerSupport org.openmrs.module.htmlformentry.handler.ConditionTagHandler.handler; nested exception is org.springframework.beans.factory.NoSuchBeanDefinitionException: No qualifying bean of type [org.openmrs.module.htmlformentry.handler.ConditionTagHandlerSupport] found for dependency: expected at least 1 bean which qualifies as autowire candidate for this dependency. Dependency annotations: {@org.springframework.beans.factory.annotation.Autowired(required=true)}
  647. at org.springframework.beans.factory.annotation.AutowiredAnnotationBeanPostProcessor.postProcessPropertyValues(AutowiredAnnotationBeanPostProcessor.java:334)
  648. at org.springframework.beans.factory.support.AbstractAutowireCapableBeanFactory.populateBean(AbstractAutowireCapableBeanFactory.java:1202)
  649. at org.springframework.beans.factory.support.AbstractAutowireCapableBeanFactory.doCreateBean(AbstractAutowireCapableBeanFactory.java:537)
  650. at org.springframework.beans.factory.support.AbstractAutowireCapableBeanFactory.createBean(AbstractAutowireCapableBeanFactory.java:476)
  651. at org.springframework.beans.factory.support.AbstractBeanFactory$1.getObject(AbstractBeanFactory.java:303)
  652. at org.springframework.beans.factory.support.DefaultSingletonBeanRegistry.getSingleton(DefaultSingletonBeanRegistry.java:230)
  653. at org.springframework.beans.factory.support.AbstractBeanFactory.doGetBean(AbstractBeanFactory.java:299)
  654. at org.springframework.beans.factory.support.AbstractBeanFactory.getBean(AbstractBeanFactory.java:194)
  655. at org.springframework.beans.factory.support.DefaultListableBeanFactory.preInstantiateSingletons(DefaultListableBeanFactory.java:762)
  656. at org.springframework.context.support.AbstractApplicationContext.finishBeanFactoryInitialization(AbstractApplicationContext.java:757)
  657. at org.springframework.context.support.AbstractApplicationContext.refresh(AbstractApplicationContext.java:480)
  658. at org.springframework.test.context.support.AbstractGenericContextLoader.loadContext(AbstractGenericContextLoader.java:125)
  659. at org.springframework.test.context.support.AbstractGenericContextLoader.loadContext(AbstractGenericContextLoader.java:60)
  660. at org.springframework.test.context.support.AbstractDelegatingSmartContextLoader.delegateLoading(AbstractDelegatingSmartContextLoader.java:109)
  661. at org.springframework.test.context.support.AbstractDelegatingSmartContextLoader.loadContext(AbstractDelegatingSmartContextLoader.java:261)
  662. at org.springframework.test.context.DefaultCacheAwareContextLoaderDelegate.loadContextInternal(DefaultCacheAwareContextLoaderDelegate.java:68)
  663. at org.springframework.test.context.DefaultCacheAwareContextLoaderDelegate.loadContext(DefaultCacheAwareContextLoaderDelegate.java:86)
  664. ... 32 more
  665. Caused by: org.springframework.beans.factory.BeanCreationException: Could not autowire field: org.openmrs.module.htmlformentry.HtmlFormEntryService org.openmrs.module.htmlformentryui.converter.StringToHtmlFormConverter.htmlFormEntryService; nested exception is org.springframework.beans.factory.NoSuchBeanDefinitionException: No qualifying bean of type [org.openmrs.module.htmlformentry.HtmlFormEntryService] found for dependency: expected at least 1 bean which qualifies as autowire candidate for this dependency. Dependency annotations: {@org.springframework.beans.factory.annotation.Autowired(required=true), @org.springframework.beans.factory.annotation.Qualifier(value=htmlFormEntryService)}
  666. at org.springframework.beans.factory.annotation.AutowiredAnnotationBeanPostProcessor$AutowiredFieldElement.inject(AutowiredAnnotationBeanPostProcessor.java:561)
  667. at org.springframework.beans.factory.annotation.InjectionMetadata.inject(InjectionMetadata.java:88)
  668. at org.springframework.beans.factory.annotation.AutowiredAnnotationBeanPostProcessor.postProcessPropertyValues(AutowiredAnnotationBeanPostProcessor.java:331)
  669. ... 48 more
  670. Caused by: org.springframework.beans.factory.NoSuchBeanDefinitionException: No qualifying bean of type [org.openmrs.module.htmlformentry.HtmlFormEntryService] found for dependency: expected at least 1 bean which qualifies as autowire candidate for this dependency. Dependency annotations: {@org.springframework.beans.factory.annotation.Autowired(required=true), @org.springframework.beans.factory.annotation.Qualifier(value=htmlFormEntryService)}
  671. at org.springframework.beans.factory.support.DefaultListableBeanFactory.raiseNoSuchBeanDefinitionException(DefaultListableBeanFactory.java:1308)
  672. at org.springframework.beans.factory.support.DefaultListableBeanFactory.doResolveDependency(DefaultListableBeanFactory.java:1054)
  673. at org.springframework.beans.factory.support.DefaultListableBeanFactory.resolveDependency(DefaultListableBeanFactory.java:949)
  674. at org.springframework.beans.factory.annotation.AutowiredAnnotationBeanPostProcessor$AutowiredFieldElement.inject(AutowiredAnnotationBeanPostProcessor.java:533)
  675. ... 50 more
  676.  
  677. singlePatientWithDuplicateTBNumberAcrossMultipleTreatmentProgramsTest(org.openmrs.module.aijar.dataintegrity.InvalidTBEncountersTest) Time elapsed: 0.001 sec <<< ERROR!
  678. java.lang.IllegalStateException: Failed to load ApplicationContext
  679. at org.springframework.test.context.DefaultCacheAwareContextLoaderDelegate.loadContext(DefaultCacheAwareContextLoaderDelegate.java:94)
  680. at org.springframework.test.context.DefaultTestContext.getApplicationContext(DefaultTestContext.java:72)
  681. at org.springframework.test.context.support.DependencyInjectionTestExecutionListener.injectDependencies(DependencyInjectionTestExecutionListener.java:117)
  682. at org.springframework.test.context.support.DependencyInjectionTestExecutionListener.prepareTestInstance(DependencyInjectionTestExecutionListener.java:83)
  683. at org.springframework.test.context.TestContextManager.prepareTestInstance(TestContextManager.java:212)
  684. at org.springframework.test.context.junit4.SpringJUnit4ClassRunner.createTest(SpringJUnit4ClassRunner.java:200)
  685. at org.springframework.test.context.junit4.SpringJUnit4ClassRunner$1.runReflectiveCall(SpringJUnit4ClassRunner.java:252)
  686. at org.junit.internal.runners.model.ReflectiveCallable.run(ReflectiveCallable.java:12)
  687. at org.springframework.test.context.junit4.SpringJUnit4ClassRunner.methodBlock(SpringJUnit4ClassRunner.java:254)
  688. at org.springframework.test.context.junit4.SpringJUnit4ClassRunner.runChild(SpringJUnit4ClassRunner.java:217)
  689. at org.springframework.test.context.junit4.SpringJUnit4ClassRunner.runChild(SpringJUnit4ClassRunner.java:83)
  690. at org.junit.runners.ParentRunner$3.run(ParentRunner.java:290)
  691. at org.junit.runners.ParentRunner$1.schedule(ParentRunner.java:71)
  692. at org.junit.runners.ParentRunner.runChildren(ParentRunner.java:288)
  693. at org.junit.runners.ParentRunner.access$000(ParentRunner.java:58)
  694. at org.junit.runners.ParentRunner$2.evaluate(ParentRunner.java:268)
  695. at org.springframework.test.context.junit4.statements.RunBeforeTestClassCallbacks.evaluate(RunBeforeTestClassCallbacks.java:61)
  696. at org.junit.internal.runners.statements.RunAfters.evaluate(RunAfters.java:27)
  697. at org.springframework.test.context.junit4.statements.RunAfterTestClassCallbacks.evaluate(RunAfterTestClassCallbacks.java:68)
  698. at org.junit.runners.ParentRunner.run(ParentRunner.java:363)
  699. at org.springframework.test.context.junit4.SpringJUnit4ClassRunner.run(SpringJUnit4ClassRunner.java:163)
  700. at org.apache.maven.surefire.junit4.JUnit4Provider.execute(JUnit4Provider.java:252)
  701. at org.apache.maven.surefire.junit4.JUnit4Provider.executeTestSet(JUnit4Provider.java:141)
  702. at org.apache.maven.surefire.junit4.JUnit4Provider.invoke(JUnit4Provider.java:112)
  703. at sun.reflect.NativeMethodAccessorImpl.invoke0(Native Method)
  704. at sun.reflect.NativeMethodAccessorImpl.invoke(NativeMethodAccessorImpl.java:62)
  705. at sun.reflect.DelegatingMethodAccessorImpl.invoke(DelegatingMethodAccessorImpl.java:43)
  706. at java.lang.reflect.Method.invoke(Method.java:498)
  707. at org.apache.maven.surefire.util.ReflectionUtils.invokeMethodWithArray(ReflectionUtils.java:189)
  708. at org.apache.maven.surefire.booter.ProviderFactory$ProviderProxy.invoke(ProviderFactory.java:165)
  709. at org.apache.maven.surefire.booter.ProviderFactory.invokeProvider(ProviderFactory.java:85)
  710. at org.apache.maven.surefire.booter.ForkedBooter.runSuitesInProcess(ForkedBooter.java:115)
  711. at org.apache.maven.surefire.booter.ForkedBooter.main(ForkedBooter.java:75)
  712. Caused by: org.springframework.beans.factory.BeanCreationException: Error creating bean with name 'stringToHtmlFormConverter': Injection of autowired dependencies failed; nested exception is org.springframework.beans.factory.BeanCreationException: Could not autowire field: org.openmrs.module.htmlformentry.HtmlFormEntryService org.openmrs.module.htmlformentryui.converter.StringToHtmlFormConverter.htmlFormEntryService; nested exception is org.springframework.beans.factory.NoSuchBeanDefinitionException: No qualifying bean of type [org.openmrs.module.htmlformentry.HtmlFormEntryService] found for dependency: expected at least 1 bean which qualifies as autowire candidate for this dependency. Dependency annotations: {@org.springframework.beans.factory.annotation.Autowired(required=true), @org.springframework.beans.factory.annotation.Qualifier(value=htmlFormEntryService)}
  713. Related cause: org.springframework.beans.factory.BeanCreationException: Error creating bean with name 'htmlFormEntryService' defined in URL [jar:file:/C:/Users/lenovo/.m2/repository/org/openmrs/module/htmlformentry-api/3.11.0/htmlformentry-api-3.11.0.jar!/moduleApplicationContext.xml]: Cannot create inner bean 'org.openmrs.module.htmlformentry.impl.HtmlFormEntryServiceImpl#5e043bda' of type [org.openmrs.module.htmlformentry.impl.HtmlFormEntryServiceImpl] while setting bean property 'target'; nested exception is org.springframework.beans.factory.BeanCreationException: Error creating bean with name 'org.openmrs.module.htmlformentry.impl.HtmlFormEntryServiceImpl#5e043bda' defined in URL [jar:file:/C:/Users/lenovo/.m2/repository/org/openmrs/module/htmlformentry-api/3.11.0/htmlformentry-api-3.11.0.jar!/moduleApplicationContext.xml]: Cannot create inner bean 'org.openmrs.module.htmlformentry.handler.ConditionTagHandler#72a83585' of type [org.openmrs.module.htmlformentry.handler.ConditionTagHandler] while setting bean property 'handlers' with key [TypedStringValue: value [condition], target type [null]]; nested exception is org.springframework.beans.factory.BeanCreationException: Error creating bean with name 'org.openmrs.module.htmlformentry.handler.ConditionTagHandler#72a83585': Injection of autowired dependencies failed; nested exception is org.springframework.beans.factory.BeanCreationException: Could not autowire field: private org.openmrs.module.htmlformentry.handler.ConditionTagHandlerSupport org.openmrs.module.htmlformentry.handler.ConditionTagHandler.handler; nested exception is org.springframework.beans.factory.NoSuchBeanDefinitionException: No qualifying bean of type [org.openmrs.module.htmlformentry.handler.ConditionTagHandlerSupport] found for dependency: expected at least 1 bean which qualifies as autowire candidate for this dependency. Dependency annotations: {@org.springframework.beans.factory.annotation.Autowired(required=true)}
  714. at org.springframework.beans.factory.annotation.AutowiredAnnotationBeanPostProcessor.postProcessPropertyValues(AutowiredAnnotationBeanPostProcessor.java:334)
  715. at org.springframework.beans.factory.support.AbstractAutowireCapableBeanFactory.populateBean(AbstractAutowireCapableBeanFactory.java:1202)
  716. at org.springframework.beans.factory.support.AbstractAutowireCapableBeanFactory.doCreateBean(AbstractAutowireCapableBeanFactory.java:537)
  717. at org.springframework.beans.factory.support.AbstractAutowireCapableBeanFactory.createBean(AbstractAutowireCapableBeanFactory.java:476)
  718. at org.springframework.beans.factory.support.AbstractBeanFactory$1.getObject(AbstractBeanFactory.java:303)
  719. at org.springframework.beans.factory.support.DefaultSingletonBeanRegistry.getSingleton(DefaultSingletonBeanRegistry.java:230)
  720. at org.springframework.beans.factory.support.AbstractBeanFactory.doGetBean(AbstractBeanFactory.java:299)
  721. at org.springframework.beans.factory.support.AbstractBeanFactory.getBean(AbstractBeanFactory.java:194)
  722. at org.springframework.beans.factory.support.DefaultListableBeanFactory.preInstantiateSingletons(DefaultListableBeanFactory.java:762)
  723. at org.springframework.context.support.AbstractApplicationContext.finishBeanFactoryInitialization(AbstractApplicationContext.java:757)
  724. at org.springframework.context.support.AbstractApplicationContext.refresh(AbstractApplicationContext.java:480)
  725. at org.springframework.test.context.support.AbstractGenericContextLoader.loadContext(AbstractGenericContextLoader.java:125)
  726. at org.springframework.test.context.support.AbstractGenericContextLoader.loadContext(AbstractGenericContextLoader.java:60)
  727. at org.springframework.test.context.support.AbstractDelegatingSmartContextLoader.delegateLoading(AbstractDelegatingSmartContextLoader.java:109)
  728. at org.springframework.test.context.support.AbstractDelegatingSmartContextLoader.loadContext(AbstractDelegatingSmartContextLoader.java:261)
  729. at org.springframework.test.context.DefaultCacheAwareContextLoaderDelegate.loadContextInternal(DefaultCacheAwareContextLoaderDelegate.java:68)
  730. at org.springframework.test.context.DefaultCacheAwareContextLoaderDelegate.loadContext(DefaultCacheAwareContextLoaderDelegate.java:86)
  731. ... 32 more
  732. Caused by: org.springframework.beans.factory.BeanCreationException: Could not autowire field: org.openmrs.module.htmlformentry.HtmlFormEntryService org.openmrs.module.htmlformentryui.converter.StringToHtmlFormConverter.htmlFormEntryService; nested exception is org.springframework.beans.factory.NoSuchBeanDefinitionException: No qualifying bean of type [org.openmrs.module.htmlformentry.HtmlFormEntryService] found for dependency: expected at least 1 bean which qualifies as autowire candidate for this dependency. Dependency annotations: {@org.springframework.beans.factory.annotation.Autowired(required=true), @org.springframework.beans.factory.annotation.Qualifier(value=htmlFormEntryService)}
  733. at org.springframework.beans.factory.annotation.AutowiredAnnotationBeanPostProcessor$AutowiredFieldElement.inject(AutowiredAnnotationBeanPostProcessor.java:561)
  734. at org.springframework.beans.factory.annotation.InjectionMetadata.inject(InjectionMetadata.java:88)
  735. at org.springframework.beans.factory.annotation.AutowiredAnnotationBeanPostProcessor.postProcessPropertyValues(AutowiredAnnotationBeanPostProcessor.java:331)
  736. ... 48 more
  737. Caused by: org.springframework.beans.factory.NoSuchBeanDefinitionException: No qualifying bean of type [org.openmrs.module.htmlformentry.HtmlFormEntryService] found for dependency: expected at least 1 bean which qualifies as autowire candidate for this dependency. Dependency annotations: {@org.springframework.beans.factory.annotation.Autowired(required=true), @org.springframework.beans.factory.annotation.Qualifier(value=htmlFormEntryService)}
  738. at org.springframework.beans.factory.support.DefaultListableBeanFactory.raiseNoSuchBeanDefinitionException(DefaultListableBeanFactory.java:1308)
  739. at org.springframework.beans.factory.support.DefaultListableBeanFactory.doResolveDependency(DefaultListableBeanFactory.java:1054)
  740. at org.springframework.beans.factory.support.DefaultListableBeanFactory.resolveDependency(DefaultListableBeanFactory.java:949)
  741. at org.springframework.beans.factory.annotation.AutowiredAnnotationBeanPostProcessor$AutowiredFieldElement.inject(AutowiredAnnotationBeanPostProcessor.java:533)
  742. ... 50 more
  743.  
  744. multiplePatientsWithTheSameTBIdentifiersTest2(org.openmrs.module.aijar.dataintegrity.InvalidTBEncountersTest) Time elapsed: 0 sec <<< ERROR!
  745. java.lang.IllegalStateException: Failed to load ApplicationContext
  746. at org.springframework.test.context.DefaultCacheAwareContextLoaderDelegate.loadContext(DefaultCacheAwareContextLoaderDelegate.java:94)
  747. at org.springframework.test.context.DefaultTestContext.getApplicationContext(DefaultTestContext.java:72)
  748. at org.springframework.test.context.support.DependencyInjectionTestExecutionListener.injectDependencies(DependencyInjectionTestExecutionListener.java:117)
  749. at org.springframework.test.context.support.DependencyInjectionTestExecutionListener.prepareTestInstance(DependencyInjectionTestExecutionListener.java:83)
  750. at org.springframework.test.context.TestContextManager.prepareTestInstance(TestContextManager.java:212)
  751. at org.springframework.test.context.junit4.SpringJUnit4ClassRunner.createTest(SpringJUnit4ClassRunner.java:200)
  752. at org.springframework.test.context.junit4.SpringJUnit4ClassRunner$1.runReflectiveCall(SpringJUnit4ClassRunner.java:252)
  753. at org.junit.internal.runners.model.ReflectiveCallable.run(ReflectiveCallable.java:12)
  754. at org.springframework.test.context.junit4.SpringJUnit4ClassRunner.methodBlock(SpringJUnit4ClassRunner.java:254)
  755. at org.springframework.test.context.junit4.SpringJUnit4ClassRunner.runChild(SpringJUnit4ClassRunner.java:217)
  756. at org.springframework.test.context.junit4.SpringJUnit4ClassRunner.runChild(SpringJUnit4ClassRunner.java:83)
  757. at org.junit.runners.ParentRunner$3.run(ParentRunner.java:290)
  758. at org.junit.runners.ParentRunner$1.schedule(ParentRunner.java:71)
  759. at org.junit.runners.ParentRunner.runChildren(ParentRunner.java:288)
  760. at org.junit.runners.ParentRunner.access$000(ParentRunner.java:58)
  761. at org.junit.runners.ParentRunner$2.evaluate(ParentRunner.java:268)
  762. at org.springframework.test.context.junit4.statements.RunBeforeTestClassCallbacks.evaluate(RunBeforeTestClassCallbacks.java:61)
  763. at org.junit.internal.runners.statements.RunAfters.evaluate(RunAfters.java:27)
  764. at org.springframework.test.context.junit4.statements.RunAfterTestClassCallbacks.evaluate(RunAfterTestClassCallbacks.java:68)
  765. at org.junit.runners.ParentRunner.run(ParentRunner.java:363)
  766. at org.springframework.test.context.junit4.SpringJUnit4ClassRunner.run(SpringJUnit4ClassRunner.java:163)
  767. at org.apache.maven.surefire.junit4.JUnit4Provider.execute(JUnit4Provider.java:252)
  768. at org.apache.maven.surefire.junit4.JUnit4Provider.executeTestSet(JUnit4Provider.java:141)
  769. at org.apache.maven.surefire.junit4.JUnit4Provider.invoke(JUnit4Provider.java:112)
  770. at sun.reflect.NativeMethodAccessorImpl.invoke0(Native Method)
  771. at sun.reflect.NativeMethodAccessorImpl.invoke(NativeMethodAccessorImpl.java:62)
  772. at sun.reflect.DelegatingMethodAccessorImpl.invoke(DelegatingMethodAccessorImpl.java:43)
  773. at java.lang.reflect.Method.invoke(Method.java:498)
  774. at org.apache.maven.surefire.util.ReflectionUtils.invokeMethodWithArray(ReflectionUtils.java:189)
  775. at org.apache.maven.surefire.booter.ProviderFactory$ProviderProxy.invoke(ProviderFactory.java:165)
  776. at org.apache.maven.surefire.booter.ProviderFactory.invokeProvider(ProviderFactory.java:85)
  777. at org.apache.maven.surefire.booter.ForkedBooter.runSuitesInProcess(ForkedBooter.java:115)
  778. at org.apache.maven.surefire.booter.ForkedBooter.main(ForkedBooter.java:75)
  779. Caused by: org.springframework.beans.factory.BeanCreationException: Error creating bean with name 'stringToHtmlFormConverter': Injection of autowired dependencies failed; nested exception is org.springframework.beans.factory.BeanCreationException: Could not autowire field: org.openmrs.module.htmlformentry.HtmlFormEntryService org.openmrs.module.htmlformentryui.converter.StringToHtmlFormConverter.htmlFormEntryService; nested exception is org.springframework.beans.factory.NoSuchBeanDefinitionException: No qualifying bean of type [org.openmrs.module.htmlformentry.HtmlFormEntryService] found for dependency: expected at least 1 bean which qualifies as autowire candidate for this dependency. Dependency annotations: {@org.springframework.beans.factory.annotation.Autowired(required=true), @org.springframework.beans.factory.annotation.Qualifier(value=htmlFormEntryService)}
  780. Related cause: org.springframework.beans.factory.BeanCreationException: Error creating bean with name 'htmlFormEntryService' defined in URL [jar:file:/C:/Users/lenovo/.m2/repository/org/openmrs/module/htmlformentry-api/3.11.0/htmlformentry-api-3.11.0.jar!/moduleApplicationContext.xml]: Cannot create inner bean 'org.openmrs.module.htmlformentry.impl.HtmlFormEntryServiceImpl#44fe7516' of type [org.openmrs.module.htmlformentry.impl.HtmlFormEntryServiceImpl] while setting bean property 'target'; nested exception is org.springframework.beans.factory.BeanCreationException: Error creating bean with name 'org.openmrs.module.htmlformentry.impl.HtmlFormEntryServiceImpl#44fe7516' defined in URL [jar:file:/C:/Users/lenovo/.m2/repository/org/openmrs/module/htmlformentry-api/3.11.0/htmlformentry-api-3.11.0.jar!/moduleApplicationContext.xml]: Cannot create inner bean 'org.openmrs.module.htmlformentry.handler.ConditionTagHandler#75e7fbea' of type [org.openmrs.module.htmlformentry.handler.ConditionTagHandler] while setting bean property 'handlers' with key [TypedStringValue: value [condition], target type [null]]; nested exception is org.springframework.beans.factory.BeanCreationException: Error creating bean with name 'org.openmrs.module.htmlformentry.handler.ConditionTagHandler#75e7fbea': Injection of autowired dependencies failed; nested exception is org.springframework.beans.factory.BeanCreationException: Could not autowire field: private org.openmrs.module.htmlformentry.handler.ConditionTagHandlerSupport org.openmrs.module.htmlformentry.handler.ConditionTagHandler.handler; nested exception is org.springframework.beans.factory.NoSuchBeanDefinitionException: No qualifying bean of type [org.openmrs.module.htmlformentry.handler.ConditionTagHandlerSupport] found for dependency: expected at least 1 bean which qualifies as autowire candidate for this dependency. Dependency annotations: {@org.springframework.beans.factory.annotation.Autowired(required=true)}
  781. at org.springframework.beans.factory.annotation.AutowiredAnnotationBeanPostProcessor.postProcessPropertyValues(AutowiredAnnotationBeanPostProcessor.java:334)
  782. at org.springframework.beans.factory.support.AbstractAutowireCapableBeanFactory.populateBean(AbstractAutowireCapableBeanFactory.java:1202)
  783. at org.springframework.beans.factory.support.AbstractAutowireCapableBeanFactory.doCreateBean(AbstractAutowireCapableBeanFactory.java:537)
  784. at org.springframework.beans.factory.support.AbstractAutowireCapableBeanFactory.createBean(AbstractAutowireCapableBeanFactory.java:476)
  785. at org.springframework.beans.factory.support.AbstractBeanFactory$1.getObject(AbstractBeanFactory.java:303)
  786. at org.springframework.beans.factory.support.DefaultSingletonBeanRegistry.getSingleton(DefaultSingletonBeanRegistry.java:230)
  787. at org.springframework.beans.factory.support.AbstractBeanFactory.doGetBean(AbstractBeanFactory.java:299)
  788. at org.springframework.beans.factory.support.AbstractBeanFactory.getBean(AbstractBeanFactory.java:194)
  789. at org.springframework.beans.factory.support.DefaultListableBeanFactory.preInstantiateSingletons(DefaultListableBeanFactory.java:762)
  790. at org.springframework.context.support.AbstractApplicationContext.finishBeanFactoryInitialization(AbstractApplicationContext.java:757)
  791. at org.springframework.context.support.AbstractApplicationContext.refresh(AbstractApplicationContext.java:480)
  792. at org.springframework.test.context.support.AbstractGenericContextLoader.loadContext(AbstractGenericContextLoader.java:125)
  793. at org.springframework.test.context.support.AbstractGenericContextLoader.loadContext(AbstractGenericContextLoader.java:60)
  794. at org.springframework.test.context.support.AbstractDelegatingSmartContextLoader.delegateLoading(AbstractDelegatingSmartContextLoader.java:109)
  795. at org.springframework.test.context.support.AbstractDelegatingSmartContextLoader.loadContext(AbstractDelegatingSmartContextLoader.java:261)
  796. at org.springframework.test.context.DefaultCacheAwareContextLoaderDelegate.loadContextInternal(DefaultCacheAwareContextLoaderDelegate.java:68)
  797. at org.springframework.test.context.DefaultCacheAwareContextLoaderDelegate.loadContext(DefaultCacheAwareContextLoaderDelegate.java:86)
  798. ... 32 more
  799. Caused by: org.springframework.beans.factory.BeanCreationException: Could not autowire field: org.openmrs.module.htmlformentry.HtmlFormEntryService org.openmrs.module.htmlformentryui.converter.StringToHtmlFormConverter.htmlFormEntryService; nested exception is org.springframework.beans.factory.NoSuchBeanDefinitionException: No qualifying bean of type [org.openmrs.module.htmlformentry.HtmlFormEntryService] found for dependency: expected at least 1 bean which qualifies as autowire candidate for this dependency. Dependency annotations: {@org.springframework.beans.factory.annotation.Autowired(required=true), @org.springframework.beans.factory.annotation.Qualifier(value=htmlFormEntryService)}
  800. at org.springframework.beans.factory.annotation.AutowiredAnnotationBeanPostProcessor$AutowiredFieldElement.inject(AutowiredAnnotationBeanPostProcessor.java:561)
  801. at org.springframework.beans.factory.annotation.InjectionMetadata.inject(InjectionMetadata.java:88)
  802. at org.springframework.beans.factory.annotation.AutowiredAnnotationBeanPostProcessor.postProcessPropertyValues(AutowiredAnnotationBeanPostProcessor.java:331)
  803. ... 48 more
  804. Caused by: org.springframework.beans.factory.NoSuchBeanDefinitionException: No qualifying bean of type [org.openmrs.module.htmlformentry.HtmlFormEntryService] found for dependency: expected at least 1 bean which qualifies as autowire candidate for this dependency. Dependency annotations: {@org.springframework.beans.factory.annotation.Autowired(required=true), @org.springframework.beans.factory.annotation.Qualifier(value=htmlFormEntryService)}
  805. at org.springframework.beans.factory.support.DefaultListableBeanFactory.raiseNoSuchBeanDefinitionException(DefaultListableBeanFactory.java:1308)
  806. at org.springframework.beans.factory.support.DefaultListableBeanFactory.doResolveDependency(DefaultListableBeanFactory.java:1054)
  807. at org.springframework.beans.factory.support.DefaultListableBeanFactory.resolveDependency(DefaultListableBeanFactory.java:949)
  808. at org.springframework.beans.factory.annotation.AutowiredAnnotationBeanPostProcessor$AutowiredFieldElement.inject(AutowiredAnnotationBeanPostProcessor.java:533)
  809. ... 50 more
  810.  
  811. multiplePatientsWithTheSameTBIdentifiersTest(org.openmrs.module.aijar.dataintegrity.InvalidTBEncountersTest) Time elapsed: 0.001 sec <<< ERROR!
  812. java.lang.IllegalStateException: Failed to load ApplicationContext
  813. at org.springframework.test.context.DefaultCacheAwareContextLoaderDelegate.loadContext(DefaultCacheAwareContextLoaderDelegate.java:94)
  814. at org.springframework.test.context.DefaultTestContext.getApplicationContext(DefaultTestContext.java:72)
  815. at org.springframework.test.context.support.DependencyInjectionTestExecutionListener.injectDependencies(DependencyInjectionTestExecutionListener.java:117)
  816. at org.springframework.test.context.support.DependencyInjectionTestExecutionListener.prepareTestInstance(DependencyInjectionTestExecutionListener.java:83)
  817. at org.springframework.test.context.TestContextManager.prepareTestInstance(TestContextManager.java:212)
  818. at org.springframework.test.context.junit4.SpringJUnit4ClassRunner.createTest(SpringJUnit4ClassRunner.java:200)
  819. at org.springframework.test.context.junit4.SpringJUnit4ClassRunner$1.runReflectiveCall(SpringJUnit4ClassRunner.java:252)
  820. at org.junit.internal.runners.model.ReflectiveCallable.run(ReflectiveCallable.java:12)
  821. at org.springframework.test.context.junit4.SpringJUnit4ClassRunner.methodBlock(SpringJUnit4ClassRunner.java:254)
  822. at org.springframework.test.context.junit4.SpringJUnit4ClassRunner.runChild(SpringJUnit4ClassRunner.java:217)
  823. at org.springframework.test.context.junit4.SpringJUnit4ClassRunner.runChild(SpringJUnit4ClassRunner.java:83)
  824. at org.junit.runners.ParentRunner$3.run(ParentRunner.java:290)
  825. at org.junit.runners.ParentRunner$1.schedule(ParentRunner.java:71)
  826. at org.junit.runners.ParentRunner.runChildren(ParentRunner.java:288)
  827. at org.junit.runners.ParentRunner.access$000(ParentRunner.java:58)
  828. at org.junit.runners.ParentRunner$2.evaluate(ParentRunner.java:268)
  829. at org.springframework.test.context.junit4.statements.RunBeforeTestClassCallbacks.evaluate(RunBeforeTestClassCallbacks.java:61)
  830. at org.junit.internal.runners.statements.RunAfters.evaluate(RunAfters.java:27)
  831. at org.springframework.test.context.junit4.statements.RunAfterTestClassCallbacks.evaluate(RunAfterTestClassCallbacks.java:68)
  832. at org.junit.runners.ParentRunner.run(ParentRunner.java:363)
  833. at org.springframework.test.context.junit4.SpringJUnit4ClassRunner.run(SpringJUnit4ClassRunner.java:163)
  834. at org.apache.maven.surefire.junit4.JUnit4Provider.execute(JUnit4Provider.java:252)
  835. at org.apache.maven.surefire.junit4.JUnit4Provider.executeTestSet(JUnit4Provider.java:141)
  836. at org.apache.maven.surefire.junit4.JUnit4Provider.invoke(JUnit4Provider.java:112)
  837. at sun.reflect.NativeMethodAccessorImpl.invoke0(Native Method)
  838. at sun.reflect.NativeMethodAccessorImpl.invoke(NativeMethodAccessorImpl.java:62)
  839. at sun.reflect.DelegatingMethodAccessorImpl.invoke(DelegatingMethodAccessorImpl.java:43)
  840. at java.lang.reflect.Method.invoke(Method.java:498)
  841. at org.apache.maven.surefire.util.ReflectionUtils.invokeMethodWithArray(ReflectionUtils.java:189)
  842. at org.apache.maven.surefire.booter.ProviderFactory$ProviderProxy.invoke(ProviderFactory.java:165)
  843. at org.apache.maven.surefire.booter.ProviderFactory.invokeProvider(ProviderFactory.java:85)
  844. at org.apache.maven.surefire.booter.ForkedBooter.runSuitesInProcess(ForkedBooter.java:115)
  845. at org.apache.maven.surefire.booter.ForkedBooter.main(ForkedBooter.java:75)
  846. Caused by: org.springframework.beans.factory.BeanCreationException: Error creating bean with name 'stringToHtmlFormConverter': Injection of autowired dependencies failed; nested exception is org.springframework.beans.factory.BeanCreationException: Could not autowire field: org.openmrs.module.htmlformentry.HtmlFormEntryService org.openmrs.module.htmlformentryui.converter.StringToHtmlFormConverter.htmlFormEntryService; nested exception is org.springframework.beans.factory.NoSuchBeanDefinitionException: No qualifying bean of type [org.openmrs.module.htmlformentry.HtmlFormEntryService] found for dependency: expected at least 1 bean which qualifies as autowire candidate for this dependency. Dependency annotations: {@org.springframework.beans.factory.annotation.Autowired(required=true), @org.springframework.beans.factory.annotation.Qualifier(value=htmlFormEntryService)}
  847. Related cause: org.springframework.beans.factory.BeanCreationException: Error creating bean with name 'htmlFormEntryService' defined in URL [jar:file:/C:/Users/lenovo/.m2/repository/org/openmrs/module/htmlformentry-api/3.11.0/htmlformentry-api-3.11.0.jar!/moduleApplicationContext.xml]: Cannot create inner bean 'org.openmrs.module.htmlformentry.impl.HtmlFormEntryServiceImpl#4d255929' of type [org.openmrs.module.htmlformentry.impl.HtmlFormEntryServiceImpl] while setting bean property 'target'; nested exception is org.springframework.beans.factory.BeanCreationException: Error creating bean with name 'org.openmrs.module.htmlformentry.impl.HtmlFormEntryServiceImpl#4d255929' defined in URL [jar:file:/C:/Users/lenovo/.m2/repository/org/openmrs/module/htmlformentry-api/3.11.0/htmlformentry-api-3.11.0.jar!/moduleApplicationContext.xml]: Cannot create inner bean 'org.openmrs.module.htmlformentry.handler.ConditionTagHandler#14f1e975' of type [org.openmrs.module.htmlformentry.handler.ConditionTagHandler] while setting bean property 'handlers' with key [TypedStringValue: value [condition], target type [null]]; nested exception is org.springframework.beans.factory.BeanCreationException: Error creating bean with name 'org.openmrs.module.htmlformentry.handler.ConditionTagHandler#14f1e975': Injection of autowired dependencies failed; nested exception is org.springframework.beans.factory.BeanCreationException: Could not autowire field: private org.openmrs.module.htmlformentry.handler.ConditionTagHandlerSupport org.openmrs.module.htmlformentry.handler.ConditionTagHandler.handler; nested exception is org.springframework.beans.factory.NoSuchBeanDefinitionException: No qualifying bean of type [org.openmrs.module.htmlformentry.handler.ConditionTagHandlerSupport] found for dependency: expected at least 1 bean which qualifies as autowire candidate for this dependency. Dependency annotations: {@org.springframework.beans.factory.annotation.Autowired(required=true)}
  848. at org.springframework.beans.factory.annotation.AutowiredAnnotationBeanPostProcessor.postProcessPropertyValues(AutowiredAnnotationBeanPostProcessor.java:334)
  849. at org.springframework.beans.factory.support.AbstractAutowireCapableBeanFactory.populateBean(AbstractAutowireCapableBeanFactory.java:1202)
  850. at org.springframework.beans.factory.support.AbstractAutowireCapableBeanFactory.doCreateBean(AbstractAutowireCapableBeanFactory.java:537)
  851. at org.springframework.beans.factory.support.AbstractAutowireCapableBeanFactory.createBean(AbstractAutowireCapableBeanFactory.java:476)
  852. at org.springframework.beans.factory.support.AbstractBeanFactory$1.getObject(AbstractBeanFactory.java:303)
  853. at org.springframework.beans.factory.support.DefaultSingletonBeanRegistry.getSingleton(DefaultSingletonBeanRegistry.java:230)
  854. at org.springframework.beans.factory.support.AbstractBeanFactory.doGetBean(AbstractBeanFactory.java:299)
  855. at org.springframework.beans.factory.support.AbstractBeanFactory.getBean(AbstractBeanFactory.java:194)
  856. at org.springframework.beans.factory.support.DefaultListableBeanFactory.preInstantiateSingletons(DefaultListableBeanFactory.java:762)
  857. at org.springframework.context.support.AbstractApplicationContext.finishBeanFactoryInitialization(AbstractApplicationContext.java:757)
  858. at org.springframework.context.support.AbstractApplicationContext.refresh(AbstractApplicationContext.java:480)
  859. at org.springframework.test.context.support.AbstractGenericContextLoader.loadContext(AbstractGenericContextLoader.java:125)
  860. at org.springframework.test.context.support.AbstractGenericContextLoader.loadContext(AbstractGenericContextLoader.java:60)
  861. at org.springframework.test.context.support.AbstractDelegatingSmartContextLoader.delegateLoading(AbstractDelegatingSmartContextLoader.java:109)
  862. at org.springframework.test.context.support.AbstractDelegatingSmartContextLoader.loadContext(AbstractDelegatingSmartContextLoader.java:261)
  863. at org.springframework.test.context.DefaultCacheAwareContextLoaderDelegate.loadContextInternal(DefaultCacheAwareContextLoaderDelegate.java:68)
  864. at org.springframework.test.context.DefaultCacheAwareContextLoaderDelegate.loadContext(DefaultCacheAwareContextLoaderDelegate.java:86)
  865. ... 32 more
  866. Caused by: org.springframework.beans.factory.BeanCreationException: Could not autowire field: org.openmrs.module.htmlformentry.HtmlFormEntryService org.openmrs.module.htmlformentryui.converter.StringToHtmlFormConverter.htmlFormEntryService; nested exception is org.springframework.beans.factory.NoSuchBeanDefinitionException: No qualifying bean of type [org.openmrs.module.htmlformentry.HtmlFormEntryService] found for dependency: expected at least 1 bean which qualifies as autowire candidate for this dependency. Dependency annotations: {@org.springframework.beans.factory.annotation.Autowired(required=true), @org.springframework.beans.factory.annotation.Qualifier(value=htmlFormEntryService)}
  867. at org.springframework.beans.factory.annotation.AutowiredAnnotationBeanPostProcessor$AutowiredFieldElement.inject(AutowiredAnnotationBeanPostProcessor.java:561)
  868. at org.springframework.beans.factory.annotation.InjectionMetadata.inject(InjectionMetadata.java:88)
  869. at org.springframework.beans.factory.annotation.AutowiredAnnotationBeanPostProcessor.postProcessPropertyValues(AutowiredAnnotationBeanPostProcessor.java:331)
  870. ... 48 more
  871. Caused by: org.springframework.beans.factory.NoSuchBeanDefinitionException: No qualifying bean of type [org.openmrs.module.htmlformentry.HtmlFormEntryService] found for dependency: expected at least 1 bean which qualifies as autowire candidate for this dependency. Dependency annotations: {@org.springframework.beans.factory.annotation.Autowired(required=true), @org.springframework.beans.factory.annotation.Qualifier(value=htmlFormEntryService)}
  872. at org.springframework.beans.factory.support.DefaultListableBeanFactory.raiseNoSuchBeanDefinitionException(DefaultListableBeanFactory.java:1308)
  873. at org.springframework.beans.factory.support.DefaultListableBeanFactory.doResolveDependency(DefaultListableBeanFactory.java:1054)
  874. at org.springframework.beans.factory.support.DefaultListableBeanFactory.resolveDependency(DefaultListableBeanFactory.java:949)
  875. at org.springframework.beans.factory.annotation.AutowiredAnnotationBeanPostProcessor$AutowiredFieldElement.inject(AutowiredAnnotationBeanPostProcessor.java:533)
  876. ... 50 more
  877.  
  878. patientsWithMissingTBNumbersTest(org.openmrs.module.aijar.dataintegrity.InvalidTBEncountersTest) Time elapsed: 0 sec <<< ERROR!
  879. java.lang.IllegalStateException: Failed to load ApplicationContext
  880. at org.springframework.test.context.DefaultCacheAwareContextLoaderDelegate.loadContext(DefaultCacheAwareContextLoaderDelegate.java:94)
  881. at org.springframework.test.context.DefaultTestContext.getApplicationContext(DefaultTestContext.java:72)
  882. at org.springframework.test.context.support.DependencyInjectionTestExecutionListener.injectDependencies(DependencyInjectionTestExecutionListener.java:117)
  883. at org.springframework.test.context.support.DependencyInjectionTestExecutionListener.prepareTestInstance(DependencyInjectionTestExecutionListener.java:83)
  884. at org.springframework.test.context.TestContextManager.prepareTestInstance(TestContextManager.java:212)
  885. at org.springframework.test.context.junit4.SpringJUnit4ClassRunner.createTest(SpringJUnit4ClassRunner.java:200)
  886. at org.springframework.test.context.junit4.SpringJUnit4ClassRunner$1.runReflectiveCall(SpringJUnit4ClassRunner.java:252)
  887. at org.junit.internal.runners.model.ReflectiveCallable.run(ReflectiveCallable.java:12)
  888. at org.springframework.test.context.junit4.SpringJUnit4ClassRunner.methodBlock(SpringJUnit4ClassRunner.java:254)
  889. at org.springframework.test.context.junit4.SpringJUnit4ClassRunner.runChild(SpringJUnit4ClassRunner.java:217)
  890. at org.springframework.test.context.junit4.SpringJUnit4ClassRunner.runChild(SpringJUnit4ClassRunner.java:83)
  891. at org.junit.runners.ParentRunner$3.run(ParentRunner.java:290)
  892. at org.junit.runners.ParentRunner$1.schedule(ParentRunner.java:71)
  893. at org.junit.runners.ParentRunner.runChildren(ParentRunner.java:288)
  894. at org.junit.runners.ParentRunner.access$000(ParentRunner.java:58)
  895. at org.junit.runners.ParentRunner$2.evaluate(ParentRunner.java:268)
  896. at org.springframework.test.context.junit4.statements.RunBeforeTestClassCallbacks.evaluate(RunBeforeTestClassCallbacks.java:61)
  897. at org.junit.internal.runners.statements.RunAfters.evaluate(RunAfters.java:27)
  898. at org.springframework.test.context.junit4.statements.RunAfterTestClassCallbacks.evaluate(RunAfterTestClassCallbacks.java:68)
  899. at org.junit.runners.ParentRunner.run(ParentRunner.java:363)
  900. at org.springframework.test.context.junit4.SpringJUnit4ClassRunner.run(SpringJUnit4ClassRunner.java:163)
  901. at org.apache.maven.surefire.junit4.JUnit4Provider.execute(JUnit4Provider.java:252)
  902. at org.apache.maven.surefire.junit4.JUnit4Provider.executeTestSet(JUnit4Provider.java:141)
  903. at org.apache.maven.surefire.junit4.JUnit4Provider.invoke(JUnit4Provider.java:112)
  904. at sun.reflect.NativeMethodAccessorImpl.invoke0(Native Method)
  905. at sun.reflect.NativeMethodAccessorImpl.invoke(NativeMethodAccessorImpl.java:62)
  906. at sun.reflect.DelegatingMethodAccessorImpl.invoke(DelegatingMethodAccessorImpl.java:43)
  907. at java.lang.reflect.Method.invoke(Method.java:498)
  908. at org.apache.maven.surefire.util.ReflectionUtils.invokeMethodWithArray(ReflectionUtils.java:189)
  909. at org.apache.maven.surefire.booter.ProviderFactory$ProviderProxy.invoke(ProviderFactory.java:165)
  910. at org.apache.maven.surefire.booter.ProviderFactory.invokeProvider(ProviderFactory.java:85)
  911. at org.apache.maven.surefire.booter.ForkedBooter.runSuitesInProcess(ForkedBooter.java:115)
  912. at org.apache.maven.surefire.booter.ForkedBooter.main(ForkedBooter.java:75)
  913. Caused by: org.springframework.beans.factory.BeanCreationException: Error creating bean with name 'stringToHtmlFormConverter': Injection of autowired dependencies failed; nested exception is org.springframework.beans.factory.BeanCreationException: Could not autowire field: org.openmrs.module.htmlformentry.HtmlFormEntryService org.openmrs.module.htmlformentryui.converter.StringToHtmlFormConverter.htmlFormEntryService; nested exception is org.springframework.beans.factory.NoSuchBeanDefinitionException: No qualifying bean of type [org.openmrs.module.htmlformentry.HtmlFormEntryService] found for dependency: expected at least 1 bean which qualifies as autowire candidate for this dependency. Dependency annotations: {@org.springframework.beans.factory.annotation.Autowired(required=true), @org.springframework.beans.factory.annotation.Qualifier(value=htmlFormEntryService)}
  914. Related cause: org.springframework.beans.factory.BeanCreationException: Error creating bean with name 'htmlFormEntryService' defined in URL [jar:file:/C:/Users/lenovo/.m2/repository/org/openmrs/module/htmlformentry-api/3.11.0/htmlformentry-api-3.11.0.jar!/moduleApplicationContext.xml]: Cannot create inner bean 'org.openmrs.module.htmlformentry.impl.HtmlFormEntryServiceImpl#467c7c34' of type [org.openmrs.module.htmlformentry.impl.HtmlFormEntryServiceImpl] while setting bean property 'target'; nested exception is org.springframework.beans.factory.BeanCreationException: Error creating bean with name 'org.openmrs.module.htmlformentry.impl.HtmlFormEntryServiceImpl#467c7c34' defined in URL [jar:file:/C:/Users/lenovo/.m2/repository/org/openmrs/module/htmlformentry-api/3.11.0/htmlformentry-api-3.11.0.jar!/moduleApplicationContext.xml]: Cannot create inner bean 'org.openmrs.module.htmlformentry.handler.ConditionTagHandler#505894c9' of type [org.openmrs.module.htmlformentry.handler.ConditionTagHandler] while setting bean property 'handlers' with key [TypedStringValue: value [condition], target type [null]]; nested exception is org.springframework.beans.factory.BeanCreationException: Error creating bean with name 'org.openmrs.module.htmlformentry.handler.ConditionTagHandler#505894c9': Injection of autowired dependencies failed; nested exception is org.springframework.beans.factory.BeanCreationException: Could not autowire field: private org.openmrs.module.htmlformentry.handler.ConditionTagHandlerSupport org.openmrs.module.htmlformentry.handler.ConditionTagHandler.handler; nested exception is org.springframework.beans.factory.NoSuchBeanDefinitionException: No qualifying bean of type [org.openmrs.module.htmlformentry.handler.ConditionTagHandlerSupport] found for dependency: expected at least 1 bean which qualifies as autowire candidate for this dependency. Dependency annotations: {@org.springframework.beans.factory.annotation.Autowired(required=true)}
  915. at org.springframework.beans.factory.annotation.AutowiredAnnotationBeanPostProcessor.postProcessPropertyValues(AutowiredAnnotationBeanPostProcessor.java:334)
  916. at org.springframework.beans.factory.support.AbstractAutowireCapableBeanFactory.populateBean(AbstractAutowireCapableBeanFactory.java:1202)
  917. at org.springframework.beans.factory.support.AbstractAutowireCapableBeanFactory.doCreateBean(AbstractAutowireCapableBeanFactory.java:537)
  918. at org.springframework.beans.factory.support.AbstractAutowireCapableBeanFactory.createBean(AbstractAutowireCapableBeanFactory.java:476)
  919. at org.springframework.beans.factory.support.AbstractBeanFactory$1.getObject(AbstractBeanFactory.java:303)
  920. at org.springframework.beans.factory.support.DefaultSingletonBeanRegistry.getSingleton(DefaultSingletonBeanRegistry.java:230)
  921. at org.springframework.beans.factory.support.AbstractBeanFactory.doGetBean(AbstractBeanFactory.java:299)
  922. at org.springframework.beans.factory.support.AbstractBeanFactory.getBean(AbstractBeanFactory.java:194)
  923. at org.springframework.beans.factory.support.DefaultListableBeanFactory.preInstantiateSingletons(DefaultListableBeanFactory.java:762)
  924. at org.springframework.context.support.AbstractApplicationContext.finishBeanFactoryInitialization(AbstractApplicationContext.java:757)
  925. at org.springframework.context.support.AbstractApplicationContext.refresh(AbstractApplicationContext.java:480)
  926. at org.springframework.test.context.support.AbstractGenericContextLoader.loadContext(AbstractGenericContextLoader.java:125)
  927. at org.springframework.test.context.support.AbstractGenericContextLoader.loadContext(AbstractGenericContextLoader.java:60)
  928. at org.springframework.test.context.support.AbstractDelegatingSmartContextLoader.delegateLoading(AbstractDelegatingSmartContextLoader.java:109)
  929. at org.springframework.test.context.support.AbstractDelegatingSmartContextLoader.loadContext(AbstractDelegatingSmartContextLoader.java:261)
  930. at org.springframework.test.context.DefaultCacheAwareContextLoaderDelegate.loadContextInternal(DefaultCacheAwareContextLoaderDelegate.java:68)
  931. at org.springframework.test.context.DefaultCacheAwareContextLoaderDelegate.loadContext(DefaultCacheAwareContextLoaderDelegate.java:86)
  932. ... 32 more
  933. Caused by: org.springframework.beans.factory.BeanCreationException: Could not autowire field: org.openmrs.module.htmlformentry.HtmlFormEntryService org.openmrs.module.htmlformentryui.converter.StringToHtmlFormConverter.htmlFormEntryService; nested exception is org.springframework.beans.factory.NoSuchBeanDefinitionException: No qualifying bean of type [org.openmrs.module.htmlformentry.HtmlFormEntryService] found for dependency: expected at least 1 bean which qualifies as autowire candidate for this dependency. Dependency annotations: {@org.springframework.beans.factory.annotation.Autowired(required=true), @org.springframework.beans.factory.annotation.Qualifier(value=htmlFormEntryService)}
  934. at org.springframework.beans.factory.annotation.AutowiredAnnotationBeanPostProcessor$AutowiredFieldElement.inject(AutowiredAnnotationBeanPostProcessor.java:561)
  935. at org.springframework.beans.factory.annotation.InjectionMetadata.inject(InjectionMetadata.java:88)
  936. at org.springframework.beans.factory.annotation.AutowiredAnnotationBeanPostProcessor.postProcessPropertyValues(AutowiredAnnotationBeanPostProcessor.java:331)
  937. ... 48 more
  938. Caused by: org.springframework.beans.factory.NoSuchBeanDefinitionException: No qualifying bean of type [org.openmrs.module.htmlformentry.HtmlFormEntryService] found for dependency: expected at least 1 bean which qualifies as autowire candidate for this dependency. Dependency annotations: {@org.springframework.beans.factory.annotation.Autowired(required=true), @org.springframework.beans.factory.annotation.Qualifier(value=htmlFormEntryService)}
  939. at org.springframework.beans.factory.support.DefaultListableBeanFactory.raiseNoSuchBeanDefinitionException(DefaultListableBeanFactory.java:1308)
  940. at org.springframework.beans.factory.support.DefaultListableBeanFactory.doResolveDependency(DefaultListableBeanFactory.java:1054)
  941. at org.springframework.beans.factory.support.DefaultListableBeanFactory.resolveDependency(DefaultListableBeanFactory.java:949)
  942. at org.springframework.beans.factory.annotation.AutowiredAnnotationBeanPostProcessor$AutowiredFieldElement.inject(AutowiredAnnotationBeanPostProcessor.java:533)
  943. ... 50 more
  944.  
  945. Running org.openmrs.module.aijar.identifier.EIDIdentifierValidatorTest
  946. Tests run: 22, Failures: 0, Errors: 0, Skipped: 0, Time elapsed: 0.129 sec
  947. Running org.openmrs.module.aijar.identifier.NINIdentifierValidatorTest
  948. Tests run: 9, Failures: 0, Errors: 0, Skipped: 0, Time elapsed: 0.012 sec
  949. Running org.openmrs.module.aijar.RolePrivilegeImportTest
  950. Tests run: 1, Failures: 0, Errors: 1, Skipped: 0, Time elapsed: 8.053 sec <<< FAILURE!
  951. shouldImportWithOutAnyError(org.openmrs.module.aijar.RolePrivilegeImportTest) Time elapsed: 0.001 sec <<< ERROR!
  952. java.lang.IllegalStateException: Failed to load ApplicationContext
  953. at org.springframework.test.context.DefaultCacheAwareContextLoaderDelegate.loadContext(DefaultCacheAwareContextLoaderDelegate.java:94)
  954. at org.springframework.test.context.DefaultTestContext.getApplicationContext(DefaultTestContext.java:72)
  955. at org.springframework.test.context.support.DependencyInjectionTestExecutionListener.injectDependencies(DependencyInjectionTestExecutionListener.java:117)
  956. at org.springframework.test.context.support.DependencyInjectionTestExecutionListener.prepareTestInstance(DependencyInjectionTestExecutionListener.java:83)
  957. at org.springframework.test.context.TestContextManager.prepareTestInstance(TestContextManager.java:212)
  958. at org.springframework.test.context.junit4.SpringJUnit4ClassRunner.createTest(SpringJUnit4ClassRunner.java:200)
  959. at org.springframework.test.context.junit4.SpringJUnit4ClassRunner$1.runReflectiveCall(SpringJUnit4ClassRunner.java:252)
  960. at org.junit.internal.runners.model.ReflectiveCallable.run(ReflectiveCallable.java:12)
  961. at org.springframework.test.context.junit4.SpringJUnit4ClassRunner.methodBlock(SpringJUnit4ClassRunner.java:254)
  962. at org.springframework.test.context.junit4.SpringJUnit4ClassRunner.runChild(SpringJUnit4ClassRunner.java:217)
  963. at org.springframework.test.context.junit4.SpringJUnit4ClassRunner.runChild(SpringJUnit4ClassRunner.java:83)
  964. at org.junit.runners.ParentRunner$3.run(ParentRunner.java:290)
  965. at org.junit.runners.ParentRunner$1.schedule(ParentRunner.java:71)
  966. at org.junit.runners.ParentRunner.runChildren(ParentRunner.java:288)
  967. at org.junit.runners.ParentRunner.access$000(ParentRunner.java:58)
  968. at org.junit.runners.ParentRunner$2.evaluate(ParentRunner.java:268)
  969. at org.springframework.test.context.junit4.statements.RunBeforeTestClassCallbacks.evaluate(RunBeforeTestClassCallbacks.java:61)
  970. at org.junit.internal.runners.statements.RunAfters.evaluate(RunAfters.java:27)
  971. at org.springframework.test.context.junit4.statements.RunAfterTestClassCallbacks.evaluate(RunAfterTestClassCallbacks.java:68)
  972. at org.junit.runners.ParentRunner.run(ParentRunner.java:363)
  973. at org.springframework.test.context.junit4.SpringJUnit4ClassRunner.run(SpringJUnit4ClassRunner.java:163)
  974. at org.apache.maven.surefire.junit4.JUnit4Provider.execute(JUnit4Provider.java:252)
  975. at org.apache.maven.surefire.junit4.JUnit4Provider.executeTestSet(JUnit4Provider.java:141)
  976. at org.apache.maven.surefire.junit4.JUnit4Provider.invoke(JUnit4Provider.java:112)
  977. at sun.reflect.NativeMethodAccessorImpl.invoke0(Native Method)
  978. at sun.reflect.NativeMethodAccessorImpl.invoke(NativeMethodAccessorImpl.java:62)
  979. at sun.reflect.DelegatingMethodAccessorImpl.invoke(DelegatingMethodAccessorImpl.java:43)
  980. at java.lang.reflect.Method.invoke(Method.java:498)
  981. at org.apache.maven.surefire.util.ReflectionUtils.invokeMethodWithArray(ReflectionUtils.java:189)
  982. at org.apache.maven.surefire.booter.ProviderFactory$ProviderProxy.invoke(ProviderFactory.java:165)
  983. at org.apache.maven.surefire.booter.ProviderFactory.invokeProvider(ProviderFactory.java:85)
  984. at org.apache.maven.surefire.booter.ForkedBooter.runSuitesInProcess(ForkedBooter.java:115)
  985. at org.apache.maven.surefire.booter.ForkedBooter.main(ForkedBooter.java:75)
  986. Caused by: org.springframework.beans.factory.BeanCreationException: Error creating bean with name 'stringToHtmlFormConverter': Injection of autowired dependencies failed; nested exception is org.springframework.beans.factory.BeanCreationException: Could not autowire field: org.openmrs.module.htmlformentry.HtmlFormEntryService org.openmrs.module.htmlformentryui.converter.StringToHtmlFormConverter.htmlFormEntryService; nested exception is org.springframework.beans.factory.NoSuchBeanDefinitionException: No qualifying bean of type [org.openmrs.module.htmlformentry.HtmlFormEntryService] found for dependency: expected at least 1 bean which qualifies as autowire candidate for this dependency. Dependency annotations: {@org.springframework.beans.factory.annotation.Autowired(required=true), @org.springframework.beans.factory.annotation.Qualifier(value=htmlFormEntryService)}
  987. Related cause: org.springframework.beans.factory.BeanCreationException: Error creating bean with name 'htmlFormEntryService' defined in URL [jar:file:/C:/Users/lenovo/.m2/repository/org/openmrs/module/htmlformentry-api/3.11.0/htmlformentry-api-3.11.0.jar!/moduleApplicationContext.xml]: Cannot create inner bean 'org.openmrs.module.htmlformentry.impl.HtmlFormEntryServiceImpl#16a6ca59' of type [org.openmrs.module.htmlformentry.impl.HtmlFormEntryServiceImpl] while setting bean property 'target'; nested exception is org.springframework.beans.factory.BeanCreationException: Error creating bean with name 'org.openmrs.module.htmlformentry.impl.HtmlFormEntryServiceImpl#16a6ca59' defined in URL [jar:file:/C:/Users/lenovo/.m2/repository/org/openmrs/module/htmlformentry-api/3.11.0/htmlformentry-api-3.11.0.jar!/moduleApplicationContext.xml]: Cannot create inner bean 'org.openmrs.module.htmlformentry.handler.ConditionTagHandler#2fbad8ae' of type [org.openmrs.module.htmlformentry.handler.ConditionTagHandler] while setting bean property 'handlers' with key [TypedStringValue: value [condition], target type [null]]; nested exception is org.springframework.beans.factory.BeanCreationException: Error creating bean with name 'org.openmrs.module.htmlformentry.handler.ConditionTagHandler#2fbad8ae': Injection of autowired dependencies failed; nested exception is org.springframework.beans.factory.BeanCreationException: Could not autowire field: private org.openmrs.module.htmlformentry.handler.ConditionTagHandlerSupport org.openmrs.module.htmlformentry.handler.ConditionTagHandler.handler; nested exception is org.springframework.beans.factory.NoSuchBeanDefinitionException: No qualifying bean of type [org.openmrs.module.htmlformentry.handler.ConditionTagHandlerSupport] found for dependency: expected at least 1 bean which qualifies as autowire candidate for this dependency. Dependency annotations: {@org.springframework.beans.factory.annotation.Autowired(required=true)}
  988. at org.springframework.beans.factory.annotation.AutowiredAnnotationBeanPostProcessor.postProcessPropertyValues(AutowiredAnnotationBeanPostProcessor.java:334)
  989. at org.springframework.beans.factory.support.AbstractAutowireCapableBeanFactory.populateBean(AbstractAutowireCapableBeanFactory.java:1202)
  990. at org.springframework.beans.factory.support.AbstractAutowireCapableBeanFactory.doCreateBean(AbstractAutowireCapableBeanFactory.java:537)
  991. at org.springframework.beans.factory.support.AbstractAutowireCapableBeanFactory.createBean(AbstractAutowireCapableBeanFactory.java:476)
  992. at org.springframework.beans.factory.support.AbstractBeanFactory$1.getObject(AbstractBeanFactory.java:303)
  993. at org.springframework.beans.factory.support.DefaultSingletonBeanRegistry.getSingleton(DefaultSingletonBeanRegistry.java:230)
  994. at org.springframework.beans.factory.support.AbstractBeanFactory.doGetBean(AbstractBeanFactory.java:299)
  995. at org.springframework.beans.factory.support.AbstractBeanFactory.getBean(AbstractBeanFactory.java:194)
  996. at org.springframework.beans.factory.support.DefaultListableBeanFactory.preInstantiateSingletons(DefaultListableBeanFactory.java:762)
  997. at org.springframework.context.support.AbstractApplicationContext.finishBeanFactoryInitialization(AbstractApplicationContext.java:757)
  998. at org.springframework.context.support.AbstractApplicationContext.refresh(AbstractApplicationContext.java:480)
  999. at org.springframework.test.context.support.AbstractGenericContextLoader.loadContext(AbstractGenericContextLoader.java:125)
  1000. at org.springframework.test.context.support.AbstractGenericContextLoader.loadContext(AbstractGenericContextLoader.java:60)
  1001. at org.springframework.test.context.support.AbstractDelegatingSmartContextLoader.delegateLoading(AbstractDelegatingSmartContextLoader.java:109)
  1002. at org.springframework.test.context.support.AbstractDelegatingSmartContextLoader.loadContext(AbstractDelegatingSmartContextLoader.java:261)
  1003. at org.springframework.test.context.DefaultCacheAwareContextLoaderDelegate.loadContextInternal(DefaultCacheAwareContextLoaderDelegate.java:68)
  1004. at org.springframework.test.context.DefaultCacheAwareContextLoaderDelegate.loadContext(DefaultCacheAwareContextLoaderDelegate.java:86)
  1005. ... 32 more
  1006. Caused by: org.springframework.beans.factory.BeanCreationException: Could not autowire field: org.openmrs.module.htmlformentry.HtmlFormEntryService org.openmrs.module.htmlformentryui.converter.StringToHtmlFormConverter.htmlFormEntryService; nested exception is org.springframework.beans.factory.NoSuchBeanDefinitionException: No qualifying bean of type [org.openmrs.module.htmlformentry.HtmlFormEntryService] found for dependency: expected at least 1 bean which qualifies as autowire candidate for this dependency. Dependency annotations: {@org.springframework.beans.factory.annotation.Autowired(required=true), @org.springframework.beans.factory.annotation.Qualifier(value=htmlFormEntryService)}
  1007. at org.springframework.beans.factory.annotation.AutowiredAnnotationBeanPostProcessor$AutowiredFieldElement.inject(AutowiredAnnotationBeanPostProcessor.java:561)
  1008. at org.springframework.beans.factory.annotation.InjectionMetadata.inject(InjectionMetadata.java:88)
  1009. at org.springframework.beans.factory.annotation.AutowiredAnnotationBeanPostProcessor.postProcessPropertyValues(AutowiredAnnotationBeanPostProcessor.java:331)
  1010. ... 48 more
  1011. Caused by: org.springframework.beans.factory.NoSuchBeanDefinitionException: No qualifying bean of type [org.openmrs.module.htmlformentry.HtmlFormEntryService] found for dependency: expected at least 1 bean which qualifies as autowire candidate for this dependency. Dependency annotations: {@org.springframework.beans.factory.annotation.Autowired(required=true), @org.springframework.beans.factory.annotation.Qualifier(value=htmlFormEntryService)}
  1012. at org.springframework.beans.factory.support.DefaultListableBeanFactory.raiseNoSuchBeanDefinitionException(DefaultListableBeanFactory.java:1308)
  1013. at org.springframework.beans.factory.support.DefaultListableBeanFactory.doResolveDependency(DefaultListableBeanFactory.java:1054)
  1014. at org.springframework.beans.factory.support.DefaultListableBeanFactory.resolveDependency(DefaultListableBeanFactory.java:949)
  1015. at org.springframework.beans.factory.annotation.AutowiredAnnotationBeanPostProcessor$AutowiredFieldElement.inject(AutowiredAnnotationBeanPostProcessor.java:533)
  1016. ... 50 more
  1017.  
  1018. Running org.openmrs.module.aijar.SettingsNotificationTest
  1019. Tests run: 2, Failures: 0, Errors: 2, Skipped: 0, Time elapsed: 10.22 sec <<< FAILURE!
  1020. shouldSaveAlert(org.openmrs.module.aijar.SettingsNotificationTest) Time elapsed: 0 sec <<< ERROR!
  1021. java.lang.IllegalStateException: Failed to load ApplicationContext
  1022. at org.springframework.test.context.DefaultCacheAwareContextLoaderDelegate.loadContext(DefaultCacheAwareContextLoaderDelegate.java:94)
  1023. at org.springframework.test.context.DefaultTestContext.getApplicationContext(DefaultTestContext.java:72)
  1024. at org.springframework.test.context.support.DependencyInjectionTestExecutionListener.injectDependencies(DependencyInjectionTestExecutionListener.java:117)
  1025. at org.springframework.test.context.support.DependencyInjectionTestExecutionListener.prepareTestInstance(DependencyInjectionTestExecutionListener.java:83)
  1026. at org.springframework.test.context.TestContextManager.prepareTestInstance(TestContextManager.java:212)
  1027. at org.springframework.test.context.junit4.SpringJUnit4ClassRunner.createTest(SpringJUnit4ClassRunner.java:200)
  1028. at org.springframework.test.context.junit4.SpringJUnit4ClassRunner$1.runReflectiveCall(SpringJUnit4ClassRunner.java:252)
  1029. at org.junit.internal.runners.model.ReflectiveCallable.run(ReflectiveCallable.java:12)
  1030. at org.springframework.test.context.junit4.SpringJUnit4ClassRunner.methodBlock(SpringJUnit4ClassRunner.java:254)
  1031. at org.springframework.test.context.junit4.SpringJUnit4ClassRunner.runChild(SpringJUnit4ClassRunner.java:217)
  1032. at org.springframework.test.context.junit4.SpringJUnit4ClassRunner.runChild(SpringJUnit4ClassRunner.java:83)
  1033. at org.junit.runners.ParentRunner$3.run(ParentRunner.java:290)
  1034. at org.junit.runners.ParentRunner$1.schedule(ParentRunner.java:71)
  1035. at org.junit.runners.ParentRunner.runChildren(ParentRunner.java:288)
  1036. at org.junit.runners.ParentRunner.access$000(ParentRunner.java:58)
  1037. at org.junit.runners.ParentRunner$2.evaluate(ParentRunner.java:268)
  1038. at org.springframework.test.context.junit4.statements.RunBeforeTestClassCallbacks.evaluate(RunBeforeTestClassCallbacks.java:61)
  1039. at org.junit.internal.runners.statements.RunAfters.evaluate(RunAfters.java:27)
  1040. at org.springframework.test.context.junit4.statements.RunAfterTestClassCallbacks.evaluate(RunAfterTestClassCallbacks.java:68)
  1041. at org.junit.runners.ParentRunner.run(ParentRunner.java:363)
  1042. at org.springframework.test.context.junit4.SpringJUnit4ClassRunner.run(SpringJUnit4ClassRunner.java:163)
  1043. at org.apache.maven.surefire.junit4.JUnit4Provider.execute(JUnit4Provider.java:252)
  1044. at org.apache.maven.surefire.junit4.JUnit4Provider.executeTestSet(JUnit4Provider.java:141)
  1045. at org.apache.maven.surefire.junit4.JUnit4Provider.invoke(JUnit4Provider.java:112)
  1046. at sun.reflect.NativeMethodAccessorImpl.invoke0(Native Method)
  1047. at sun.reflect.NativeMethodAccessorImpl.invoke(NativeMethodAccessorImpl.java:62)
  1048. at sun.reflect.DelegatingMethodAccessorImpl.invoke(DelegatingMethodAccessorImpl.java:43)
  1049. at java.lang.reflect.Method.invoke(Method.java:498)
  1050. at org.apache.maven.surefire.util.ReflectionUtils.invokeMethodWithArray(ReflectionUtils.java:189)
  1051. at org.apache.maven.surefire.booter.ProviderFactory$ProviderProxy.invoke(ProviderFactory.java:165)
  1052. at org.apache.maven.surefire.booter.ProviderFactory.invokeProvider(ProviderFactory.java:85)
  1053. at org.apache.maven.surefire.booter.ForkedBooter.runSuitesInProcess(ForkedBooter.java:115)
  1054. at org.apache.maven.surefire.booter.ForkedBooter.main(ForkedBooter.java:75)
  1055. Caused by: org.springframework.beans.factory.BeanCreationException: Error creating bean with name 'stringToHtmlFormConverter': Injection of autowired dependencies failed; nested exception is org.springframework.beans.factory.BeanCreationException: Could not autowire field: org.openmrs.module.htmlformentry.HtmlFormEntryService org.openmrs.module.htmlformentryui.converter.StringToHtmlFormConverter.htmlFormEntryService; nested exception is org.springframework.beans.factory.NoSuchBeanDefinitionException: No qualifying bean of type [org.openmrs.module.htmlformentry.HtmlFormEntryService] found for dependency: expected at least 1 bean which qualifies as autowire candidate for this dependency. Dependency annotations: {@org.springframework.beans.factory.annotation.Autowired(required=true), @org.springframework.beans.factory.annotation.Qualifier(value=htmlFormEntryService)}
  1056. Related cause: org.springframework.beans.factory.BeanCreationException: Error creating bean with name 'htmlFormEntryService' defined in URL [jar:file:/C:/Users/lenovo/.m2/repository/org/openmrs/module/htmlformentry-api/3.11.0/htmlformentry-api-3.11.0.jar!/moduleApplicationContext.xml]: Cannot create inner bean 'org.openmrs.module.htmlformentry.impl.HtmlFormEntryServiceImpl#36aa5bea' of type [org.openmrs.module.htmlformentry.impl.HtmlFormEntryServiceImpl] while setting bean property 'target'; nested exception is org.springframework.beans.factory.BeanCreationException: Error creating bean with name 'org.openmrs.module.htmlformentry.impl.HtmlFormEntryServiceImpl#36aa5bea' defined in URL [jar:file:/C:/Users/lenovo/.m2/repository/org/openmrs/module/htmlformentry-api/3.11.0/htmlformentry-api-3.11.0.jar!/moduleApplicationContext.xml]: Cannot create inner bean 'org.openmrs.module.htmlformentry.handler.ConditionTagHandler#c1d9096' of type [org.openmrs.module.htmlformentry.handler.ConditionTagHandler] while setting bean property 'handlers' with key [TypedStringValue: value [condition], target type [null]]; nested exception is org.springframework.beans.factory.BeanCreationException: Error creating bean with name 'org.openmrs.module.htmlformentry.handler.ConditionTagHandler#c1d9096': Injection of autowired dependencies failed; nested exception is org.springframework.beans.factory.BeanCreationException: Could not autowire field: private org.openmrs.module.htmlformentry.handler.ConditionTagHandlerSupport org.openmrs.module.htmlformentry.handler.ConditionTagHandler.handler; nested exception is org.springframework.beans.factory.NoSuchBeanDefinitionException: No qualifying bean of type [org.openmrs.module.htmlformentry.handler.ConditionTagHandlerSupport] found for dependency: expected at least 1 bean which qualifies as autowire candidate for this dependency. Dependency annotations: {@org.springframework.beans.factory.annotation.Autowired(required=true)}
  1057. at org.springframework.beans.factory.annotation.AutowiredAnnotationBeanPostProcessor.postProcessPropertyValues(AutowiredAnnotationBeanPostProcessor.java:334)
  1058. at org.springframework.beans.factory.support.AbstractAutowireCapableBeanFactory.populateBean(AbstractAutowireCapableBeanFactory.java:1202)
  1059. at org.springframework.beans.factory.support.AbstractAutowireCapableBeanFactory.doCreateBean(AbstractAutowireCapableBeanFactory.java:537)
  1060. at org.springframework.beans.factory.support.AbstractAutowireCapableBeanFactory.createBean(AbstractAutowireCapableBeanFactory.java:476)
  1061. at org.springframework.beans.factory.support.AbstractBeanFactory$1.getObject(AbstractBeanFactory.java:303)
  1062. at org.springframework.beans.factory.support.DefaultSingletonBeanRegistry.getSingleton(DefaultSingletonBeanRegistry.java:230)
  1063. at org.springframework.beans.factory.support.AbstractBeanFactory.doGetBean(AbstractBeanFactory.java:299)
  1064. at org.springframework.beans.factory.support.AbstractBeanFactory.getBean(AbstractBeanFactory.java:194)
  1065. at org.springframework.beans.factory.support.DefaultListableBeanFactory.preInstantiateSingletons(DefaultListableBeanFactory.java:762)
  1066. at org.springframework.context.support.AbstractApplicationContext.finishBeanFactoryInitialization(AbstractApplicationContext.java:757)
  1067. at org.springframework.context.support.AbstractApplicationContext.refresh(AbstractApplicationContext.java:480)
  1068. at org.springframework.test.context.support.AbstractGenericContextLoader.loadContext(AbstractGenericContextLoader.java:125)
  1069. at org.springframework.test.context.support.AbstractGenericContextLoader.loadContext(AbstractGenericContextLoader.java:60)
  1070. at org.springframework.test.context.support.AbstractDelegatingSmartContextLoader.delegateLoading(AbstractDelegatingSmartContextLoader.java:109)
  1071. at org.springframework.test.context.support.AbstractDelegatingSmartContextLoader.loadContext(AbstractDelegatingSmartContextLoader.java:261)
  1072. at org.springframework.test.context.DefaultCacheAwareContextLoaderDelegate.loadContextInternal(DefaultCacheAwareContextLoaderDelegate.java:68)
  1073. at org.springframework.test.context.DefaultCacheAwareContextLoaderDelegate.loadContext(DefaultCacheAwareContextLoaderDelegate.java:86)
  1074. ... 32 more
  1075. Caused by: org.springframework.beans.factory.BeanCreationException: Could not autowire field: org.openmrs.module.htmlformentry.HtmlFormEntryService org.openmrs.module.htmlformentryui.converter.StringToHtmlFormConverter.htmlFormEntryService; nested exception is org.springframework.beans.factory.NoSuchBeanDefinitionException: No qualifying bean of type [org.openmrs.module.htmlformentry.HtmlFormEntryService] found for dependency: expected at least 1 bean which qualifies as autowire candidate for this dependency. Dependency annotations: {@org.springframework.beans.factory.annotation.Autowired(required=true), @org.springframework.beans.factory.annotation.Qualifier(value=htmlFormEntryService)}
  1076. at org.springframework.beans.factory.annotation.AutowiredAnnotationBeanPostProcessor$AutowiredFieldElement.inject(AutowiredAnnotationBeanPostProcessor.java:561)
  1077. at org.springframework.beans.factory.annotation.InjectionMetadata.inject(InjectionMetadata.java:88)
  1078. at org.springframework.beans.factory.annotation.AutowiredAnnotationBeanPostProcessor.postProcessPropertyValues(AutowiredAnnotationBeanPostProcessor.java:331)
  1079. ... 48 more
  1080. Caused by: org.springframework.beans.factory.NoSuchBeanDefinitionException: No qualifying bean of type [org.openmrs.module.htmlformentry.HtmlFormEntryService] found for dependency: expected at least 1 bean which qualifies as autowire candidate for this dependency. Dependency annotations: {@org.springframework.beans.factory.annotation.Autowired(required=true), @org.springframework.beans.factory.annotation.Qualifier(value=htmlFormEntryService)}
  1081. at org.springframework.beans.factory.support.DefaultListableBeanFactory.raiseNoSuchBeanDefinitionException(DefaultListableBeanFactory.java:1308)
  1082. at org.springframework.beans.factory.support.DefaultListableBeanFactory.doResolveDependency(DefaultListableBeanFactory.java:1054)
  1083. at org.springframework.beans.factory.support.DefaultListableBeanFactory.resolveDependency(DefaultListableBeanFactory.java:949)
  1084. at org.springframework.beans.factory.annotation.AutowiredAnnotationBeanPostProcessor$AutowiredFieldElement.inject(AutowiredAnnotationBeanPostProcessor.java:533)
  1085. ... 50 more
  1086.  
  1087. shouldReturnSetGlobalProperty(org.openmrs.module.aijar.SettingsNotificationTest) Time elapsed: 0.001 sec <<< ERROR!
  1088. java.lang.IllegalStateException: Failed to load ApplicationContext
  1089. at org.springframework.test.context.DefaultCacheAwareContextLoaderDelegate.loadContext(DefaultCacheAwareContextLoaderDelegate.java:94)
  1090. at org.springframework.test.context.DefaultTestContext.getApplicationContext(DefaultTestContext.java:72)
  1091. at org.springframework.test.context.support.DependencyInjectionTestExecutionListener.injectDependencies(DependencyInjectionTestExecutionListener.java:117)
  1092. at org.springframework.test.context.support.DependencyInjectionTestExecutionListener.prepareTestInstance(DependencyInjectionTestExecutionListener.java:83)
  1093. at org.springframework.test.context.TestContextManager.prepareTestInstance(TestContextManager.java:212)
  1094. at org.springframework.test.context.junit4.SpringJUnit4ClassRunner.createTest(SpringJUnit4ClassRunner.java:200)
  1095. at org.springframework.test.context.junit4.SpringJUnit4ClassRunner$1.runReflectiveCall(SpringJUnit4ClassRunner.java:252)
  1096. at org.junit.internal.runners.model.ReflectiveCallable.run(ReflectiveCallable.java:12)
  1097. at org.springframework.test.context.junit4.SpringJUnit4ClassRunner.methodBlock(SpringJUnit4ClassRunner.java:254)
  1098. at org.springframework.test.context.junit4.SpringJUnit4ClassRunner.runChild(SpringJUnit4ClassRunner.java:217)
  1099. at org.springframework.test.context.junit4.SpringJUnit4ClassRunner.runChild(SpringJUnit4ClassRunner.java:83)
  1100. at org.junit.runners.ParentRunner$3.run(ParentRunner.java:290)
  1101. at org.junit.runners.ParentRunner$1.schedule(ParentRunner.java:71)
  1102. at org.junit.runners.ParentRunner.runChildren(ParentRunner.java:288)
  1103. at org.junit.runners.ParentRunner.access$000(ParentRunner.java:58)
  1104. at org.junit.runners.ParentRunner$2.evaluate(ParentRunner.java:268)
  1105. at org.springframework.test.context.junit4.statements.RunBeforeTestClassCallbacks.evaluate(RunBeforeTestClassCallbacks.java:61)
  1106. at org.junit.internal.runners.statements.RunAfters.evaluate(RunAfters.java:27)
  1107. at org.springframework.test.context.junit4.statements.RunAfterTestClassCallbacks.evaluate(RunAfterTestClassCallbacks.java:68)
  1108. at org.junit.runners.ParentRunner.run(ParentRunner.java:363)
  1109. at org.springframework.test.context.junit4.SpringJUnit4ClassRunner.run(SpringJUnit4ClassRunner.java:163)
  1110. at org.apache.maven.surefire.junit4.JUnit4Provider.execute(JUnit4Provider.java:252)
  1111. at org.apache.maven.surefire.junit4.JUnit4Provider.executeTestSet(JUnit4Provider.java:141)
  1112. at org.apache.maven.surefire.junit4.JUnit4Provider.invoke(JUnit4Provider.java:112)
  1113. at sun.reflect.NativeMethodAccessorImpl.invoke0(Native Method)
  1114. at sun.reflect.NativeMethodAccessorImpl.invoke(NativeMethodAccessorImpl.java:62)
  1115. at sun.reflect.DelegatingMethodAccessorImpl.invoke(DelegatingMethodAccessorImpl.java:43)
  1116. at java.lang.reflect.Method.invoke(Method.java:498)
  1117. at org.apache.maven.surefire.util.ReflectionUtils.invokeMethodWithArray(ReflectionUtils.java:189)
  1118. at org.apache.maven.surefire.booter.ProviderFactory$ProviderProxy.invoke(ProviderFactory.java:165)
  1119. at org.apache.maven.surefire.booter.ProviderFactory.invokeProvider(ProviderFactory.java:85)
  1120. at org.apache.maven.surefire.booter.ForkedBooter.runSuitesInProcess(ForkedBooter.java:115)
  1121. at org.apache.maven.surefire.booter.ForkedBooter.main(ForkedBooter.java:75)
  1122. Caused by: org.springframework.beans.factory.BeanCreationException: Error creating bean with name 'stringToHtmlFormConverter': Injection of autowired dependencies failed; nested exception is org.springframework.beans.factory.BeanCreationException: Could not autowire field: org.openmrs.module.htmlformentry.HtmlFormEntryService org.openmrs.module.htmlformentryui.converter.StringToHtmlFormConverter.htmlFormEntryService; nested exception is org.springframework.beans.factory.NoSuchBeanDefinitionException: No qualifying bean of type [org.openmrs.module.htmlformentry.HtmlFormEntryService] found for dependency: expected at least 1 bean which qualifies as autowire candidate for this dependency. Dependency annotations: {@org.springframework.beans.factory.annotation.Autowired(required=true), @org.springframework.beans.factory.annotation.Qualifier(value=htmlFormEntryService)}
  1123. Related cause: org.springframework.beans.factory.BeanCreationException: Error creating bean with name 'htmlFormEntryService' defined in URL [jar:file:/C:/Users/lenovo/.m2/repository/org/openmrs/module/htmlformentry-api/3.11.0/htmlformentry-api-3.11.0.jar!/moduleApplicationContext.xml]: Cannot create inner bean 'org.openmrs.module.htmlformentry.impl.HtmlFormEntryServiceImpl#99907a0' of type [org.openmrs.module.htmlformentry.impl.HtmlFormEntryServiceImpl] while setting bean property 'target'; nested exception is org.springframework.beans.factory.BeanCreationException: Error creating bean with name 'org.openmrs.module.htmlformentry.impl.HtmlFormEntryServiceImpl#99907a0' defined in URL [jar:file:/C:/Users/lenovo/.m2/repository/org/openmrs/module/htmlformentry-api/3.11.0/htmlformentry-api-3.11.0.jar!/moduleApplicationContext.xml]: Cannot create inner bean 'org.openmrs.module.htmlformentry.handler.ConditionTagHandler#2f94ca9d' of type [org.openmrs.module.htmlformentry.handler.ConditionTagHandler] while setting bean property 'handlers' with key [TypedStringValue: value [condition], target type [null]]; nested exception is org.springframework.beans.factory.BeanCreationException: Error creating bean with name 'org.openmrs.module.htmlformentry.handler.ConditionTagHandler#2f94ca9d': Injection of autowired dependencies failed; nested exception is org.springframework.beans.factory.BeanCreationException: Could not autowire field: private org.openmrs.module.htmlformentry.handler.ConditionTagHandlerSupport org.openmrs.module.htmlformentry.handler.ConditionTagHandler.handler; nested exception is org.springframework.beans.factory.NoSuchBeanDefinitionException: No qualifying bean of type [org.openmrs.module.htmlformentry.handler.ConditionTagHandlerSupport] found for dependency: expected at least 1 bean which qualifies as autowire candidate for this dependency. Dependency annotations: {@org.springframework.beans.factory.annotation.Autowired(required=true)}
  1124. at org.springframework.beans.factory.annotation.AutowiredAnnotationBeanPostProcessor.postProcessPropertyValues(AutowiredAnnotationBeanPostProcessor.java:334)
  1125. at org.springframework.beans.factory.support.AbstractAutowireCapableBeanFactory.populateBean(AbstractAutowireCapableBeanFactory.java:1202)
  1126. at org.springframework.beans.factory.support.AbstractAutowireCapableBeanFactory.doCreateBean(AbstractAutowireCapableBeanFactory.java:537)
  1127. at org.springframework.beans.factory.support.AbstractAutowireCapableBeanFactory.createBean(AbstractAutowireCapableBeanFactory.java:476)
  1128. at org.springframework.beans.factory.support.AbstractBeanFactory$1.getObject(AbstractBeanFactory.java:303)
  1129. at org.springframework.beans.factory.support.DefaultSingletonBeanRegistry.getSingleton(DefaultSingletonBeanRegistry.java:230)
  1130. at org.springframework.beans.factory.support.AbstractBeanFactory.doGetBean(AbstractBeanFactory.java:299)
  1131. at org.springframework.beans.factory.support.AbstractBeanFactory.getBean(AbstractBeanFactory.java:194)
  1132. at org.springframework.beans.factory.support.DefaultListableBeanFactory.preInstantiateSingletons(DefaultListableBeanFactory.java:762)
  1133. at org.springframework.context.support.AbstractApplicationContext.finishBeanFactoryInitialization(AbstractApplicationContext.java:757)
  1134. at org.spring
RAW Paste Data Copied