SHARE
TWEET

CMakeError.log

a guest Feb 4th, 2020 60 Never
Not a member of Pastebin yet? Sign Up, it unlocks many cool features!
  1. Performing C++ SOURCE FILE Test HAVE_X87_MATH failed with the following output:
  2. Change Dir: /home/vato/programs/code-art/build/CMakeFiles/CMakeTmp
  3.  
  4. Run Build Command:"/usr/bin/gmake" "cmTC_5c3b7/fast"
  5. /usr/bin/gmake -f CMakeFiles/cmTC_5c3b7.dir/build.make CMakeFiles/cmTC_5c3b7.dir/build
  6. gmake[1]: Verzeichnis „/home/vato/programs/code-art/build/CMakeFiles/CMakeTmp“ wird betreten
  7. Building CXX object CMakeFiles/cmTC_5c3b7.dir/src.cxx.o
  8. /usr/bin/c++    -std=c++11 -march=native -Werror=unused-label -DHAVE_X87_MATH   -o CMakeFiles/cmTC_5c3b7.dir/src.cxx.o -c /home/vato/programs/code-art/build/CMakeFiles/CMakeTmp/src.cxx
  9. /home/vato/programs/code-art/build/CMakeFiles/CMakeTmp/src.cxx:3:2: error: #error
  10.  #error
  11.   ^~~~~
  12. /home/vato/programs/code-art/build/CMakeFiles/CMakeTmp/src.cxx:7:2: error: #error
  13.  #error
  14.   ^~~~~
  15. gmake[1]: *** [CMakeFiles/cmTC_5c3b7.dir/build.make:66: CMakeFiles/cmTC_5c3b7.dir/src.cxx.o] Fehler 1
  16. gmake[1]: Verzeichnis „/home/vato/programs/code-art/build/CMakeFiles/CMakeTmp“ wird verlassen
  17. gmake: *** [Makefile:126: cmTC_5c3b7/fast] Fehler 2
  18.  
  19. Source file was:
  20.  
  21. #if !defined(__i386) && !defined(_M_IX86)
  22. #error
  23. #endif
  24.  
  25. #if defined(__SSE2__)
  26. #error
  27. #endif
  28.  
  29. int main()
  30. {
  31. }
  32.  
  33. Performing C++ SOURCE FILE Test HAVE_X86_SSE_MATH failed with the following output:
  34. Change Dir: /home/vato/programs/code-art/build/CMakeFiles/CMakeTmp
  35.  
  36. Run Build Command:"/usr/bin/gmake" "cmTC_4f8ac/fast"
  37. /usr/bin/gmake -f CMakeFiles/cmTC_4f8ac.dir/build.make CMakeFiles/cmTC_4f8ac.dir/build
  38. gmake[1]: Verzeichnis „/home/vato/programs/code-art/build/CMakeFiles/CMakeTmp“ wird betreten
  39. Building CXX object CMakeFiles/cmTC_4f8ac.dir/src.cxx.o
  40. /usr/bin/c++    -std=c++11 -march=native -Werror=unused-label -DHAVE_X86_SSE_MATH   -o CMakeFiles/cmTC_4f8ac.dir/src.cxx.o -c /home/vato/programs/code-art/build/CMakeFiles/CMakeTmp/src.cxx
  41. /home/vato/programs/code-art/build/CMakeFiles/CMakeTmp/src.cxx:3:2: error: #error
  42.  #error
  43.   ^~~~~
  44. gmake[1]: *** [CMakeFiles/cmTC_4f8ac.dir/build.make:66: CMakeFiles/cmTC_4f8ac.dir/src.cxx.o] Fehler 1
  45. gmake[1]: Verzeichnis „/home/vato/programs/code-art/build/CMakeFiles/CMakeTmp“ wird verlassen
  46. gmake: *** [Makefile:126: cmTC_4f8ac/fast] Fehler 2
  47.  
  48. Source file was:
  49.  
  50. #if !defined(__i386) && !defined(_M_IX86)
  51. #error
  52. #endif
  53.  
  54. #if !defined(__SSE2__)
  55. #error
  56. #endif
  57.  
  58. int main()
  59. {
  60. }
  61.  
  62. Performing C SOURCE FILE Test _fftw3f_multithread failed with the following output:
  63. Change Dir: /home/vato/programs/code-art/build/CMakeFiles/CMakeTmp
  64.  
  65. Run Build Command:"/usr/bin/gmake" "cmTC_a154b/fast"
  66. /usr/bin/gmake -f CMakeFiles/cmTC_a154b.dir/build.make CMakeFiles/cmTC_a154b.dir/build
  67. gmake[1]: Verzeichnis „/home/vato/programs/code-art/build/CMakeFiles/CMakeTmp“ wird betreten
  68. Building C object CMakeFiles/cmTC_a154b.dir/src.c.o
  69. /usr/bin/cc   -std=c11 -march=native -D_fftw3f_multithread   -o CMakeFiles/cmTC_a154b.dir/src.c.o   -c /home/vato/programs/code-art/build/CMakeFiles/CMakeTmp/src.c
  70. Linking C executable cmTC_a154b
  71. /usr/bin/cmake -E cmake_link_script CMakeFiles/cmTC_a154b.dir/link.txt --verbose=1
  72. /usr/bin/cc  -std=c11 -march=native -D_fftw3f_multithread    -rdynamic CMakeFiles/cmTC_a154b.dir/src.c.o  -o cmTC_a154b /usr/lib64/libfftw3f.so
  73. /usr/lib64/gcc/x86_64-suse-linux/7/../../../../x86_64-suse-linux/bin/ld: CMakeFiles/cmTC_a154b.dir/src.c.o: in function `main':
  74. src.c:(.text+0x5): undefined reference to `fftwf_init_threads'
  75. /usr/lib64/gcc/x86_64-suse-linux/7/../../../../x86_64-suse-linux/bin/ld: src.c:(.text+0xf): undefined reference to `fftwf_plan_with_nthreads'
  76. collect2: error: ld returned 1 exit status
  77. gmake[1]: *** [CMakeFiles/cmTC_a154b.dir/build.make:99: cmTC_a154b] Fehler 1
  78. gmake[1]: Verzeichnis „/home/vato/programs/code-art/build/CMakeFiles/CMakeTmp“ wird verlassen
  79. gmake: *** [Makefile:126: cmTC_a154b/fast] Fehler 2
  80.  
  81. Source file was:
  82. #include <fftw3.h>
  83. int main()
  84. {
  85.     fftwf_init_threads();
  86.     fftwf_plan_with_nthreads(1);
  87.     return 0;
  88. }
RAW Paste Data
We use cookies for various purposes including analytics. By continuing to use Pastebin, you agree to our use of cookies as described in the Cookies Policy. OK, I Understand
Top