daily pastebin goal
49%
SHARE
TWEET

Untitled

a guest Feb 13th, 2018 55 Never
Not a member of Pastebin yet? Sign Up, it unlocks many cool features!
  1. /Users/nico/daylight/build-oscosc-Android_for_armeabi_v7a_GCC_4_9_Qt_5_10_1_for_Android_armv7-Release/android-build/java/lang/String.java:31: error: package libcore.util does not exist
  2. import libcore.util.EmptyArray;
  3.                    ^
  4. /Users/nico/daylight/build-oscosc-Android_for_armeabi_v7a_GCC_4_9_Qt_5_10_1_for_Android_armv7-Release/android-build/java/lang/Class.java:35: error: package com.android.dex does not exist
  5. import com.android.dex.Dex;
  6.                       ^
  7. /Users/nico/daylight/build-oscosc-Android_for_armeabi_v7a_GCC_4_9_Qt_5_10_1_for_Android_armv7-Release/android-build/java/lang/Class.java:36: error: cannot find symbol
  8. import dalvik.system.VMStack;
  9.                     ^
  10.   symbol:   class VMStack
  11.   location: package dalvik.system
  12. /Users/nico/daylight/build-oscosc-Android_for_armeabi_v7a_GCC_4_9_Qt_5_10_1_for_Android_armv7-Release/android-build/java/lang/Class.java:58: error: package libcore.reflect does not exist
  13. import libcore.reflect.AnnotationAccess;
  14.                       ^
  15. /Users/nico/daylight/build-oscosc-Android_for_armeabi_v7a_GCC_4_9_Qt_5_10_1_for_Android_armv7-Release/android-build/java/lang/Class.java:59: error: package libcore.reflect does not exist
  16. import libcore.reflect.GenericSignatureParser;
  17.                       ^
  18. /Users/nico/daylight/build-oscosc-Android_for_armeabi_v7a_GCC_4_9_Qt_5_10_1_for_Android_armv7-Release/android-build/java/lang/Class.java:60: error: package libcore.reflect does not exist
  19. import libcore.reflect.InternalNames;
  20.                       ^
  21. /Users/nico/daylight/build-oscosc-Android_for_armeabi_v7a_GCC_4_9_Qt_5_10_1_for_Android_armv7-Release/android-build/java/lang/Class.java:61: error: package libcore.reflect does not exist
  22. import libcore.reflect.Types;
  23.                       ^
  24. /Users/nico/daylight/build-oscosc-Android_for_armeabi_v7a_GCC_4_9_Qt_5_10_1_for_Android_armv7-Release/android-build/java/lang/Class.java:62: error: package libcore.util does not exist
  25. import libcore.util.BasicLruCache;
  26.                    ^
  27. /Users/nico/daylight/build-oscosc-Android_for_armeabi_v7a_GCC_4_9_Qt_5_10_1_for_Android_armv7-Release/android-build/java/lang/Class.java:63: error: package libcore.util does not exist
  28. import libcore.util.CollectionUtils;
  29.                    ^
  30. /Users/nico/daylight/build-oscosc-Android_for_armeabi_v7a_GCC_4_9_Qt_5_10_1_for_Android_armv7-Release/android-build/java/lang/Class.java:64: error: package libcore.util does not exist
  31. import libcore.util.EmptyArray;
  32.                    ^
  33. /Users/nico/daylight/build-oscosc-Android_for_armeabi_v7a_GCC_4_9_Qt_5_10_1_for_Android_armv7-Release/android-build/java/lang/Class.java:65: error: package libcore.util does not exist
  34. import libcore.util.SneakyThrow;
  35.                    ^
  36. /Users/nico/daylight/build-oscosc-Android_for_armeabi_v7a_GCC_4_9_Qt_5_10_1_for_Android_armv7-Release/android-build/java/lang/Throwable.java:28: error: package libcore.util does not exist
  37. import libcore.util.EmptyArray;
  38.                    ^
  39. /Users/nico/daylight/build-oscosc-Android_for_armeabi_v7a_GCC_4_9_Qt_5_10_1_for_Android_armv7-Release/android-build/java/nio/charset/Charset.java:33: error: package libcore.icu does not exist
  40. import libcore.icu.NativeConverter;
  41.                   ^
  42. /Users/nico/daylight/build-oscosc-Android_for_armeabi_v7a_GCC_4_9_Qt_5_10_1_for_Android_armv7-Release/android-build/java/lang/AbstractStringBuilder.java:20: error: package libcore.util does not exist
  43. import libcore.util.EmptyArray;
  44.                    ^
  45. /Users/nico/daylight/build-oscosc-Android_for_armeabi_v7a_GCC_4_9_Qt_5_10_1_for_Android_armv7-Release/android-build/java/util/Locale.java:26: error: package libcore.icu does not exist
  46. import libcore.icu.ICU;
  47.                   ^
  48. /Users/nico/daylight/build-oscosc-Android_for_armeabi_v7a_GCC_4_9_Qt_5_10_1_for_Android_armv7-Release/android-build/java/io/InputStream.java:21: error: package libcore.io does not exist
  49. import libcore.io.Streams;
  50.                  ^
  51. /Users/nico/daylight/build-oscosc-Android_for_armeabi_v7a_GCC_4_9_Qt_5_10_1_for_Android_armv7-Release/android-build/java/io/File.java:29: error: package libcore.io does not exist
  52. import libcore.io.DeleteOnExit;
  53.                  ^
  54. /Users/nico/daylight/build-oscosc-Android_for_armeabi_v7a_GCC_4_9_Qt_5_10_1_for_Android_armv7-Release/android-build/java/io/File.java:30: error: package libcore.io does not exist
  55. import libcore.io.IoUtils;
  56.                  ^
  57. /Users/nico/daylight/build-oscosc-Android_for_armeabi_v7a_GCC_4_9_Qt_5_10_1_for_Android_armv7-Release/android-build/java/io/File.java:31: error: package libcore.io does not exist
  58. import libcore.io.Libcore;
  59.                  ^
  60. /Users/nico/daylight/build-oscosc-Android_for_armeabi_v7a_GCC_4_9_Qt_5_10_1_for_Android_armv7-Release/android-build/java/lang/DexCache.java:35: error: package com.android.dex does not exist
  61. import com.android.dex.Dex;
  62.                       ^
  63. /Users/nico/daylight/build-oscosc-Android_for_armeabi_v7a_GCC_4_9_Qt_5_10_1_for_Android_armv7-Release/android-build/java/lang/reflect/ArtMethod.java:35: error: package com.android.dex does not exist
  64. import com.android.dex.Dex;
  65.                       ^
  66. /Users/nico/daylight/build-oscosc-Android_for_armeabi_v7a_GCC_4_9_Qt_5_10_1_for_Android_armv7-Release/android-build/java/lang/reflect/ArtMethod.java:37: error: package libcore.reflect does not exist
  67. import libcore.reflect.AnnotationAccess;
  68.                       ^
  69. /Users/nico/daylight/build-oscosc-Android_for_armeabi_v7a_GCC_4_9_Qt_5_10_1_for_Android_armv7-Release/android-build/java/lang/reflect/ArtMethod.java:38: error: package libcore.util does not exist
  70. import libcore.util.EmptyArray;
  71.                    ^
  72. /Users/nico/daylight/build-oscosc-Android_for_armeabi_v7a_GCC_4_9_Qt_5_10_1_for_Android_armv7-Release/android-build/java/lang/reflect/ArtField.java:35: error: package com.android.dex does not exist
  73. import com.android.dex.Dex;
  74.                       ^
  75. /Users/nico/daylight/build-oscosc-Android_for_armeabi_v7a_GCC_4_9_Qt_5_10_1_for_Android_armv7-Release/android-build/java/lang/Class.java:445: error: cannot find symbol
  76.     public Dex getDex() {
  77.            ^
  78.   symbol:   class Dex
  79.   location: class Class<T>
  80.   where T is a type-variable:
  81.     T extends Object declared in class Class
  82. /Users/nico/daylight/build-oscosc-Android_for_armeabi_v7a_GCC_4_9_Qt_5_10_1_for_Android_armv7-Release/android-build/java/lang/Class.java:457: error: cannot find symbol
  83.     public String getDexCacheString(Dex dex, int dexStringIndex) {
  84.                                     ^
  85.   symbol:   class Dex
  86.   location: class Class<T>
  87.   where T is a type-variable:
  88.     T extends Object declared in class Class
  89. /Users/nico/daylight/build-oscosc-Android_for_armeabi_v7a_GCC_4_9_Qt_5_10_1_for_Android_armv7-Release/android-build/java/lang/Class.java:473: error: cannot find symbol
  90.     public Class<?> getDexCacheType(Dex dex, int dexTypeIndex) {
  91.                                     ^
  92.   symbol:   class Dex
  93.   location: class Class<T>
  94.   where T is a type-variable:
  95.     T extends Object declared in class Class
  96. /Users/nico/daylight/build-oscosc-Android_for_armeabi_v7a_GCC_4_9_Qt_5_10_1_for_Android_armv7-Release/android-build/java/lang/reflect/Constructor.java:35: error: package com.android.dex does not exist
  97. import com.android.dex.Dex;
  98.                       ^
  99. /Users/nico/daylight/build-oscosc-Android_for_armeabi_v7a_GCC_4_9_Qt_5_10_1_for_Android_armv7-Release/android-build/java/lang/reflect/Constructor.java:39: error: package libcore.reflect does not exist
  100. import libcore.reflect.AnnotationAccess;
  101.                       ^
  102. /Users/nico/daylight/build-oscosc-Android_for_armeabi_v7a_GCC_4_9_Qt_5_10_1_for_Android_armv7-Release/android-build/java/lang/reflect/Constructor.java:40: error: package libcore.reflect does not exist
  103. import libcore.reflect.Types;
  104.                       ^
  105. /Users/nico/daylight/build-oscosc-Android_for_armeabi_v7a_GCC_4_9_Qt_5_10_1_for_Android_armv7-Release/android-build/java/lang/reflect/AbstractMethod.java:35: error: package com.android.dex does not exist
  106. import com.android.dex.Dex;
  107.                       ^
  108. /Users/nico/daylight/build-oscosc-Android_for_armeabi_v7a_GCC_4_9_Qt_5_10_1_for_Android_armv7-Release/android-build/java/lang/reflect/AbstractMethod.java:38: error: package libcore.reflect does not exist
  109. import libcore.reflect.AnnotationAccess;
  110.                       ^
  111. /Users/nico/daylight/build-oscosc-Android_for_armeabi_v7a_GCC_4_9_Qt_5_10_1_for_Android_armv7-Release/android-build/java/lang/reflect/AbstractMethod.java:39: error: package libcore.reflect does not exist
  112. import libcore.reflect.GenericSignatureParser;
  113.                       ^
  114. /Users/nico/daylight/build-oscosc-Android_for_armeabi_v7a_GCC_4_9_Qt_5_10_1_for_Android_armv7-Release/android-build/java/lang/reflect/AbstractMethod.java:40: error: package libcore.reflect does not exist
  115. import libcore.reflect.ListOfTypes;
  116.                       ^
  117. /Users/nico/daylight/build-oscosc-Android_for_armeabi_v7a_GCC_4_9_Qt_5_10_1_for_Android_armv7-Release/android-build/java/lang/reflect/AbstractMethod.java:41: error: package libcore.reflect does not exist
  118. import libcore.reflect.Types;
  119.                       ^
  120. /Users/nico/daylight/build-oscosc-Android_for_armeabi_v7a_GCC_4_9_Qt_5_10_1_for_Android_armv7-Release/android-build/java/lang/reflect/Method.java:35: error: package com.android.dex does not exist
  121. import com.android.dex.Dex;
  122.                       ^
  123. /Users/nico/daylight/build-oscosc-Android_for_armeabi_v7a_GCC_4_9_Qt_5_10_1_for_Android_armv7-Release/android-build/java/lang/reflect/Method.java:39: error: package libcore.reflect does not exist
  124. import libcore.reflect.AnnotationAccess;
  125.                       ^
  126. /Users/nico/daylight/build-oscosc-Android_for_armeabi_v7a_GCC_4_9_Qt_5_10_1_for_Android_armv7-Release/android-build/java/lang/reflect/Method.java:40: error: package libcore.reflect does not exist
  127. import libcore.reflect.Types;
  128.                       ^
  129. /Users/nico/daylight/build-oscosc-Android_for_armeabi_v7a_GCC_4_9_Qt_5_10_1_for_Android_armv7-Release/android-build/java/lang/reflect/Field.java:35: error: package com.android.dex does not exist
  130. import com.android.dex.Dex;
  131.                       ^
  132. /Users/nico/daylight/build-oscosc-Android_for_armeabi_v7a_GCC_4_9_Qt_5_10_1_for_Android_armv7-Release/android-build/java/lang/reflect/Field.java:39: error: package libcore.reflect does not exist
  133. import libcore.reflect.AnnotationAccess;
  134.                       ^
  135. /Users/nico/daylight/build-oscosc-Android_for_armeabi_v7a_GCC_4_9_Qt_5_10_1_for_Android_armv7-Release/android-build/java/lang/reflect/Field.java:40: error: package libcore.reflect does not exist
  136. import libcore.reflect.GenericSignatureParser;
  137.                       ^
  138. /Users/nico/daylight/build-oscosc-Android_for_armeabi_v7a_GCC_4_9_Qt_5_10_1_for_Android_armv7-Release/android-build/java/lang/reflect/Field.java:41: error: package libcore.reflect does not exist
  139. import libcore.reflect.Types;
  140.                       ^
  141. /Users/nico/daylight/build-oscosc-Android_for_armeabi_v7a_GCC_4_9_Qt_5_10_1_for_Android_armv7-Release/android-build/java/net/URL.java:27: error: package libcore.net.url does not exist
  142. import libcore.net.url.FileHandler;
  143.                       ^
  144. /Users/nico/daylight/build-oscosc-Android_for_armeabi_v7a_GCC_4_9_Qt_5_10_1_for_Android_armv7-Release/android-build/java/net/URL.java:28: error: package libcore.net.url does not exist
  145. import libcore.net.url.FtpHandler;
  146.                       ^
  147. /Users/nico/daylight/build-oscosc-Android_for_armeabi_v7a_GCC_4_9_Qt_5_10_1_for_Android_armv7-Release/android-build/java/net/URL.java:29: error: package libcore.net.url does not exist
  148. import libcore.net.url.JarHandler;
  149.                       ^
  150. /Users/nico/daylight/build-oscosc-Android_for_armeabi_v7a_GCC_4_9_Qt_5_10_1_for_Android_armv7-Release/android-build/java/net/URL.java:30: error: package libcore.net.url does not exist
  151. import libcore.net.url.UrlUtils;
  152.                       ^
  153. /Users/nico/daylight/build-oscosc-Android_for_armeabi_v7a_GCC_4_9_Qt_5_10_1_for_Android_armv7-Release/android-build/java/lang/Package.java:35: error: cannot find symbol
  154. import dalvik.system.VMStack;
  155.                     ^
  156.   symbol:   class VMStack
  157.   location: package dalvik.system
  158. /Users/nico/daylight/build-oscosc-Android_for_armeabi_v7a_GCC_4_9_Qt_5_10_1_for_Android_armv7-Release/android-build/java/io/FilterOutputStream.java:21: error: package libcore.util does not exist
  159. import libcore.util.SneakyThrow;
  160.                    ^
  161. /Users/nico/daylight/build-oscosc-Android_for_armeabi_v7a_GCC_4_9_Qt_5_10_1_for_Android_armv7-Release/android-build/java/io/ObjectOutputStream.java:27: error: package libcore.io does not exist
  162. import libcore.io.Memory;
  163.                  ^
  164. /Users/nico/daylight/build-oscosc-Android_for_armeabi_v7a_GCC_4_9_Qt_5_10_1_for_Android_armv7-Release/android-build/java/io/ObjectOutputStream.java:28: error: package libcore.io does not exist
  165. import libcore.io.SizeOf;
  166.                  ^
  167. /Users/nico/daylight/build-oscosc-Android_for_armeabi_v7a_GCC_4_9_Qt_5_10_1_for_Android_armv7-Release/android-build/java/io/ObjectInputStream.java:20: error: cannot find symbol
  168. import dalvik.system.VMStack;
  169.                     ^
  170.   symbol:   class VMStack
  171.   location: package dalvik.system
  172. /Users/nico/daylight/build-oscosc-Android_for_armeabi_v7a_GCC_4_9_Qt_5_10_1_for_Android_armv7-Release/android-build/java/io/ObjectInputStream.java:31: error: package libcore.util does not exist
  173. import libcore.util.EmptyArray;
  174.                    ^
  175. /Users/nico/daylight/build-oscosc-Android_for_armeabi_v7a_GCC_4_9_Qt_5_10_1_for_Android_armv7-Release/android-build/java/util/HashMap.java:26: error: package libcore.util does not exist
  176. import libcore.util.Objects;
  177.                    ^
  178. /Users/nico/daylight/build-oscosc-Android_for_armeabi_v7a_GCC_4_9_Qt_5_10_1_for_Android_armv7-Release/android-build/java/nio/ByteBuffer.java:21: error: package libcore.io does not exist
  179. import libcore.io.Memory;
  180.                  ^
  181. /Users/nico/daylight/build-oscosc-Android_for_armeabi_v7a_GCC_4_9_Qt_5_10_1_for_Android_armv7-Release/android-build/java/lang/Enum.java:22: error: package libcore.util does not exist
  182. import libcore.util.BasicLruCache;
  183.                    ^
  184. /Users/nico/daylight/build-oscosc-Android_for_armeabi_v7a_GCC_4_9_Qt_5_10_1_for_Android_armv7-Release/android-build/java/lang/Enum.java:23: error: package libcore.util does not exist
  185. import libcore.util.EmptyArray;
  186.                    ^
  187. /Users/nico/daylight/build-oscosc-Android_for_armeabi_v7a_GCC_4_9_Qt_5_10_1_for_Android_armv7-Release/android-build/java/util/TreeMap.java:27: error: package libcore.util does not exist
  188. import libcore.util.Objects;
  189.                    ^
  190. /Users/nico/daylight/build-oscosc-Android_for_armeabi_v7a_GCC_4_9_Qt_5_10_1_for_Android_armv7-Release/android-build/java/net/URI.java:25: error: package libcore.net does not exist
  191. import libcore.net.UriCodec;
  192.                   ^
  193. /Users/nico/daylight/build-oscosc-Android_for_armeabi_v7a_GCC_4_9_Qt_5_10_1_for_Android_armv7-Release/android-build/java/net/URI.java:26: error: package libcore.net.url does not exist
  194. import libcore.net.url.UrlUtils;
  195.                       ^
  196. /Users/nico/daylight/build-oscosc-Android_for_armeabi_v7a_GCC_4_9_Qt_5_10_1_for_Android_armv7-Release/android-build/java/lang/DexCache.java:44: error: cannot find symbol
  197.     private volatile Dex dex;
  198.                      ^
  199.   symbol:   class Dex
  200.   location: class DexCache
  201. /Users/nico/daylight/build-oscosc-Android_for_armeabi_v7a_GCC_4_9_Qt_5_10_1_for_Android_armv7-Release/android-build/java/lang/DexCache.java:79: error: cannot find symbol
  202.     Dex getDex() {
  203.     ^
  204.   symbol:   class Dex
  205.   location: class DexCache
  206. /Users/nico/daylight/build-oscosc-Android_for_armeabi_v7a_GCC_4_9_Qt_5_10_1_for_Android_armv7-Release/android-build/java/lang/DexCache.java:92: error: cannot find symbol
  207.     private native Dex getDexNative();
  208.                    ^
  209.   symbol:   class Dex
  210.   location: class DexCache
  211. /Users/nico/daylight/build-oscosc-Android_for_armeabi_v7a_GCC_4_9_Qt_5_10_1_for_Android_armv7-Release/android-build/java/lang/reflect/ArtMethod.java:212: error: cannot find symbol
  212.     private String getDexCacheString(Dex dex, int dexStringIndex) {
  213.                                      ^
  214.   symbol:   class Dex
  215.   location: class ArtMethod
  216. /Users/nico/daylight/build-oscosc-Android_for_armeabi_v7a_GCC_4_9_Qt_5_10_1_for_Android_armv7-Release/android-build/java/lang/reflect/ArtMethod.java:226: error: cannot find symbol
  217.     private Class<?> getDexCacheType(Dex dex, int dexTypeIndex) {
  218.                                      ^
  219.   symbol:   class Dex
  220.   location: class ArtMethod
  221. /Users/nico/daylight/build-oscosc-Android_for_armeabi_v7a_GCC_4_9_Qt_5_10_1_for_Android_armv7-Release/android-build/java/net/URLStreamHandler.java:21: error: package libcore.net.url does not exist
  222. import libcore.net.url.UrlUtils;
  223.                       ^
  224. /Users/nico/daylight/build-oscosc-Android_for_armeabi_v7a_GCC_4_9_Qt_5_10_1_for_Android_armv7-Release/android-build/java/net/URLStreamHandler.java:22: error: package libcore.util does not exist
  225. import libcore.util.Objects;
  226.                    ^
  227. /Users/nico/daylight/build-oscosc-Android_for_armeabi_v7a_GCC_4_9_Qt_5_10_1_for_Android_armv7-Release/android-build/java/io/DataOutputStream.java:22: error: package libcore.io does not exist
  228. import libcore.io.Memory;
  229.                  ^
  230. /Users/nico/daylight/build-oscosc-Android_for_armeabi_v7a_GCC_4_9_Qt_5_10_1_for_Android_armv7-Release/android-build/java/io/DataOutputStream.java:23: error: package libcore.io does not exist
  231. import libcore.io.SizeOf;
  232.                  ^
  233. /Users/nico/daylight/build-oscosc-Android_for_armeabi_v7a_GCC_4_9_Qt_5_10_1_for_Android_armv7-Release/android-build/java/io/ObjectStreamClass.java:35: error: package libcore.io does not exist
  234. import libcore.io.Memory;
  235.                  ^
  236. /Users/nico/daylight/build-oscosc-Android_for_armeabi_v7a_GCC_4_9_Qt_5_10_1_for_Android_armv7-Release/android-build/java/io/ObjectStreamClass.java:36: error: package libcore.util does not exist
  237. import libcore.util.EmptyArray;
  238.                    ^
  239. /Users/nico/daylight/build-oscosc-Android_for_armeabi_v7a_GCC_4_9_Qt_5_10_1_for_Android_armv7-Release/android-build/java/io/DataInputStream.java:22: error: package libcore.io does not exist
  240. import libcore.io.Memory;
  241.                  ^
  242. /Users/nico/daylight/build-oscosc-Android_for_armeabi_v7a_GCC_4_9_Qt_5_10_1_for_Android_armv7-Release/android-build/java/io/DataInputStream.java:23: error: package libcore.io does not exist
  243. import libcore.io.Streams;
  244.                  ^
  245. /Users/nico/daylight/build-oscosc-Android_for_armeabi_v7a_GCC_4_9_Qt_5_10_1_for_Android_armv7-Release/android-build/java/io/DataInputStream.java:24: error: package libcore.io does not exist
  246. import libcore.io.SizeOf;
  247.                  ^
  248. /Users/nico/daylight/build-oscosc-Android_for_armeabi_v7a_GCC_4_9_Qt_5_10_1_for_Android_armv7-Release/android-build/java/util/ArrayList.java:26: error: package libcore.util does not exist
  249. import libcore.util.EmptyArray;
  250.                    ^
  251. /Users/nico/daylight/build-oscosc-Android_for_armeabi_v7a_GCC_4_9_Qt_5_10_1_for_Android_armv7-Release/android-build/java/lang/Enum.java:34: error: cannot find symbol
  252.     private static final BasicLruCache<Class<? extends Enum>, Object[]> sharedConstantsCache
  253.                          ^
  254.   symbol:   class BasicLruCache
  255.   location: class Enum<E>
  256.   where E is a type-variable:
  257.     E extends Enum<E> declared in class Enum
  258. /Users/nico/daylight/build-oscosc-Android_for_armeabi_v7a_GCC_4_9_Qt_5_10_1_for_Android_armv7-Release/android-build/java/net/URI.java:139: error: cannot find symbol
  259.     static final UriCodec USER_INFO_ENCODER = new PartEncoder("");
  260.                  ^
  261.   symbol:   class UriCodec
  262.   location: class URI
  263. /Users/nico/daylight/build-oscosc-Android_for_armeabi_v7a_GCC_4_9_Qt_5_10_1_for_Android_armv7-Release/android-build/java/net/URI.java:140: error: cannot find symbol
  264.     static final UriCodec PATH_ENCODER = new PartEncoder("/@");
  265.                  ^
  266.   symbol:   class UriCodec
  267.   location: class URI
  268. /Users/nico/daylight/build-oscosc-Android_for_armeabi_v7a_GCC_4_9_Qt_5_10_1_for_Android_armv7-Release/android-build/java/net/URI.java:141: error: cannot find symbol
  269.     static final UriCodec AUTHORITY_ENCODER = new PartEncoder("@[]");
  270.                  ^
  271.   symbol:   class UriCodec
  272.   location: class URI
  273. /Users/nico/daylight/build-oscosc-Android_for_armeabi_v7a_GCC_4_9_Qt_5_10_1_for_Android_armv7-Release/android-build/java/net/URI.java:144: error: cannot find symbol
  274.     static final UriCodec FILE_AND_QUERY_ENCODER = new PartEncoder("/@?");
  275.                  ^
  276.   symbol:   class UriCodec
  277.   location: class URI
  278. /Users/nico/daylight/build-oscosc-Android_for_armeabi_v7a_GCC_4_9_Qt_5_10_1_for_Android_armv7-Release/android-build/java/net/URI.java:147: error: cannot find symbol
  279.     static final UriCodec ALL_LEGAL_ENCODER = new PartEncoder("?/[]@");
  280.                  ^
  281.   symbol:   class UriCodec
  282.   location: class URI
  283. /Users/nico/daylight/build-oscosc-Android_for_armeabi_v7a_GCC_4_9_Qt_5_10_1_for_Android_armv7-Release/android-build/java/net/URI.java:150: error: cannot find symbol
  284.     private static final UriCodec ASCII_ONLY = new UriCodec() {
  285.                          ^
  286.   symbol:   class UriCodec
  287.   location: class URI
  288. /Users/nico/daylight/build-oscosc-Android_for_armeabi_v7a_GCC_4_9_Qt_5_10_1_for_Android_armv7-Release/android-build/java/lang/reflect/AbstractMethod.java:211: error: cannot find symbol
  289.         final ListOfTypes genericExceptionTypes;
  290.               ^
  291.   symbol:   class ListOfTypes
  292.   location: class GenericInfo
  293. /Users/nico/daylight/build-oscosc-Android_for_armeabi_v7a_GCC_4_9_Qt_5_10_1_for_Android_armv7-Release/android-build/java/lang/reflect/AbstractMethod.java:212: error: cannot find symbol
  294.         final ListOfTypes genericParameterTypes;
  295.               ^
  296.   symbol:   class ListOfTypes
  297.   location: class GenericInfo
  298. /Users/nico/daylight/build-oscosc-Android_for_armeabi_v7a_GCC_4_9_Qt_5_10_1_for_Android_armv7-Release/android-build/java/lang/reflect/AbstractMethod.java:216: error: cannot find symbol
  299.         GenericInfo(ListOfTypes exceptions, ListOfTypes parameters, Type ret,
  300.                     ^
  301.   symbol:   class ListOfTypes
  302.   location: class GenericInfo
  303. /Users/nico/daylight/build-oscosc-Android_for_armeabi_v7a_GCC_4_9_Qt_5_10_1_for_Android_armv7-Release/android-build/java/lang/reflect/AbstractMethod.java:216: error: cannot find symbol
  304.         GenericInfo(ListOfTypes exceptions, ListOfTypes parameters, Type ret,
  305.                                             ^
  306.   symbol:   class ListOfTypes
  307.   location: class GenericInfo
  308. /Users/nico/daylight/build-oscosc-Android_for_armeabi_v7a_GCC_4_9_Qt_5_10_1_for_Android_armv7-Release/android-build/java/net/InetAddress.java:21: error: cannot find symbol
  309. import android.system.GaiException;
  310.                      ^
  311.   symbol:   class GaiException
  312.   location: package android.system
  313. /Users/nico/daylight/build-oscosc-Android_for_armeabi_v7a_GCC_4_9_Qt_5_10_1_for_Android_armv7-Release/android-build/java/net/InetAddress.java:22: error: cannot find symbol
  314. import android.system.StructAddrinfo;
  315.                      ^
  316.   symbol:   class StructAddrinfo
  317.   location: package android.system
  318. /Users/nico/daylight/build-oscosc-Android_for_armeabi_v7a_GCC_4_9_Qt_5_10_1_for_Android_armv7-Release/android-build/java/net/InetAddress.java:23: error: cannot find symbol
  319. import dalvik.system.BlockGuard;
  320.                     ^
  321.   symbol:   class BlockGuard
  322.   location: package dalvik.system
  323. /Users/nico/daylight/build-oscosc-Android_for_armeabi_v7a_GCC_4_9_Qt_5_10_1_for_Android_armv7-Release/android-build/java/net/InetAddress.java:37: error: package libcore.io does not exist
  324. import libcore.io.IoBridge;
  325.                  ^
  326. /Users/nico/daylight/build-oscosc-Android_for_armeabi_v7a_GCC_4_9_Qt_5_10_1_for_Android_armv7-Release/android-build/java/net/InetAddress.java:38: error: package libcore.io does not exist
  327. import libcore.io.Libcore;
  328.                  ^
  329. /Users/nico/daylight/build-oscosc-Android_for_armeabi_v7a_GCC_4_9_Qt_5_10_1_for_Android_armv7-Release/android-build/java/net/InetAddress.java:39: error: package libcore.io does not exist
  330. import libcore.io.Memory;
  331.                  ^
  332. /Users/nico/daylight/build-oscosc-Android_for_armeabi_v7a_GCC_4_9_Qt_5_10_1_for_Android_armv7-Release/android-build/java/net/AddressCache.java:19: error: package libcore.util does not exist
  333. import libcore.util.BasicLruCache;
  334.                    ^
  335. /Users/nico/daylight/build-oscosc-Android_for_armeabi_v7a_GCC_4_9_Qt_5_10_1_for_Android_armv7-Release/android-build/java/net/NetworkInterface.java:30: error: package libcore.io does not exist
  336. import libcore.io.IoUtils;
  337.                  ^
  338. /Users/nico/daylight/build-oscosc-Android_for_armeabi_v7a_GCC_4_9_Qt_5_10_1_for_Android_armv7-Release/android-build/java/net/NetworkInterface.java:31: error: package libcore.io does not exist
  339. import libcore.io.Libcore;
  340.                  ^
  341. /Users/nico/daylight/build-oscosc-Android_for_armeabi_v7a_GCC_4_9_Qt_5_10_1_for_Android_armv7-Release/android-build/java/lang/Thread.java:35: error: cannot find symbol
  342. import dalvik.system.VMStack;
  343.                     ^
  344.   symbol:   class VMStack
  345.   location: package dalvik.system
  346. /Users/nico/daylight/build-oscosc-Android_for_armeabi_v7a_GCC_4_9_Qt_5_10_1_for_Android_armv7-Release/android-build/java/lang/Thread.java:40: error: package libcore.util does not exist
  347. import libcore.util.EmptyArray;
  348.                    ^
  349. /Users/nico/daylight/build-oscosc-Android_for_armeabi_v7a_GCC_4_9_Qt_5_10_1_for_Android_armv7-Release/android-build/java/util/concurrent/atomic/AtomicInteger.java:8: error: package sun.misc does not exist
  350. import sun.misc.Unsafe;
  351.                ^
  352. /Users/nico/daylight/build-oscosc-Android_for_armeabi_v7a_GCC_4_9_Qt_5_10_1_for_Android_armv7-Release/android-build/java/util/Date.java:27: error: package libcore.icu does not exist
  353. import libcore.icu.LocaleData;
  354.                   ^
  355. /Users/nico/daylight/build-oscosc-Android_for_armeabi_v7a_GCC_4_9_Qt_5_10_1_for_Android_armv7-Release/android-build/java/net/AddressCache.java:40: error: cannot find symbol
  356.     private final BasicLruCache<AddressCacheKey, AddressCacheEntry> cache
  357.                   ^
  358.   symbol:   class BasicLruCache
  359.   location: class AddressCache
  360. /Users/nico/daylight/build-oscosc-Android_for_armeabi_v7a_GCC_4_9_Qt_5_10_1_for_Android_armv7-Release/android-build/java/lang/ThreadGroup.java:24: error: package libcore.util does not exist
  361. import libcore.util.CollectionUtils;
  362.                    ^
  363. Note: Some input files use or override a deprecated API.
  364. :compileDebugJavaWithJavac FAILED
  365.  
  366. BUILD FAILED
  367.  
  368. Total time: 16.276 secs
  369. Note: Recompile with -Xlint:deprecation for details.
  370. Note: Some input files use unchecked or unsafe operations.
  371. Note: Recompile with -Xlint:unchecked for details.
  372. 100 errors
  373.  
  374. FAILURE: Build failed with an exception.
  375.  
  376. * What went wrong:
  377. Execution failed for task ':compileDebugJavaWithJavac'.
  378. > Compilation failed; see the compiler error output for details.
  379.  
  380. * Try:
  381. Run with --stacktrace option to get the stack trace. Run with --info or --debug option to get more log output.
  382. Building the android package failed!
  383.   -- For more information, run this command with --verbose.
  384. 15:51:08: Le processus "/Users/nico/Qt/5.10.1/android_armv7/bin/androiddeployqt" s'est terminé avec le code 14.
  385. Erreur lors de la compilation/déploiement du projet oscosc (kit : Android for armeabi-v7a (GCC 4.9, Qt 5.10.1 for Android armv7))
  386. When executing step "Build Android APK"
  387. 15:51:08: Temps écoulé : 00:34.
RAW Paste Data
Top