SHARE
TWEET

openmrs sdk error

georgejr Jan 10th, 2019 95 Never
Not a member of Pastebin yet? Sign Up, it unlocks many cool features!
  1. this is what i get when i try to run mvn org.openmrs.maven.plugins:openmrs-sdk-maven-plugin:setup-sdk
  2. Admin@Geo-Jr MINGW64 ~
  3. $ mvn -v
  4. Apache Maven 3.6.0 (97c98ec64a1fdfee7767ce5ffb20918da4f719f3; 2018-10-24T21:41:47+03:00)
  5. Maven home: C:\Program Files\apache-maven-3.6.0-bin\apache-maven-3.6.0
  6. Java version: 1.8.0_171, vendor: Oracle Corporation, runtime: C:\Program Files\Java\jdk1.8.0_171\jre
  7. Default locale: en_US, platform encoding: Cp1252
  8. OS name: "windows 10", version: "10.0", arch: "amd64", family: "windows"
  9.  
  10. Admin@Geo-Jr MINGW64 ~
  11. $ mvn org.openmrs.maven.plugins:openmrs-sdk-maven-plugin:setup-sdk
  12. [INFO] Scanning for projects...
  13. [INFO]
  14. [INFO] ------------------< org.apache.maven:standalone-pom >-------------------
  15. [INFO] Building Maven Stub Project (No POM) 1
  16. [INFO] --------------------------------[ pom ]---------------------------------
  17. [INFO]
  18. [INFO] --- openmrs-sdk-maven-plugin:3.13.0:setup-sdk (default-cli) @ standalone-pom ---
  19. [WARNING] The POM for aopalliance:aopalliance:jar:1.0 is invalid, transitive dependencies (if any) will not be available, enable debug logging for more details
  20. [WARNING] The POM for org.apache.maven.doxia:doxia-sink-api:jar:1.0-alpha-7 is invalid, transitive dependencies (if any) will not be available, enable debug logging for more details
  21. [INFO] ------------------------------------------------------------------------
  22. [INFO] BUILD FAILURE
  23. [INFO] ------------------------------------------------------------------------
  24. [INFO] Total time:  37.805 s
  25. [INFO] Finished at: 2019-01-10T11:09:39+03:00
  26. [INFO] ------------------------------------------------------------------------
  27. [ERROR] Failed to execute goal org.openmrs.maven.plugins:openmrs-sdk-maven-plugin:3.13.0:setup-sdk (default-cli) on project standalone-pom: Execution default-cli of goal org.openmrs.maven.plugins:openmrs-sdk-maven-plugin:3.13.0:setup-sdk failed: A required class was missing while executing org.openmrs.maven.plugins:openmrs-sdk-maven-plugin:3.13.0:setup-sdk: org/apache/commons/lang/StringUtils
  28. [ERROR] -----------------------------------------------------
  29. [ERROR] realm =    plugin>org.openmrs.maven.plugins:openmrs-sdk-maven-plugin:3.13.0
  30. [ERROR] strategy = org.codehaus.plexus.classworlds.strategy.SelfFirstStrategy
  31. [ERROR] urls[0] = file:/C:/Users/Admin/.m2/repository/org/openmrs/maven/plugins/openmrs-sdk-maven-plugin/3.13.0/openmrs-sdk-maven-plugin-3.13.0.jar
  32. [ERROR] urls[1] = file:/C:/Users/Admin/.m2/repository/org/apache/maven/shared/maven-verifier/1.6/maven-verifier-1.6.jar
  33. [ERROR] urls[2] = file:/C:/Users/Admin/.m2/repository/org/apache/maven/shared/maven-shared-utils/0.8/maven-shared-utils-0.8.jar
  34. [ERROR] urls[3] = file:/C:/Users/Admin/.m2/repository/com/google/code/findbugs/jsr305/2.0.1/jsr305-2.0.1.jar
  35. [ERROR] urls[4] = file:/C:/Users/Admin/.m2/repository/junit/junit/4.12/junit-4.12.jar
  36. [ERROR] urls[5] = file:/C:/Users/Admin/.m2/repository/org/hamcrest/hamcrest-core/1.3/hamcrest-core-1.3.jar
  37. [ERROR] urls[6] = file:/C:/Users/Admin/.m2/repository/javax/enterprise/cdi-api/1.0/cdi-api-1.0.jar
  38. [ERROR] urls[7] = file:/C:/Users/Admin/.m2/repository/org/eclipse/sisu/org.eclipse.sisu.inject/0.3.0/org.eclipse.sisu.inject-0.3.0.jar
  39. [ERROR] urls[8] = file:/C:/Users/Admin/.m2/repository/org/codehaus/plexus/plexus-utils/3.0.22/plexus-utils-3.0.22.jar
  40. [ERROR] urls[9] = file:/C:/Users/Admin/.m2/repository/org/codehaus/plexus/plexus-component-annotations/1.0-beta-3.0.5/plexus-component-annotations-1.0-beta-3.0.5.jar
  41. [ERROR] urls[10] = file:/C:/Users/Admin/.m2/repository/org/apache/xbean/xbean-reflect/3.4/xbean-reflect-3.4.jar
  42. [ERROR] urls[11] = file:/C:/Users/Admin/.m2/repository/log4j/log4j/1.2.12/log4j-1.2.12.jar
  43. [ERROR] urls[12] = file:/C:/Users/Admin/.m2/repository/commons-logging/commons-logging-api/1.1/commons-logging-api-1.1.jar
  44. [ERROR] urls[13] = file:/C:/Users/Admin/.m2/repository/org/twdata/maven/mojo-executor/2.2.0/mojo-executor-2.2.0.jar
  45. [ERROR] urls[14] = file:/C:/Users/Admin/.m2/repository/org/sonatype/aether/aether-util/1.7/aether-util-1.7.jar
  46. [ERROR] urls[15] = file:/C:/Users/Admin/.m2/repository/org/sonatype/sisu/sisu-inject-bean/1.4.2/sisu-inject-bean-1.4.2.jar
  47. [ERROR] urls[16] = file:/C:/Users/Admin/.m2/repository/org/sonatype/sisu/sisu-guice/2.1.7/sisu-guice-2.1.7-noaop.jar
  48. [ERROR] urls[17] = file:/C:/Users/Admin/.m2/repository/org/codehaus/plexus/plexus-interpolation/1.14/plexus-interpolation-1.14.jar
  49. [ERROR] urls[18] = file:/C:/Users/Admin/.m2/repository/org/sonatype/plexus/plexus-sec-dispatcher/1.3/plexus-sec-dispatcher-1.3.jar
  50. [ERROR] urls[19] = file:/C:/Users/Admin/.m2/repository/org/sonatype/plexus/plexus-cipher/1.4/plexus-cipher-1.4.jar
  51. [ERROR] urls[20] = file:/C:/Users/Admin/.m2/repository/org/apache/maven/plugins/maven-archetype-plugin/2.4/maven-archetype-plugin-2.4.jar
  52. [ERROR] urls[21] = file:/C:/Users/Admin/.m2/repository/org/apache/maven/archetype/archetype-catalog/2.4/archetype-catalog-2.4.jar
  53. [ERROR] urls[22] = file:/C:/Users/Admin/.m2/repository/org/apache/maven/archetype/archetype-descriptor/2.4/archetype-descriptor-2.4.jar
  54. [ERROR] urls[23] = file:/C:/Users/Admin/.m2/repository/org/apache/maven/archetype/archetype-registry/2.4/archetype-registry-2.4.jar
  55. [ERROR] urls[24] = file:/C:/Users/Admin/.m2/repository/org/apache/maven/archetype/archetype-common/2.4/archetype-common-2.4.jar
  56. [ERROR] urls[25] = file:/C:/Users/Admin/.m2/repository/net/sourceforge/jchardet/jchardet/1.0/jchardet-1.0.jar
  57. [ERROR] urls[26] = file:/C:/Users/Admin/.m2/repository/dom4j/dom4j/1.6.1/dom4j-1.6.1.jar
  58. [ERROR] urls[27] = file:/C:/Users/Admin/.m2/repository/xml-apis/xml-apis/1.0.b2/xml-apis-1.0.b2.jar
  59. [ERROR] urls[28] = file:/C:/Users/Admin/.m2/repository/jdom/jdom/1.0/jdom-1.0.jar
  60. [ERROR] urls[29] = file:/C:/Users/Admin/.m2/repository/org/codehaus/plexus/plexus-velocity/1.1.8/plexus-velocity-1.1.8.jar
  61. [ERROR] urls[30] = file:/C:/Users/Admin/.m2/repository/org/apache/velocity/velocity/1.5/velocity-1.5.jar
  62. [ERROR] urls[31] = file:/C:/Users/Admin/.m2/repository/commons-lang/commons-lang/2.1/commons-lang-2.1.jar
  63. [ERROR] urls[32] = file:/C:/Users/Admin/.m2/repository/oro/oro/2.0.8/oro-2.0.8.jar
  64. [ERROR] urls[33] = file:/C:/Users/Admin/.m2/repository/commons-io/commons-io/2.2/commons-io-2.2.jar
  65. [ERROR] urls[34] = file:/C:/Users/Admin/.m2/repository/org/apache/maven/shared/maven-invoker/2.2/maven-invoker-2.2.jar
  66. [ERROR] urls[35] = file:/C:/Users/Admin/.m2/repository/commons-collections/commons-collections/3.2.1/commons-collections-3.2.1.jar
  67. [ERROR] urls[36] = file:/C:/Users/Admin/.m2/repository/org/codehaus/groovy/groovy/1.8.3/groovy-1.8.3.jar
  68. [ERROR] urls[37] = file:/C:/Users/Admin/.m2/repository/antlr/antlr/2.7.7/antlr-2.7.7.jar
  69. [ERROR] urls[38] = file:/C:/Users/Admin/.m2/repository/asm/asm/3.2/asm-3.2.jar
  70. [ERROR] urls[39] = file:/C:/Users/Admin/.m2/repository/asm/asm-commons/3.2/asm-commons-3.2.jar
  71. [ERROR] urls[40] = file:/C:/Users/Admin/.m2/repository/asm/asm-util/3.2/asm-util-3.2.jar
  72. [ERROR] urls[41] = file:/C:/Users/Admin/.m2/repository/asm/asm-analysis/3.2/asm-analysis-3.2.jar
  73. [ERROR] urls[42] = file:/C:/Users/Admin/.m2/repository/asm/asm-tree/3.2/asm-tree-3.2.jar
  74. [ERROR] urls[43] = file:/C:/Users/Admin/.m2/repository/org/beanshell/bsh/2.0b4/bsh-2.0b4.jar
  75. [ERROR] urls[44] = file:/C:/Users/Admin/.m2/repository/org/apache/maven/shared/maven-script-interpreter/1.0/maven-script-interpreter-1.0.jar
  76. [ERROR] urls[45] = file:/C:/Users/Admin/.m2/repository/org/apache/ant/ant/1.8.1/ant-1.8.1.jar
  77. [ERROR] urls[46] = file:/C:/Users/Admin/.m2/repository/org/codehaus/plexus/plexus-interactivity-api/1.0-alpha-6/plexus-interactivity-api-1.0-alpha-6.jar
  78. [ERROR] urls[47] = file:/C:/Users/Admin/.m2/repository/commons-cli/commons-cli/1.3.1/commons-cli-1.3.1.jar
  79. [ERROR] urls[48] = file:/C:/Users/Admin/.m2/repository/org/jyaml/jyaml/1.3/jyaml-1.3.jar
  80. [ERROR] urls[49] = file:/C:/Users/Admin/.m2/repository/org/apache/httpcomponents/httpclient/4.5.2/httpclient-4.5.2.jar
  81. [ERROR] urls[50] = file:/C:/Users/Admin/.m2/repository/org/apache/httpcomponents/httpcore/4.4.4/httpcore-4.4.4.jar
  82. [ERROR] urls[51] = file:/C:/Users/Admin/.m2/repository/commons-logging/commons-logging/1.2/commons-logging-1.2.jar
  83. [ERROR] urls[52] = file:/C:/Users/Admin/.m2/repository/commons-codec/commons-codec/1.9/commons-codec-1.9.jar
  84. [ERROR] urls[53] = file:/C:/Users/Admin/.m2/repository/mysql/mysql-connector-java/5.1.36/mysql-connector-java-5.1.36.jar
  85. [ERROR] urls[54] = file:/C:/Users/Admin/.m2/repository/com/h2database/h2/1.4.190/h2-1.4.190.jar
  86. [ERROR] urls[55] = file:/C:/Users/Admin/.m2/repository/org/apache/tomcat/embed/tomcat-embed-core/7.0.67/tomcat-embed-core-7.0.67.jar
  87. [ERROR] urls[56] = file:/C:/Users/Admin/.m2/repository/org/apache/tomcat/embed/tomcat-embed-logging-juli/7.0.67/tomcat-embed-logging-juli-7.0.67.jar
  88. [ERROR] urls[57] = file:/C:/Users/Admin/.m2/repository/org/apache/tomcat/embed/tomcat-embed-jasper/7.0.67/tomcat-embed-jasper-7.0.67.jar
  89. [ERROR] urls[58] = file:/C:/Users/Admin/.m2/repository/org/apache/tomcat/embed/tomcat-embed-el/7.0.67/tomcat-embed-el-7.0.67.jar
  90. [ERROR] urls[59] = file:/C:/Users/Admin/.m2/repository/org/eclipse/jdt/core/compiler/ecj/4.4.2/ecj-4.4.2.jar
  91. [ERROR] urls[60] = file:/C:/Users/Admin/.m2/repository/org/apache/tomcat/tomcat-jasper/7.0.67/tomcat-jasper-7.0.67.jar
  92. [ERROR] urls[61] = file:/C:/Users/Admin/.m2/repository/org/apache/tomcat/tomcat-servlet-api/7.0.67/tomcat-servlet-api-7.0.67.jar
  93. [ERROR] urls[62] = file:/C:/Users/Admin/.m2/repository/org/apache/tomcat/tomcat-juli/7.0.67/tomcat-juli-7.0.67.jar
  94. [ERROR] urls[63] = file:/C:/Users/Admin/.m2/repository/org/apache/tomcat/tomcat-el-api/7.0.67/tomcat-el-api-7.0.67.jar
  95. [ERROR] urls[64] = file:/C:/Users/Admin/.m2/repository/org/apache/tomcat/tomcat-api/7.0.67/tomcat-api-7.0.67.jar
  96. [ERROR] urls[65] = file:/C:/Users/Admin/.m2/repository/org/apache/tomcat/tomcat-util/7.0.67/tomcat-util-7.0.67.jar
  97. [ERROR] urls[66] = file:/C:/Users/Admin/.m2/repository/org/apache/tomcat/tomcat-jasper-el/7.0.67/tomcat-jasper-el-7.0.67.jar
  98. [ERROR] urls[67] = file:/C:/Users/Admin/.m2/repository/org/apache/tomcat/tomcat-jsp-api/7.0.67/tomcat-jsp-api-7.0.67.jar
  99. [ERROR] urls[68] = file:/C:/Users/Admin/.m2/repository/javax/servlet/jstl/1.2/jstl-1.2.jar
  100. [ERROR] urls[69] = file:/C:/Users/Admin/.m2/repository/org/eclipse/jgit/org.eclipse.jgit/4.4.0.201606070830-r/org.eclipse.jgit-4.4.0.201606070830-r.jar
  101. [ERROR] urls[70] = file:/C:/Users/Admin/.m2/repository/com/jcraft/jsch/0.1.53/jsch-0.1.53.jar
  102. [ERROR] urls[71] = file:/C:/Users/Admin/.m2/repository/com/googlecode/javaewah/JavaEWAH/0.7.9/JavaEWAH-0.7.9.jar
  103. [ERROR] urls[72] = file:/C:/Users/Admin/.m2/repository/org/eclipse/mylyn/github/org.eclipse.egit.github.core/2.1.5/org.eclipse.egit.github.core-2.1.5.jar
  104. [ERROR] urls[73] = file:/C:/Users/Admin/.m2/repository/com/google/code/gson/gson/2.8.0/gson-2.8.0.jar
  105. [ERROR] urls[74] = file:/C:/Users/Admin/.m2/repository/com/github/zafarkhaja/java-semver/0.9.0/java-semver-0.9.0.jar
  106. [ERROR] urls[75] = file:/C:/Users/Admin/.m2/repository/org/slf4j/slf4j-simple/1.6.2/slf4j-simple-1.6.2.jar
  107. [ERROR] urls[76] = file:/C:/Users/Admin/.m2/repository/commons-httpclient/commons-httpclient/3.1/commons-httpclient-3.1.jar
  108. [ERROR] urls[77] = file:/C:/Users/Admin/.m2/repository/com/fasterxml/jackson/core/jackson-databind/2.7.4/jackson-databind-2.7.4.jar
  109. [ERROR] urls[78] = file:/C:/Users/Admin/.m2/repository/com/fasterxml/jackson/core/jackson-annotations/2.7.0/jackson-annotations-2.7.0.jar
  110. [ERROR] urls[79] = file:/C:/Users/Admin/.m2/repository/com/fasterxml/jackson/core/jackson-core/2.7.4/jackson-core-2.7.4.jar
  111. [ERROR] urls[80] = file:/C:/Users/Admin/.m2/repository/net/lingala/zip4j/zip4j/1.3.2/zip4j-1.3.2.jar
  112. [ERROR] urls[81] = file:/C:/Users/Admin/.m2/repository/org/mybatis/mybatis/3.2.7/mybatis-3.2.7.jar
  113. [ERROR] urls[82] = file:/C:/Users/Admin/.m2/repository/com/atlassian/jira/jira-rest-java-client/2.0.0-m2/jira-rest-java-client-2.0.0-m2.jar
  114. [ERROR] urls[83] = file:/C:/Users/Admin/.m2/repository/joda-time/joda-time/1.6/joda-time-1.6.jar
  115. [ERROR] urls[84] = file:/C:/Users/Admin/.m2/repository/com/sun/jersey/jersey-json/1.5/jersey-json-1.5.jar
  116. [ERROR] urls[85] = file:/C:/Users/Admin/.m2/repository/com/sun/jersey/jersey-core/1.5/jersey-core-1.5.jar
  117. [ERROR] urls[86] = file:/C:/Users/Admin/.m2/repository/org/codehaus/jettison/jettison/1.1/jettison-1.1.jar
  118. [ERROR] urls[87] = file:/C:/Users/Admin/.m2/repository/stax/stax-api/1.0.1/stax-api-1.0.1.jar
  119. [ERROR] urls[88] = file:/C:/Users/Admin/.m2/repository/com/sun/xml/bind/jaxb-impl/2.2.3/jaxb-impl-2.2.3.jar
  120. [ERROR] urls[89] = file:/C:/Users/Admin/.m2/repository/javax/xml/bind/jaxb-api/2.2.2/jaxb-api-2.2.2.jar
  121. [ERROR] urls[90] = file:/C:/Users/Admin/.m2/repository/javax/xml/stream/stax-api/1.0-2/stax-api-1.0-2.jar
  122. [ERROR] urls[91] = file:/C:/Users/Admin/.m2/repository/javax/activation/activation/1.1/activation-1.1.jar
  123. [ERROR] urls[92] = file:/C:/Users/Admin/.m2/repository/org/codehaus/jackson/jackson-core-asl/1.5.5/jackson-core-asl-1.5.5.jar
  124. [ERROR] urls[93] = file:/C:/Users/Admin/.m2/repository/org/codehaus/jackson/jackson-mapper-asl/1.5.5/jackson-mapper-asl-1.5.5.jar
  125. [ERROR] urls[94] = file:/C:/Users/Admin/.m2/repository/org/codehaus/jackson/jackson-jaxrs/1.5.5/jackson-jaxrs-1.5.5.jar
  126. [ERROR] urls[95] = file:/C:/Users/Admin/.m2/repository/org/codehaus/jackson/jackson-xc/1.5.5/jackson-xc-1.5.5.jar
  127. [ERROR] urls[96] = file:/C:/Users/Admin/.m2/repository/com/sun/jersey/jersey-client/1.5/jersey-client-1.5.jar
  128. [ERROR] urls[97] = file:/C:/Users/Admin/.m2/repository/com/google/guava/guava/13.0/guava-13.0.jar
  129. [ERROR] urls[98] = file:/C:/Users/Admin/.m2/repository/com/atlassian/httpclient/atlassian-httpclient-apache-httpcomponents/0.11.0/atlassian-httpclient-apache-httpcomponents-0.11.0.jar
  130. [ERROR] urls[99] = file:/C:/Users/Admin/.m2/repository/com/atlassian/httpclient/atlassian-httpclient-api/0.11.0/atlassian-httpclient-api-0.11.0.jar
  131. [ERROR] urls[100] = file:/C:/Users/Admin/.m2/repository/com/atlassian/httpclient/atlassian-httpclient-spi/0.11.0/atlassian-httpclient-spi-0.11.0.jar
  132. [ERROR] urls[101] = file:/C:/Users/Admin/.m2/repository/com/atlassian/sal/sal-api/2.7.0/sal-api-2.7.0.jar
  133. [ERROR] urls[102] = file:/C:/Users/Admin/.m2/repository/com/atlassian/event/atlassian-event/2.2.0/atlassian-event-2.2.0.jar
  134. [ERROR] urls[103] = file:/C:/Users/Admin/.m2/repository/org/apache/httpcomponents/httpasyncclient-cache/4.0-beta3-atlassian-1/httpasyncclient-cache-4.0-beta3-atlassian-1.jar
  135. [ERROR] urls[104] = file:/C:/Users/Admin/.m2/repository/org/apache/httpcomponents/httpclient-cache/4.2.1-atlassian-2/httpclient-cache-4.2.1-atlassian-2.jar
  136. [ERROR] urls[105] = file:/C:/Users/Admin/.m2/repository/org/apache/httpcomponents/httpasyncclient/4.0-beta3-atlassian-1/httpasyncclient-4.0-beta3-atlassian-1.jar
  137. [ERROR] urls[106] = file:/C:/Users/Admin/.m2/repository/org/apache/httpcomponents/httpcore-nio/4.2.2/httpcore-nio-4.2.2.jar
  138. [ERROR] urls[107] = file:/C:/Users/Admin/.m2/repository/org/springframework/spring-context/2.5.6/spring-context-2.5.6.jar
  139. [ERROR] urls[108] = file:/C:/Users/Admin/.m2/repository/aopalliance/aopalliance/1.0/aopalliance-1.0.jar
  140. [ERROR] urls[109] = file:/C:/Users/Admin/.m2/repository/org/springframework/spring-beans/2.5.6/spring-beans-2.5.6.jar
  141. [ERROR] urls[110] = file:/C:/Users/Admin/.m2/repository/org/springframework/spring-core/2.5.6/spring-core-2.5.6.jar
  142. [ERROR] urls[111] = file:/C:/Users/Admin/.m2/repository/com/atlassian/util/concurrent/atlassian-util-concurrent/2.4.0-M9/atlassian-util-concurrent-2.4.0-M9.jar
  143. [ERROR] urls[112] = file:/C:/Users/Admin/.m2/repository/org/apache/httpcomponents/httpmime/4.1.2/httpmime-4.1.2.jar
  144. [ERROR] urls[113] = file:/C:/Users/Admin/.m2/repository/org/codehaus/mojo/exec-maven-plugin/1.5.0/exec-maven-plugin-1.5.0.jar
  145. [ERROR] urls[114] = file:/C:/Users/Admin/.m2/repository/backport-util-concurrent/backport-util-concurrent/3.1/backport-util-concurrent-3.1.jar
  146. [ERROR] urls[115] = file:/C:/Users/Admin/.m2/repository/org/apache/commons/commons-exec/1.3/commons-exec-1.3.jar
  147. [ERROR] Number of foreign imports: 1
  148. [ERROR] import: Entry[import  from realm ClassRealm[maven.api, parent: null]]
  149. [ERROR]
  150. [ERROR] -----------------------------------------------------
  151. [ERROR] : org.apache.commons.lang.StringUtils
  152. [ERROR] -> [Help 1]
  153. [ERROR]
  154. [ERROR] To see the full stack trace of the errors, re-run Maven with the -e switch.
  155. [ERROR] Re-run Maven using the -X switch to enable full debug logging.
  156. [ERROR]
  157. [ERROR] For more information about the errors and possible solutions, please read the following articles:
  158. [ERROR] [Help 1] http://cwiki.apache.org/confluence/display/MAVEN/PluginContainerException
  159.  
  160. Admin@Geo-Jr MINGW64 ~
  161. $
RAW Paste Data
We use cookies for various purposes including analytics. By continuing to use Pastebin, you agree to our use of cookies as described in the Cookies Policy. OK, I Understand
 
Top