Guest User

Untitled

a guest
Apr 30th, 2017
123
0
Never
Not a member of Pastebin yet? Sign Up, it unlocks many cool features!
text 1.21 KB | None | 0 0
  1. In file included from /home/fg/software/rockbox/apps/plugin.h:64,
  2. from /home/fg/software/rockbox/apps/plugins/puzzles/rbcompat.h:4,
  3. from <command-line>:0:
  4. /home/fg/software/rockbox/firmware/export/font.h:36:21: error: sysfont.h: No such file or directory
  5. In file included from /home/fg/software/rockbox/apps/plugin.h:64,
  6. from /home/fg/software/rockbox/apps/plugins/puzzles/rbcompat.h:4,
  7. from <command-line>:0:
  8. /home/fg/software/rockbox/firmware/export/font.h:36:21: error: sysfont.h: No such file or directory
  9. In file included from /home/fg/software/rockbox/apps/plugin.h:64,
  10. from /home/fg/software/rockbox/apps/plugins/puzzles/rbcompat.h:4,
  11. from <command-line>:0:
  12. /home/fg/software/rockbox/firmware/export/font.h:36:21: error: sysfont.h: No such file or directory
  13. make: *** [/home/fg/software/rockbox/build-creativezenmozaic/apps/plugins/puzzles/rbmalloc.o] Error 1
  14. make: *** Waiting for unfinished jobs....
  15. make: *** [/home/fg/software/rockbox/build-creativezenmozaic/apps/plugins/puzzles/src/combi.o] Error 1
  16. make: *** [/home/fg/software/rockbox/build-creativezenmozaic/apps/plugins/puzzles/src/blackbox.o] Error 1
Advertisement
Add Comment
Please, Sign In to add comment