Not a member of Pastebin yet?
Sign Up,
it unlocks many cool features!
- X:\Development\MC_1_11\Chisel>gradlew sDecW --no-daemon --refresh-dependencies
- #################################################
- ForgeGradle 2.2-SNAPSHOT-f56b64b
- https://github.com/MinecraftForge/ForgeGradle
- #################################################
- Custom version by matthewprenger
- #################################################
- Powered by MCP unknown
- http://modcoderpack.com
- by: Searge, ProfMobius, Fesh0r,
- R4wk, ZeuX, IngisKahn, bspkrs
- #################################################
- Found AccessTransformer: jei_at.cfg_jei_1.11-4.0.2.194_at.cfg
- Found AccessTransformer: chisel_at.cfg
- Version string 'MC1.11-0.0.8.cc25a37' does not match SemVer specification
- You should try SemVer : http://semver.org/
- :extractMcpMappings
- Download http://files.minecraftforge.net/maven/de/oceanlabs/mcp/mcp_snapshot/201
- 61118-1.11/mcp_snapshot-20161118-1.11.zip
- :deobfCompileDeobfDepTask0
- :deobfCompileDeobfDepTask1
- :deobfCompileRemapDepSourcesTask2
- :deobfCompileRemapDepSourcesTask3
- :deobfCompileDummyTask
- :deobfProvidedDummyTask
- :getVersionJson
- :extractUserdev UP-TO-DATE
- :extractDependencyATs UP-TO-DATE
- :extractMcpData
- Download http://files.minecraftforge.net/maven/de/oceanlabs/mcp/mcp/1.11/mcp-1.1
- 1-srg.zip
- :genSrgs
- :downloadClient SKIPPED
- :downloadServer SKIPPED
- :splitServerJar SKIPPED
- :mergeJars SKIPPED
- :deobfMcSRG SKIPPED
- :decompileMc SKIPPED
- :fixMcSources SKIPPED
- :applySourcePatches
- :remapMcSources
- :recompileMc FAILED
- FAILURE: Build failed with an exception.
- * What went wrong:
- Execution failed for task ':recompileMc'.
- > Compile failed; see the compiler error output for details.
- * Try:
- Run with --stacktrace option to get the stack trace. Run with --info or --debug
- option to get more log output.
- BUILD FAILED
- Total time: 1 mins 6.871 secs
- X:\Development\MC_1_11\Chisel>gradlew sDecW --no-daemon --refresh-dependencies -
- -stacktrace
- #################################################
- ForgeGradle 2.2-SNAPSHOT-f56b64b
- https://github.com/MinecraftForge/ForgeGradle
- #################################################
- Custom version by matthewprenger
- #################################################
- Powered by MCP unknown
- http://modcoderpack.com
- by: Searge, ProfMobius, Fesh0r,
- R4wk, ZeuX, IngisKahn, bspkrs
- #################################################
- Found AccessTransformer: jei_at.cfg_jei_1.11-4.0.2.194_at.cfg
- Found AccessTransformer: chisel_at.cfg
- Version string 'MC1.11-0.0.8.cc25a37' does not match SemVer specification
- You should try SemVer : http://semver.org/
- :extractMcpMappings
- :deobfCompileDeobfDepTask0 SKIPPED
- :deobfCompileDeobfDepTask1 SKIPPED
- :deobfCompileRemapDepSourcesTask2 SKIPPED
- :deobfCompileRemapDepSourcesTask3 SKIPPED
- :deobfCompileDummyTask
- :deobfProvidedDummyTask
- :getVersionJson
- :extractUserdev UP-TO-DATE
- :extractDependencyATs UP-TO-DATE
- :extractMcpData SKIPPED
- :genSrgs SKIPPED
- :downloadClient SKIPPED
- :downloadServer SKIPPED
- :splitServerJar SKIPPED
- :mergeJars SKIPPED
- :deobfMcSRG SKIPPED
- :decompileMc SKIPPED
- :fixMcSources SKIPPED
- :applySourcePatches SKIPPED
- :remapMcSources SKIPPED
- :recompileMc FAILED
- FAILURE: Build failed with an exception.
- * What went wrong:
- Execution failed for task ':recompileMc'.
- > Compile failed; see the compiler error output for details.
- * Try:
- Run with --info or --debug option to get more log output.
- * Exception is:
- org.gradle.api.tasks.TaskExecutionException: Execution failed for task ':recompi
- leMc'.
- at org.gradle.api.internal.tasks.execution.ExecuteActionsTaskExecuter.ex
- ecuteActions(ExecuteActionsTaskExecuter.java:84)
- at org.gradle.api.internal.tasks.execution.ExecuteActionsTaskExecuter.ex
- ecute(ExecuteActionsTaskExecuter.java:55)
- at org.gradle.api.internal.tasks.execution.SkipUpToDateTaskExecuter.exec
- ute(SkipUpToDateTaskExecuter.java:61)
- at org.gradle.api.internal.tasks.execution.ValidatingTaskExecuter.execut
- e(ValidatingTaskExecuter.java:58)
- at org.gradle.api.internal.tasks.execution.SkipEmptySourceFilesTaskExecu
- ter.execute(SkipEmptySourceFilesTaskExecuter.java:88)
- at org.gradle.api.internal.tasks.execution.ResolveTaskArtifactStateTaskE
- xecuter.execute(ResolveTaskArtifactStateTaskExecuter.java:45)
- at org.gradle.api.internal.tasks.execution.SkipTaskWithNoActionsExecuter
- .execute(SkipTaskWithNoActionsExecuter.java:51)
- at org.gradle.api.internal.tasks.execution.SkipOnlyIfTaskExecuter.execut
- e(SkipOnlyIfTaskExecuter.java:54)
- at org.gradle.api.internal.tasks.execution.ExecuteAtMostOnceTaskExecuter
- .execute(ExecuteAtMostOnceTaskExecuter.java:43)
- at org.gradle.api.internal.tasks.execution.CatchExceptionTaskExecuter.ex
- ecute(CatchExceptionTaskExecuter.java:34)
- at org.gradle.execution.taskgraph.DefaultTaskGraphExecuter$EventFiringTa
- skWorker.execute(DefaultTaskGraphExecuter.java:233)
- at org.gradle.execution.taskgraph.DefaultTaskGraphExecuter$EventFiringTa
- skWorker.execute(DefaultTaskGraphExecuter.java:215)
- at org.gradle.execution.taskgraph.AbstractTaskPlanExecutor$TaskExecutorW
- orker.processTask(AbstractTaskPlanExecutor.java:74)
- at org.gradle.execution.taskgraph.AbstractTaskPlanExecutor$TaskExecutorW
- orker.run(AbstractTaskPlanExecutor.java:55)
- at org.gradle.execution.taskgraph.DefaultTaskPlanExecutor.process(Defaul
- tTaskPlanExecutor.java:32)
- at org.gradle.execution.taskgraph.DefaultTaskGraphExecuter.execute(Defau
- ltTaskGraphExecuter.java:113)
- at org.gradle.execution.SelectedTaskExecutionAction.execute(SelectedTask
- ExecutionAction.java:37)
- at org.gradle.execution.DefaultBuildExecuter.execute(DefaultBuildExecute
- r.java:37)
- at org.gradle.execution.DefaultBuildExecuter.access$000(DefaultBuildExec
- uter.java:23)
- at org.gradle.execution.DefaultBuildExecuter$1.proceed(DefaultBuildExecu
- ter.java:43)
- at org.gradle.execution.DryRunBuildExecutionAction.execute(DryRunBuildEx
- ecutionAction.java:32)
- at org.gradle.execution.DefaultBuildExecuter.execute(DefaultBuildExecute
- r.java:37)
- at org.gradle.execution.DefaultBuildExecuter.execute(DefaultBuildExecute
- r.java:30)
- at org.gradle.initialization.DefaultGradleLauncher$4.run(DefaultGradleLa
- uncher.java:197)
- at org.gradle.internal.Factories$1.create(Factories.java:25)
- at org.gradle.internal.progress.DefaultBuildOperationExecutor.run(Defaul
- tBuildOperationExecutor.java:91)
- at org.gradle.internal.progress.DefaultBuildOperationExecutor.run(Defaul
- tBuildOperationExecutor.java:53)
- at org.gradle.initialization.DefaultGradleLauncher.doBuildStages(Default
- GradleLauncher.java:194)
- at org.gradle.initialization.DefaultGradleLauncher.access$200(DefaultGra
- dleLauncher.java:36)
- at org.gradle.initialization.DefaultGradleLauncher$1.create(DefaultGradl
- eLauncher.java:118)
- at org.gradle.initialization.DefaultGradleLauncher$1.create(DefaultGradl
- eLauncher.java:112)
- at org.gradle.internal.progress.DefaultBuildOperationExecutor.run(Defaul
- tBuildOperationExecutor.java:91)
- at org.gradle.internal.progress.DefaultBuildOperationExecutor.run(Defaul
- tBuildOperationExecutor.java:63)
- at org.gradle.initialization.DefaultGradleLauncher.doBuild(DefaultGradle
- Launcher.java:112)
- at org.gradle.initialization.DefaultGradleLauncher.run(DefaultGradleLaun
- cher.java:98)
- at org.gradle.launcher.exec.GradleBuildController.run(GradleBuildControl
- ler.java:66)
- at org.gradle.tooling.internal.provider.ExecuteBuildActionRunner.run(Exe
- cuteBuildActionRunner.java:28)
- at org.gradle.launcher.exec.ChainingBuildActionRunner.run(ChainingBuildA
- ctionRunner.java:35)
- at org.gradle.launcher.exec.InProcessBuildActionExecuter.execute(InProce
- ssBuildActionExecuter.java:41)
- at org.gradle.launcher.exec.InProcessBuildActionExecuter.execute(InProce
- ssBuildActionExecuter.java:26)
- at org.gradle.tooling.internal.provider.ContinuousBuildActionExecuter.ex
- ecute(ContinuousBuildActionExecuter.java:75)
- at org.gradle.tooling.internal.provider.ContinuousBuildActionExecuter.ex
- ecute(ContinuousBuildActionExecuter.java:49)
- at org.gradle.tooling.internal.provider.ServicesSetupBuildActionExecuter
- .execute(ServicesSetupBuildActionExecuter.java:44)
- at org.gradle.tooling.internal.provider.ServicesSetupBuildActionExecuter
- .execute(ServicesSetupBuildActionExecuter.java:29)
- at org.gradle.launcher.cli.RunBuildAction.run(RunBuildAction.java:51)
- at org.gradle.internal.Actions$RunnableActionAdapter.execute(Actions.jav
- a:173)
- at org.gradle.launcher.cli.CommandLineActionFactory$ParseAndBuildAction.
- execute(CommandLineActionFactory.java:244)
- at org.gradle.launcher.cli.CommandLineActionFactory$ParseAndBuildAction.
- execute(CommandLineActionFactory.java:217)
- at org.gradle.launcher.cli.JavaRuntimeValidationAction.execute(JavaRunti
- meValidationAction.java:33)
- at org.gradle.launcher.cli.JavaRuntimeValidationAction.execute(JavaRunti
- meValidationAction.java:24)
- at org.gradle.launcher.cli.ExceptionReportingAction.execute(ExceptionRep
- ortingAction.java:33)
- at org.gradle.launcher.cli.ExceptionReportingAction.execute(ExceptionRep
- ortingAction.java:22)
- at org.gradle.launcher.cli.CommandLineActionFactory$WithLogging.execute(
- CommandLineActionFactory.java:210)
- at org.gradle.launcher.cli.CommandLineActionFactory$WithLogging.execute(
- CommandLineActionFactory.java:174)
- at org.gradle.launcher.Main.doAction(Main.java:33)
- at org.gradle.launcher.bootstrap.EntryPoint.run(EntryPoint.java:45)
- at org.gradle.launcher.bootstrap.ProcessBootstrap.runNoExit(ProcessBoots
- trap.java:60)
- at org.gradle.launcher.bootstrap.ProcessBootstrap.run(ProcessBootstrap.j
- ava:37)
- at org.gradle.launcher.GradleMain.main(GradleMain.java:23)
- at org.gradle.wrapper.BootstrapMainStarter.start(BootstrapMainStarter.ja
- va:30)
- at org.gradle.wrapper.WrapperExecutor.execute(WrapperExecutor.java:129)
- at org.gradle.wrapper.GradleWrapperMain.main(GradleWrapperMain.java:61)
- Caused by: : Compile failed; see the compiler error output for details.
- at org.apache.tools.ant.taskdefs.Javac.compile(Javac.java:1181)
- at org.apache.tools.ant.taskdefs.Javac.execute(Javac.java:936)
- at org.apache.tools.ant.UnknownElement.execute(UnknownElement.java:293)
- at org.apache.tools.ant.dispatch.DispatchUtils.execute(DispatchUtils.jav
- a:106)
- at org.gradle.api.internal.project.ant.BasicAntBuilder.nodeCompleted(Bas
- icAntBuilder.java:78)
- at org.gradle.api.internal.project.ant.BasicAntBuilder.doInvokeMethod(Ba
- sicAntBuilder.java:103)
- at net.minecraftforge.gradle.user.TaskRecompileMc.doStuff(TaskRecompileM
- c.java:85)
- at org.gradle.internal.reflect.JavaMethod.invoke(JavaMethod.java:73)
- at org.gradle.api.internal.project.taskfactory.DefaultTaskClassInfoStore
- $StandardTaskAction.doExecute(DefaultTaskClassInfoStore.java:141)
- at org.gradle.api.internal.project.taskfactory.DefaultTaskClassInfoStore
- $StandardTaskAction.execute(DefaultTaskClassInfoStore.java:134)
- at org.gradle.api.internal.project.taskfactory.DefaultTaskClassInfoStore
- $StandardTaskAction.execute(DefaultTaskClassInfoStore.java:123)
- at org.gradle.api.internal.AbstractTask$TaskActionWrapper.execute(Abstra
- ctTask.java:624)
- at org.gradle.api.internal.AbstractTask$TaskActionWrapper.execute(Abstra
- ctTask.java:607)
- at org.gradle.api.internal.tasks.execution.ExecuteActionsTaskExecuter.ex
- ecuteAction(ExecuteActionsTaskExecuter.java:95)
- at org.gradle.api.internal.tasks.execution.ExecuteActionsTaskExecuter.ex
- ecuteActions(ExecuteActionsTaskExecuter.java:76)
- ... 61 more
- BUILD FAILED
- Total time: 54.261 secs
- X:\Development\MC_1_11\Chisel>
Advertisement
Add Comment
Please, Sign In to add comment