SHARE
TWEET

Untitled

a guest Dec 28th, 2015 73 Never
Not a member of Pastebin yet? Sign Up, it unlocks many cool features!
  1. [ 90%] Building CXX object tools/clang/tools/libclang/CMakeFiles/libclang.dir/IndexingContext.cpp.o
  2. [ 91%] Linking CXX shared library ../../../../lib64/libclang.so
  3. [ 91%] Built target libclang
  4. Scanning dependencies of target c-index-test
  5. [ 91%] Building C object tools/clang/tools/c-index-test/CMakeFiles/c-index-test.dir/c-index-test.c.o
  6. [ 91%] Linking CXX executable ../../../../bin/c-index-test
  7. [ 91%] Built target c-index-test
  8. Scanning dependencies of target arcmt-test
  9. [ 91%] Building CXX object tools/clang/tools/arcmt-test/CMakeFiles/arcmt-test.dir/arcmt-test.cpp.o
  10. [ 91%] Linking CXX executable ../../../../bin/arcmt-test
  11. [ 91%] Built target arcmt-test
  12. Scanning dependencies of target c-arcmt-test
  13. [ 91%] Building C object tools/clang/tools/c-arcmt-test/CMakeFiles/c-arcmt-test.dir/c-arcmt-test.c.o
  14. [ 91%] Linking CXX executable ../../../../bin/c-arcmt-test
  15. [ 91%] Built target c-arcmt-test
  16. Scanning dependencies of target clang-check
  17. [ 91%] Building CXX object tools/clang/tools/clang-check/CMakeFiles/clang-check.dir/ClangCheck.cpp.o
  18. [ 91%] Linking CXX executable ../../../../bin/clang-check
  19. [ 91%] Built target clang-check
  20. Scanning dependencies of target clangApplyReplacements
  21. [ 91%] Building CXX object tools/extra/clang-apply-replacements/CMakeFiles/clangApplyReplacements.dir/lib/Tooling/ApplyReplacements.cpp.o
  22. In file included from /tmp/llvm/tools/extra/clang-apply-replacements/lib/Tooling/ApplyReplacements.cpp:17:
  23. In file included from /tmp/llvm/tools/extra/clang-apply-replacements/include/clang-apply-replacements/Tooling/ApplyReplacements.h:19:
  24. In file included from /usr/include/clang/Tooling/Refactoring.h:23:
  25. In file included from /usr/include/clang/Tooling/Tooling.h:35:
  26. In file included from /usr/include/clang/Basic/Diagnostic.h:23:
  27. /tmp/llvm/include/llvm/ADT/DenseMap.h:344:22: error: no member named 'getEmptyKey'
  28.       in 'llvm::DenseMapInfo<std::basic_string<char> >'
  29.     return KeyInfoT::getEmptyKey();
  30.            ~~~~~~~~~~^
  31. /tmp/llvm/include/llvm/ADT/DenseMap.h:283:27: note: in instantiation of member
  32.       function 'llvm::DenseMapBase<llvm::DenseMap<std::basic_string<char>,
  33.       llvm::detail::DenseSetEmpty, llvm::DenseMapInfo<std::basic_string<char> >,
  34.       llvm::detail::DenseSetPair<std::basic_string<char> > >,
  35.       std::basic_string<char>, llvm::detail::DenseSetEmpty,
  36.       llvm::DenseMapInfo<std::basic_string<char> >,
  37.       llvm::detail::DenseSetPair<std::basic_string<char> > >::getEmptyKey'
  38.       requested here
  39.     const KeyT EmptyKey = getEmptyKey();
  40.                           ^
  41. /tmp/llvm/include/llvm/ADT/DenseMap.h:614:20: note: in instantiation of member
  42.       function 'llvm::DenseMapBase<llvm::DenseMap<std::basic_string<char>,
  43.       llvm::detail::DenseSetEmpty, llvm::DenseMapInfo<std::basic_string<char> >,
  44.       llvm::detail::DenseSetPair<std::basic_string<char> > >,
  45.       std::basic_string<char>, llvm::detail::DenseSetEmpty,
  46.       llvm::DenseMapInfo<std::basic_string<char> >,
  47.       llvm::detail::DenseSetPair<std::basic_string<char> > >::initEmpty' requested
  48.       here
  49.       this->BaseT::initEmpty();
  50.                    ^
  51. /tmp/llvm/include/llvm/ADT/DenseMap.h:554:5: note: in instantiation of member
  52.       function 'llvm::DenseMap<std::basic_string<char>,
  53.       llvm::detail::DenseSetEmpty, llvm::DenseMapInfo<std::basic_string<char> >,
  54.       llvm::detail::DenseSetPair<std::basic_string<char> > >::init' requested here
  55.     init(NumInitBuckets);
  56.     ^
  57. /tmp/llvm/include/llvm/ADT/DenseSet.h:51:52: note: in instantiation of member
  58.       function 'llvm::DenseMap<std::basic_string<char>,
  59.       llvm::detail::DenseSetEmpty, llvm::DenseMapInfo<std::basic_string<char> >,
  60.       llvm::detail::DenseSetPair<std::basic_string<char> > >::DenseMap' requested
  61.       here
  62.   explicit DenseSet(unsigned NumInitBuckets = 0) : TheMap(NumInitBuckets) {}
  63.                                                    ^
  64. /tmp/llvm/include/llvm/ADT/SetVector.h:53:3: note: in instantiation of member
  65.       function 'llvm::DenseSet<std::basic_string<char>,
  66.       llvm::DenseMapInfo<std::basic_string<char> > >::DenseSet' requested here
  67.   SetVector() {}
  68.   ^
  69. /usr/include/clang/Lex/HeaderSearchOptions.h:172:3: note: in instantiation of
  70.       member function 'llvm::SetVector<std::basic_string<char>,
  71.       std::vector<std::basic_string<char>, std::allocator<std::basic_string<char>
  72.       > >, llvm::DenseSet<std::basic_string<char>,
  73.       llvm::DenseMapInfo<std::basic_string<char> > > >::SetVector' requested here
  74.   HeaderSearchOptions(StringRef _Sysroot = "/")
  75.   ^
  76. In file included from /tmp/llvm/tools/extra/clang-apply-replacements/lib/Tooling/ApplyReplacements.cpp:17:
  77. In file included from /tmp/llvm/tools/extra/clang-apply-replacements/include/clang-apply-replacements/Tooling/ApplyReplacements.h:19:
  78. In file included from /usr/include/clang/Tooling/Refactoring.h:23:
  79. In file included from /usr/include/clang/Tooling/Tooling.h:35:
  80. In file included from /usr/include/clang/Basic/Diagnostic.h:23:
  81. /tmp/llvm/include/llvm/ADT/DenseMap.h:270:22: error: no member named 'isEqual' in
  82.       'llvm::DenseMapInfo<std::basic_string<char> >'
  83.       if (!KeyInfoT::isEqual(P->getFirst(), EmptyKey) &&
  84.                      ^
  85. /tmp/llvm/include/llvm/ADT/DenseMap.h:574:11: note: in instantiation of member
  86.       function 'llvm::DenseMapBase<llvm::DenseMap<std::basic_string<char>,
  87.       llvm::detail::DenseSetEmpty, llvm::DenseMapInfo<std::basic_string<char> >,
  88.       llvm::detail::DenseSetPair<std::basic_string<char> > >,
  89.       std::basic_string<char>, llvm::detail::DenseSetEmpty,
  90.       llvm::DenseMapInfo<std::basic_string<char> >,
  91.       llvm::detail::DenseSetPair<std::basic_string<char> > >::destroyAll'
  92.       requested here
  93.     this->destroyAll();
  94.           ^
  95. /tmp/llvm/include/llvm/ADT/DenseSet.h:39:7: note: in instantiation of member
  96.       function 'llvm::DenseMap<std::basic_string<char>,
  97.       llvm::detail::DenseSetEmpty, llvm::DenseMapInfo<std::basic_string<char> >,
  98.       llvm::detail::DenseSetPair<std::basic_string<char> > >::~DenseMap' requested
  99.       here
  100. class DenseSet {
  101.       ^
  102. In file included from /tmp/llvm/tools/extra/clang-apply-replacements/lib/Tooling/ApplyReplacements.cpp:17:
  103. In file included from /tmp/llvm/tools/extra/clang-apply-replacements/include/clang-apply-replacements/Tooling/ApplyReplacements.h:19:
  104. In file included from /usr/include/clang/Tooling/Refactoring.h:23:
  105. In file included from /usr/include/clang/Tooling/Tooling.h:35:
  106. In file included from /usr/include/clang/Basic/Diagnostic.h:23:
  107. /tmp/llvm/include/llvm/ADT/DenseMap.h:347:22: error: no member named
  108.       'getTombstoneKey' in 'llvm::DenseMapInfo<std::basic_string<char> >'
  109.     return KeyInfoT::getTombstoneKey();
  110.            ~~~~~~~~~~^
  111. /tmp/llvm/include/llvm/ADT/DenseMap.h:268:57: note: in instantiation of member
  112.       function 'llvm::DenseMapBase<llvm::DenseMap<std::basic_string<char>,
  113.       llvm::detail::DenseSetEmpty, llvm::DenseMapInfo<std::basic_string<char> >,
  114.       llvm::detail::DenseSetPair<std::basic_string<char> > >,
  115.       std::basic_string<char>, llvm::detail::DenseSetEmpty,
  116.       llvm::DenseMapInfo<std::basic_string<char> >,
  117.       llvm::detail::DenseSetPair<std::basic_string<char> > >::getTombstoneKey'
  118.       requested here
  119.     const KeyT EmptyKey = getEmptyKey(), TombstoneKey = getTombstoneKey();
  120.                                                         ^
  121. /tmp/llvm/include/llvm/ADT/DenseMap.h:574:11: note: in instantiation of member
  122.       function 'llvm::DenseMapBase<llvm::DenseMap<std::basic_string<char>,
  123.       llvm::detail::DenseSetEmpty, llvm::DenseMapInfo<std::basic_string<char> >,
  124.       llvm::detail::DenseSetPair<std::basic_string<char> > >,
  125.       std::basic_string<char>, llvm::detail::DenseSetEmpty,
  126.       llvm::DenseMapInfo<std::basic_string<char> >,
  127.       llvm::detail::DenseSetPair<std::basic_string<char> > >::destroyAll'
  128.       requested here
  129.     this->destroyAll();
  130.           ^
  131. /tmp/llvm/include/llvm/ADT/DenseSet.h:39:7: note: in instantiation of member
  132.       function 'llvm::DenseMap<std::basic_string<char>,
  133.       llvm::detail::DenseSetEmpty, llvm::DenseMapInfo<std::basic_string<char> >,
  134.       llvm::detail::DenseSetPair<std::basic_string<char> > >::~DenseMap' requested
  135.       here
  136. class DenseSet {
  137.       ^
  138. 3 errors generated.
  139. tools/extra/clang-apply-replacements/CMakeFiles/clangApplyReplacements.dir/build.make:62: recipe for target 'tools/extra/clang-apply-replacements/CMakeFiles/clangApplyReplacements.dir/lib/Tooling/ApplyReplacements.cpp.o' failed
  140. make[2]: *** [tools/extra/clang-apply-replacements/CMakeFiles/clangApplyReplacements.dir/lib/Tooling/ApplyReplacements.cpp.o] Error 1
  141. CMakeFiles/Makefile2:25039: recipe for target 'tools/extra/clang-apply-replacements/CMakeFiles/clangApplyReplacements.dir/all' failed
  142. make[1]: *** [tools/extra/clang-apply-replacements/CMakeFiles/clangApplyReplacements.dir/all] Error 2
  143. Makefile:149: recipe for target 'all' failed
  144. make: *** [all] Error 2
RAW Paste Data
We use cookies for various purposes including analytics. By continuing to use Pastebin, you agree to our use of cookies as described in the Cookies Policy. OK, I Understand
 
Top