daily pastebin goal
52%
SHARE
TWEET

Raspbian installer log

a guest May 23rd, 2012 23 Never
Not a member of Pastebin yet? Sign Up, it unlocks many cool features!
  1. Jan  1 00:00:04 syslogd started: BusyBox v1.19.3
  2. Jan  1 00:00:04 kernel: klogd started: BusyBox v1.19.3 (Debian 1:1.19.3-7)
  3. Jan  1 00:00:04 kernel: Linux version 3.1.9+ (jerry@debian) (gcc version 4.5.1 (Broadcom-2708) ) #9 Wed May 23 13:51:38 CEST 2012
  4. Jan  1 00:00:04 kernel: CPU: ARMv6-compatible processor [410fb767] revision 7 (ARMv7), cr=00c5387d
  5. Jan  1 00:00:04 kernel: CPU: VIPT nonaliasing data cache, VIPT nonaliasing instruction cache
  6. Jan  1 00:00:04 kernel: Machine: BCM2708
  7. Jan  1 00:00:04 kernel: Memory policy: ECC disabled, Data cache writeback
  8. Jan  1 00:00:04 kernel: On node 0 totalpages: 49152
  9. Jan  1 00:00:04 kernel: free_area_init_node: node 0, pgdat c180c048, node_mem_map c1858000
  10. Jan  1 00:00:04 kernel:   Normal zone: 384 pages used for memmap
  11. Jan  1 00:00:04 kernel:   Normal zone: 0 pages reserved
  12. Jan  1 00:00:04 kernel:   Normal zone: 48768 pages, LIFO batch:15
  13. Jan  1 00:00:04 kernel: pcpu-alloc: s0 r0 d32768 u32768 alloc=1*32768
  14. Jan  1 00:00:04 kernel: pcpu-alloc: [0] 0
  15. Jan  1 00:00:04 kernel: Built 1 zonelists in Zone order, mobility grouping on.  Total pages: 48768
  16. Jan  1 00:00:04 kernel: Kernel command line: dma.dmachans=0x3c bcm2708_fb.fbwidth=1184 bcm2708_fb.fbheight=928 bcm2708.boardrev=0x2 bcm2708.serial=0x2682d3ce smsc95xx.macaddr=B8:27:EB:82:D3:CE dwc_otg.lpm_enable=0 console=ttyAMA0,115200 kgdboc=ttyAMA0
  17. Jan  1 00:00:04 kernel: PID hash table entries: 1024 (order: 0, 4096 bytes)
  18. Jan  1 00:00:04 kernel: Dentry cache hash table entries: 32768 (order: 5, 131072 bytes)
  19. Jan  1 00:00:04 kernel: Inode-cache hash table entries: 16384 (order: 4, 65536 bytes)
  20. Jan  1 00:00:04 kernel: Memory: 192MB = 192MB total
  21. Jan  1 00:00:04 kernel: Memory: 169896k/169896k available, 26712k reserved, 0K highmem
  22. Jan  1 00:00:04 kernel: Virtual kernel memory layout:
  23. Jan  1 00:00:04 kernel:     vector  : 0xffff0000 - 0xffff1000   (   4 kB)
  24. Jan  1 00:00:04 kernel:     fixmap  : 0xfff00000 - 0xfffe0000   ( 896 kB)
  25. Jan  1 00:00:04 kernel:     DMA     : 0xffc00000 - 0xffe00000   (   2 MB)
  26. Jan  1 00:00:04 kernel:     vmalloc : 0xcc800000 - 0xd8000000   ( 184 MB)
  27. Jan  1 00:00:04 kernel:     lowmem  : 0xc0000000 - 0xcc000000   ( 192 MB)
  28. Jan  1 00:00:04 kernel:     modules : 0xbf000000 - 0xc0000000   (  16 MB)
  29. Jan  1 00:00:04 kernel:       .text : 0xc0008000 - 0xc03a6000   (3704 kB)
  30. Jan  1 00:00:04 kernel:       .init : 0xc03a6000 - 0xc17ed000   (20764 kB)
  31. Jan  1 00:00:04 kernel:       .data : 0xc17ee000 - 0xc180c6c0   ( 122 kB)
  32. Jan  1 00:00:04 kernel:        .bss : 0xc180c6e4 - 0xc1857ff8   ( 303 kB)
  33. Jan  1 00:00:04 kernel: NR_IRQS:85
  34. Jan  1 00:00:04 kernel: timer_set_mode: unhandled mode:1
  35. Jan  1 00:00:04 kernel: timer_set_mode: unhandled mode:3
  36. Jan  1 00:00:04 kernel: Console: colour dummy device 80x30
  37. Jan  1 00:00:04 kernel: console [tty1] enabled
  38. Jan  1 00:00:04 kernel: Calibrating delay loop... 697.95 BogoMIPS (lpj=3489792)
  39. Jan  1 00:00:04 kernel: pid_max: default: 32768 minimum: 301
  40. Jan  1 00:00:04 kernel: Mount-cache hash table entries: 512
  41. Jan  1 00:00:04 kernel: CPU: Testing write buffer coherency: ok
  42. Jan  1 00:00:04 kernel: devtmpfs: initialized
  43. Jan  1 00:00:04 kernel: NET: Registered protocol family 16
  44. Jan  1 00:00:04 kernel: vc-mem: mm_vc_mem_phys_addr = 0x00000000
  45. Jan  1 00:00:04 kernel: vc-mem: mm_vc_mem_size      = 0x10000000 (256 MiB)
  46. Jan  1 00:00:04 kernel: mailbox: Broadcom VideoCore Mailbox driver
  47. Jan  1 00:00:04 kernel: bcm2708_vcio: mailbox at f200b880
  48. Jan  1 00:00:04 kernel: bcm_power: Broadcom power driver
  49. Jan  1 00:00:04 kernel: bcm_power_open() -> 0
  50. Jan  1 00:00:04 kernel: bcm_power_request(0, 8)
  51. Jan  1 00:00:04 kernel: bcm_mailbox_read -> 00000080, 0
  52. Jan  1 00:00:04 kernel: bcm_power_request -> 0
  53. Jan  1 00:00:04 kernel: Serial: AMBA PL011 UART driver
  54. Jan  1 00:00:04 kernel: dev:f1: ttyAMA0 at MMIO 0x20201000 (irq = 83) is a PL011 rev3
  55. Jan  1 00:00:04 kernel: console [ttyAMA0] enabled
  56. Jan  1 00:00:04 kernel: bio: create slab <bio-0> at 0
  57. Jan  1 00:00:04 kernel: SCSI subsystem initialized
  58. Jan  1 00:00:04 kernel: usbcore: registered new interface driver usbfs
  59. Jan  1 00:00:04 kernel: usbcore: registered new interface driver hub
  60. Jan  1 00:00:04 kernel: usbcore: registered new device driver usb
  61. Jan  1 00:00:04 kernel: Switching to clocksource stc
  62. Jan  1 00:00:04 kernel: FS-Cache: Loaded
  63. Jan  1 00:00:04 kernel: CacheFiles: Loaded
  64. Jan  1 00:00:04 kernel: Switched to NOHz mode on CPU #0
  65. Jan  1 00:00:04 kernel: NET: Registered protocol family 2
  66. Jan  1 00:00:04 kernel: IP route cache hash table entries: 2048 (order: 1, 8192 bytes)
  67. Jan  1 00:00:04 kernel: TCP established hash table entries: 8192 (order: 4, 65536 bytes)
  68. Jan  1 00:00:04 kernel: TCP bind hash table entries: 8192 (order: 3, 32768 bytes)
  69. Jan  1 00:00:04 kernel: TCP: Hash tables configured (established 8192 bind 8192)
  70. Jan  1 00:00:04 kernel: TCP reno registered
  71. Jan  1 00:00:04 kernel: UDP hash table entries: 256 (order: 0, 4096 bytes)
  72. Jan  1 00:00:04 kernel: UDP-Lite hash table entries: 256 (order: 0, 4096 bytes)
  73. Jan  1 00:00:04 kernel: NET: Registered protocol family 1
  74. Jan  1 00:00:04 kernel: RPC: Registered named UNIX socket transport module.
  75. Jan  1 00:00:04 kernel: RPC: Registered udp transport module.
  76. Jan  1 00:00:04 kernel: RPC: Registered tcp transport module.
  77. Jan  1 00:00:04 kernel: RPC: Registered tcp NFSv4.1 backchannel transport module.
  78. Jan  1 00:00:04 kernel: bcm2708_dma: DMA manager at cc808000
  79. Jan  1 00:00:04 kernel: bcm2708_gpio: bcm2708_gpio_probe c17f3da8
  80. Jan  1 00:00:04 kernel: vc-mem: Videocore memory driver
  81. Jan  1 00:00:04 kernel: VFS: Disk quotas dquot_6.5.2
  82. Jan  1 00:00:04 kernel: Dquot-cache hash table entries: 1024 (order 0, 4096 bytes)
  83. Jan  1 00:00:04 kernel: FS-Cache: Netfs 'nfs' registered for caching
  84. Jan  1 00:00:04 kernel: msgmni has been set to 331
  85. Jan  1 00:00:04 kernel: io scheduler noop registered
  86. Jan  1 00:00:04 kernel: io scheduler deadline registered
  87. Jan  1 00:00:04 kernel: io scheduler cfq registered (default)
  88. Jan  1 00:00:04 kernel: BCM2708FB: registering framebuffer (1184x928@16)
  89. Jan  1 00:00:04 kernel: bcm2708_fb_set_par info(cb88b000) 1184x928 (1184x928), 0, 16
  90. Jan  1 00:00:04 kernel: BCM2708FB: start = ccc00000,4d384000 width=1184, height=928, bpp=16, pitch=2368 size=2197504 success=0
  91. Jan  1 00:00:04 kernel: Console: switching to colour frame buffer device 148x58
  92. Jan  1 00:00:04 kernel: BCM2708FB: register framebuffer (0)
  93. Jan  1 00:00:04 kernel: brd: module loaded
  94. Jan  1 00:00:04 kernel: loop: module loaded
  95. Jan  1 00:00:04 kernel: vcos: [1]: vchiq_init_state: slot_zero = 0xffd80000, is_master = 0
  96. Jan  1 00:00:04 kernel: vcos: [1]: vchiq_init_state: called
  97. Jan  1 00:00:04 kernel: vcos: [1]: vchiq: initialised - version 2 (min 2), device 253.0
  98. Jan  1 00:00:04 kernel: usbcore: registered new interface driver smsc95xx
  99. Jan  1 00:00:04 kernel: cdc_ncm: 04-Aug-2011
  100. Jan  1 00:00:04 kernel: usbcore: registered new interface driver cdc_ncm
  101. Jan  1 00:00:04 kernel: dwc_otg: version 2.90b 6-MAY-2010 (platform bus)
  102. Jan  1 00:00:04 kernel: Core Release: 2.80a
  103. Jan  1 00:00:04 kernel: Setting default values for core params
  104. Jan  1 00:00:04 kernel: Finished setting default values for core params
  105. Jan  1 00:00:04 kernel: cc840008 -> 1
  106. Jan  1 00:00:04 kernel: Using Buffer DMA mode
  107. Jan  1 00:00:04 kernel: Periodic Transfer Interrupt Enhancement - disabled
  108. Jan  1 00:00:04 kernel: Multiprocessor Interrupt Enhancement - disabled
  109. Jan  1 00:00:04 kernel: Dedicated Tx FIFOs mode
  110. Jan  1 00:00:04 kernel: dwc_otg bcm2708_usb: DWC OTG Controller
  111. Jan  1 00:00:04 kernel: dwc_otg bcm2708_usb: new USB bus registered, assigned bus number 1
  112. Jan  1 00:00:04 kernel: dwc_otg bcm2708_usb: irq 75, io mem 0x00000000
  113. Jan  1 00:00:04 kernel: Init: Port Power? op_state=1
  114. Jan  1 00:00:04 kernel: Init: Power Port (0)
  115. Jan  1 00:00:04 kernel: usb usb1: New USB device found, idVendor=1d6b, idProduct=0002
  116. Jan  1 00:00:04 kernel: usb usb1: New USB device strings: Mfr=3, Product=2, SerialNumber=1
  117. Jan  1 00:00:04 kernel: usb usb1: Product: DWC OTG Controller
  118. Jan  1 00:00:04 kernel: usb usb1: Manufacturer: Linux 3.1.9+ dwc_otg_hcd
  119. Jan  1 00:00:04 kernel: usb usb1: SerialNumber: bcm2708_usb
  120. Jan  1 00:00:04 kernel: hub 1-0:1.0: USB hub found
  121. Jan  1 00:00:04 kernel: hub 1-0:1.0: 1 port detected
  122. Jan  1 00:00:04 kernel: Module dwc_common_port init
  123. Jan  1 00:00:04 kernel: usbcore: registered new interface driver uas
  124. Jan  1 00:00:04 kernel: Initializing USB Mass Storage driver...
  125. Jan  1 00:00:04 kernel: usbcore: registered new interface driver usb-storage
  126. Jan  1 00:00:04 kernel: USB Mass Storage support registered.
  127. Jan  1 00:00:04 kernel: usbcore: registered new interface driver libusual
  128. Jan  1 00:00:04 kernel: mousedev: PS/2 mouse device common for all mice
  129. Jan  1 00:00:04 kernel: device-mapper: ioctl: 4.21.0-ioctl (2011-07-06) initialised: dm-devel@redhat.com
  130. Jan  1 00:00:04 kernel: cpuidle: using governor ladder
  131. Jan  1 00:00:04 kernel: cpuidle: using governor menu
  132. Jan  1 00:00:04 kernel: sdhci: Secure Digital Host Controller Interface driver
  133. Jan  1 00:00:04 kernel: sdhci: Copyright(c) Pierre Ossman
  134. Jan  1 00:00:04 kernel: bcm_power_open() -> 1
  135. Jan  1 00:00:04 kernel: Registered led device: mmc0::
  136. Jan  1 00:00:04 kernel: mmc0: SDHCI controller on BCM2708_Arasan [platform] using platform's DMA
  137. Jan  1 00:00:04 kernel: mmc0: BCM2708 SDHC host at 0x20300000 DMA 2 IRQ 77
  138. Jan  1 00:00:04 kernel: sdhci-pltfm: SDHCI platform and OF driver helper
  139. Jan  1 00:00:04 kernel: Registered led device: led0
  140. Jan  1 00:00:04 kernel: usbcore: registered new interface driver usbhid
  141. Jan  1 00:00:04 kernel: usbhid: USB HID core driver
  142. Jan  1 00:00:04 kernel: TCP cubic registered
  143. Jan  1 00:00:04 kernel: Initializing XFRM netlink socket
  144. Jan  1 00:00:04 kernel: NET: Registered protocol family 17
  145. Jan  1 00:00:04 kernel: Registering the dns_resolver key type
  146. Jan  1 00:00:04 kernel: VFP support v0.3: implementor 41 architecture 1 part 20 variant b rev 5
  147. Jan  1 00:00:04 kernel: Freeing init memory: 20764K
  148. Jan  1 00:00:04 kernel: mmc0: new SDHC card at address b368
  149. Jan  1 00:00:04 kernel: mmcblk0: mmc0:b368 00000 3.74 GiB
  150. Jan  1 00:00:04 kernel:  mmcblk0: p1 p2 p3
  151. Jan  1 00:00:04 kernel: usb 1-1: new high speed USB device number 2 using dwc_otg
  152. Jan  1 00:00:04 kernel: usb 1-1: New USB device found, idVendor=0424, idProduct=9512
  153. Jan  1 00:00:04 kernel: usb 1-1: New USB device strings: Mfr=0, Product=0, SerialNumber=0
  154. Jan  1 00:00:04 kernel: hub 1-1:1.0: USB hub found
  155. Jan  1 00:00:04 kernel: hub 1-1:1.0: 3 ports detected
  156. Jan  1 00:00:04 kernel: usb 1-1.1: new high speed USB device number 3 using dwc_otg
  157. Jan  1 00:00:04 kernel: usb 1-1.1: New USB device found, idVendor=0424, idProduct=ec00
  158. Jan  1 00:00:04 kernel: usb 1-1.1: New USB device strings: Mfr=0, Product=0, SerialNumber=0
  159. Jan  1 00:00:04 kernel: smsc95xx v1.0.4
  160. Jan  1 00:00:04 kernel: smsc95xx 1-1.1:1.0: eth0: register 'smsc95xx' at usb-bcm2708_usb-1.1, smsc95xx USB 2.0 Ethernet, b8:27:eb:82:d3:ce
  161. Jan  1 00:00:04 kernel: usb 1-1.3: new low speed USB device number 4 using dwc_otg
  162. Jan  1 00:00:04 kernel: usb 1-1.3: New USB device found, idVendor=413c, idProduct=2003
  163. Jan  1 00:00:04 kernel: usb 1-1.3: New USB device strings: Mfr=1, Product=2, SerialNumber=0
  164. Jan  1 00:00:04 kernel: usb 1-1.3: Product: Dell USB Keyboard
  165. Jan  1 00:00:04 kernel: usb 1-1.3: Manufacturer: Dell
  166. Jan  1 00:00:04 kernel: input: Dell Dell USB Keyboard as /devices/platform/bcm2708_usb/usb1/1-1/1-1.3/1-1.3:1.0/input/input0
  167. Jan  1 00:00:04 kernel: generic-usb 0003:413C:2003.0001: input: USB HID v1.10 Keyboard [Dell Dell USB Keyboard] on usb-bcm2708_usb-1.3/input0
  168. Jan  1 00:00:12 preseed: successfully loaded preseed file from file:///preseed.cfg
  169. Jan  1 00:00:15 init: starting pid 1291, tty '': '/sbin/reopen-console /sbin/debian-installer'
  170. Jan  1 00:00:15 init: starting pid 1294, tty '/dev/tty4': '/usr/bin/tail -f /var/log/syslog'
  171. Jan  1 00:00:17 debconf: Setting debconf/language to en
  172. Jan  1 00:00:17 main-menu[1312]: DEBUG: resolver (libc6-udeb): package doesn't exist (ignored)
  173. Jan  1 00:00:17 main-menu[1312]: DEBUG: resolver (libgcc1): package doesn't exist (ignored)
  174. Jan  1 00:00:17 main-menu[1312]: DEBUG: resolver (crypto-modules): package doesn't exist (ignored)
  175. Jan  1 00:00:17 main-menu[1312]: INFO: Menu item 'localechooser' selected
  176. Jan  1 00:00:20 debconf: Setting debconf/language to en
  177. Jan  1 00:00:37 localechooser: info: Language = 'C'
  178. Jan  1 00:00:37 localechooser: info: line=C;0;;C;en;
  179. Jan  1 00:00:37 localechooser: info: Set debian-installer/language = 'en'
  180. Jan  1 00:00:37 localechooser: info: Default locale = 'C'
  181. Jan  1 00:00:37 localechooser: info: Set debian-installer/consoledisplay = ''
  182. Jan  1 00:00:37 debconf: Setting debconf/language to en
  183. Jan  1 00:00:42 localechooser: info: Set debian-installer/country = 'CA'
  184. Jan  1 00:00:42 localechooser: info: Set debian-installer/locale = 'C'
  185. Jan  1 00:00:42 localechooser: info: System locale (debian-installer/locale) = 'C'
  186. Jan  1 00:00:42 main-menu[1312]: DEBUG: resolver (libc6-udeb): package doesn't exist (ignored)
  187. Jan  1 00:00:42 main-menu[1312]: DEBUG: resolver (libgcc1): package doesn't exist (ignored)
  188. Jan  1 00:00:42 main-menu[1312]: DEBUG: resolver (crypto-modules): package doesn't exist (ignored)
  189. Jan  1 00:00:42 main-menu[1312]: INFO: Menu item 'console-setup-udeb' selected
  190. Jan  1 00:00:44 main-menu[1312]: (process:2060): /etc/console-setup is not writable. No files will be saved there.
  191. Jan  1 00:00:44 main-menu[1312]: (process:2060): gzip is not accessible. Will not save cached keyboard map.
  192. Jan  1 00:00:44 main-menu[1312]: DEBUG: resolver (libc6-udeb): package doesn't exist (ignored)
  193. Jan  1 00:00:44 main-menu[1312]: DEBUG: resolver (libgcc1): package doesn't exist (ignored)
  194. Jan  1 00:00:44 main-menu[1312]: DEBUG: resolver (crypto-modules): package doesn't exist (ignored)
  195. Jan  1 00:00:44 main-menu[1312]: INFO: Menu item 'ethdetect' selected
  196. Jan  1 00:00:44 net/hw-detect.hotplug: Detected hotpluggable network interface eth0
  197. Jan  1 00:00:45 net/hw-detect.hotplug: Detected hotpluggable network interface lo
  198. Jan  1 00:00:46 apt-install: Queueing package udev for later installation
  199. Jan  1 00:00:46 apt-install: Queueing package usbutils for later installation
  200. Jan  1 00:00:49 hw-detect: Missing modules 'usb-storage (USB storage)
  201. Jan  1 00:00:50 check-missing-firmware: /dev/.udev/firmware-missing does not exist, skipping
  202. Jan  1 00:00:50 check-missing-firmware: /run/udev/firmware-missing does not exist, skipping
  203. Jan  1 00:00:50 check-missing-firmware: no missing firmware in /dev/.udev/firmware-missing /run/udev/firmware-missing
  204. Jan  1 00:00:51 check-missing-firmware: /dev/.udev/firmware-missing does not exist, skipping
  205. Jan  1 00:00:51 check-missing-firmware: /run/udev/firmware-missing does not exist, skipping
  206. Jan  1 00:00:51 check-missing-firmware: no missing firmware in /dev/.udev/firmware-missing /run/udev/firmware-missing
  207. Jan  1 00:00:52 main-menu[1312]: DEBUG: resolver (libc6-udeb): package doesn't exist (ignored)
  208. Jan  1 00:00:52 main-menu[1312]: DEBUG: resolver (libgcc1): package doesn't exist (ignored)
  209. Jan  1 00:00:52 main-menu[1312]: DEBUG: resolver (crypto-modules): package doesn't exist (ignored)
  210. Jan  1 00:00:52 main-menu[1312]: INFO: Menu item 'netcfg' selected
  211. Jan  1 00:00:52 netcfg[2895]: INFO: Starting netcfg v.1.70 (built 20120503-2118)
  212. Jan  1 00:00:52 netcfg[2895]: WARNING **: Couldn't read Wpasupplicant pid file, not trying to kill.
  213. Jan  1 00:00:52 netcfg[2895]: INFO: Could not find valid BOOTIF= entry in /proc/cmdline
  214. Jan  1 00:00:52 netcfg[2895]: WARNING **: Started DHCP client; PID is 2909
  215. Jan  1 00:00:54 kernel: smsc95xx 1-1.1:1.0: eth0: link up, 100Mbps, full-duplex, lpa 0xC5E1
  216. Jan  1 00:00:55 udhcpc: Got IP 192.168.0.245 (using eth0) and routing through 192.168.0.1
  217. Jan  1 00:00:55 netcfg[2895]: DEBUG: dhcp_client_sigchld() called
  218. Jan  1 00:00:55 netcfg[2895]: DEBUG: Waiting for dhcp_pid = 2909
  219. Jan  1 00:00:57 netcfg[2895]: DEBUG: dhcp_client_sigchld() called
  220. Jan  1 00:00:59 netcfg[2895]: INFO: Detected eth0 as a hotpluggable device
  221. Jan  1 00:00:59 netcfg[2895]: DEBUG: dhcp_client_sigchld() called
  222. Jan  1 00:00:59 main-menu[1312]: (process:2894): udhcpc (v1.19.3) started
  223. Jan  1 00:00:59 main-menu[1312]: (process:2894): Sending discover...
  224. Jan  1 00:00:59 main-menu[1312]: (process:2894): Sending discover...
  225. Jan  1 00:00:59 main-menu[1312]: (process:2894): Sending discover...
  226. Jan  1 00:00:59 main-menu[1312]: (process:2894): Sending select for 192.168.0.245...
  227. Jan  1 00:00:59 main-menu[1312]: (process:2894): Lease of 192.168.0.245 obtained, lease time 604800
  228. Jan  1 00:00:59 main-menu[1312]: DEBUG: resolver (libc6-udeb): package doesn't exist (ignored)
  229. Jan  1 00:00:59 main-menu[1312]: DEBUG: resolver (libgcc1): package doesn't exist (ignored)
  230. Jan  1 00:00:59 main-menu[1312]: DEBUG: resolver (crypto-modules): package doesn't exist (ignored)
  231. Jan  1 00:00:59 main-menu[1312]: INFO: Menu item 'choose-mirror' selected
  232. Jan  1 00:00:59 anna-install: Queueing udeb apt-mirror-setup for later installation
  233. Jan  1 00:01:22 choose-mirror[2962]: DEBUG: command: wget -q http://raspbian.lag.re/raspbian//dists/oldstable/Release -O - | grep -E '^(Suite|Codename):'
  234. Jan  1 00:01:23 choose-mirror[2962]: DEBUG: command: wget -q http://raspbian.lag.re/raspbian//dists/stable/Release -O - | grep -E '^(Suite|Codename):'
  235. Jan  1 00:01:23 choose-mirror[2962]: DEBUG: command: wget -q http://raspbian.lag.re/raspbian//dists/testing/Release -O - | grep -E '^(Suite|Codename):'
  236. Jan  1 00:01:24 choose-mirror[2962]: DEBUG: command: wget -q http://raspbian.lag.re/raspbian//dists/wheezy/Release -O - | grep -E '^(Suite|Codename):'
  237. Jan  1 00:01:24 choose-mirror[2962]: DEBUG: command: wget -q http://raspbian.lag.re/raspbian//dists/unstable/Release -O - | grep -E '^(Suite|Codename):'
  238. Jan  1 00:01:24 choose-mirror[2962]: INFO: suite/codename set to: testing/wheezy
  239. Jan  1 00:01:24 choose-mirror[2962]: DEBUG: command: wget -q http://raspbian.lag.re/raspbian//dists/wheezy/main/binary-armhf/Release -O - | grep ^Architecture:
  240. Jan  1 00:01:25 anna-install: Queueing udeb wheezy-support for later installation
  241. Jan  1 00:01:25 main-menu[1312]: (process:2955): wget: server returned error: HTTP/1.1 404 Not Found
  242. Jan  1 00:01:25 main-menu[1312]: (process:2955): wget: server returned error: HTTP/1.1 404 Not Found
  243. Jan  1 00:01:25 main-menu[1312]: (process:2955): wget: server returned error: HTTP/1.1 404 Not Found
  244. Jan  1 00:01:25 main-menu[1312]: DEBUG: resolver (libc6-udeb): package doesn't exist (ignored)
  245. Jan  1 00:01:25 main-menu[1312]: DEBUG: resolver (libgcc1): package doesn't exist (ignored)
  246. Jan  1 00:01:25 main-menu[1312]: DEBUG: resolver (crypto-modules): package doesn't exist (ignored)
  247. Jan  1 00:01:25 main-menu[1312]: INFO: Menu item 'download-installer' selected
  248. Jan  1 00:01:25 net-retriever: Not verifying Release signature: unauthenticated mode enabled
  249. Jan  1 00:01:26 anna[3012]: WARNING **: no packages matching running kernel 3.1.9+ in archive
  250. Jan  1 00:01:29 anna[3012]: DEBUG: resolver (libgcc1): package doesn't exist (ignored)
  251. Jan  1 00:01:29 anna[3012]: DEBUG: resolver (ext2-modules): package doesn't exist (ignored)
  252. Jan  1 00:01:29 anna[3012]: DEBUG: resolver (fat-modules): package doesn't exist (ignored)
  253. Jan  1 00:01:29 anna[3012]: DEBUG: resolver (libbsd0-udeb): package doesn't exist (ignored)
  254. Jan  1 00:01:29 anna[3012]: DEBUG: resolver (ext3-modules): package doesn't exist (ignored)
  255. Jan  1 00:01:29 anna[3012]: DEBUG: resolver (ext4-modules): package doesn't exist (ignored)
  256. Jan  1 00:01:29 anna[3012]: DEBUG: resolver (md-modules): package doesn't exist (ignored)
  257. Jan  1 00:01:29 anna[3012]: DEBUG: resolver (btrfs-modules): package doesn't exist (ignored)
  258. Jan  1 00:01:29 anna[3012]: DEBUG: resolver (jfs-modules): package doesn't exist (ignored)
  259. Jan  1 00:01:29 anna[3012]: DEBUG: resolver (ufsutils-udeb): package doesn't exist (ignored)
  260. Jan  1 00:01:29 anna[3012]: DEBUG: resolver (ufs-modules): package doesn't exist (ignored)
  261. Jan  1 00:01:29 anna[3012]: DEBUG: resolver (xfs-modules): package doesn't exist (ignored)
  262. Jan  1 00:01:29 anna[3012]: DEBUG: resolver (libgcc1): package doesn't exist (ignored)
  263. Jan  1 00:01:29 anna[3012]: DEBUG: resolver (ext2-modules): package doesn't exist (ignored)
  264. Jan  1 00:01:29 anna[3012]: DEBUG: resolver (fat-modules): package doesn't exist (ignored)
  265. Jan  1 00:01:29 anna[3012]: DEBUG: resolver (libbsd0-udeb): package doesn't exist (ignored)
  266. Jan  1 00:01:29 anna[3012]: DEBUG: resolver (ext3-modules): package doesn't exist (ignored)
  267. Jan  1 00:01:29 anna[3012]: DEBUG: resolver (ext4-modules): package doesn't exist (ignored)
  268. Jan  1 00:01:29 anna[3012]: DEBUG: resolver (md-modules): package doesn't exist (ignored)
  269. Jan  1 00:01:29 anna[3012]: DEBUG: resolver (btrfs-modules): package doesn't exist (ignored)
  270. Jan  1 00:01:29 anna[3012]: DEBUG: resolver (jfs-modules): package doesn't exist (ignored)
  271. Jan  1 00:01:29 anna[3012]: DEBUG: resolver (ufsutils-udeb): package doesn't exist (ignored)
  272. Jan  1 00:01:29 anna[3012]: DEBUG: resolver (ufs-modules): package doesn't exist (ignored)
  273. Jan  1 00:01:29 anna[3012]: DEBUG: resolver (xfs-modules): package doesn't exist (ignored)
  274. Jan  1 00:01:29 anna[3012]: DEBUG: retrieving apt-mirror-setup 1:0.56
  275. Jan  1 00:01:30 anna[3012]: DEBUG: retrieving apt-setup-udeb 1:0.56
  276. Jan  1 00:01:31 anna[3012]: DEBUG: retrieving base-installer 1.123
  277. Jan  1 00:01:32 anna[3012]: DEBUG: retrieving bootstrap-base 1.123
  278. Jan  1 00:01:35 anna[3012]: DEBUG: retrieving btrfs-tools-udeb 0.19+20120328-1
  279. Jan  1 00:01:37 anna[3012]: DEBUG: retrieving clock-setup 0.110
  280. Jan  1 00:01:38 anna[3012]: DEBUG: retrieving debootstrap-udeb 1.0.40
  281. Jan  1 00:01:39 anna[3012]: DEBUG: retrieving di-utils-mapdevfs 1.89
  282. Jan  1 00:01:39 anna[3012]: DEBUG: retrieving disk-detect 1.88
  283. Jan  1 00:01:40 anna[3012]: DEBUG: retrieving e2fsprogs-udeb 1.42.2-2
  284. Jan  1 00:01:44 anna[3012]: DEBUG: retrieving finish-install 2.34
  285. Jan  1 00:01:50 anna[3012]: DEBUG: retrieving jfsutils-udeb 1.1.15-2
  286. Jan  1 00:01:56 anna[3012]: DEBUG: retrieving kickseed-common 0.57
  287. Jan  1 00:01:57 anna[3012]: DEBUG: retrieving libc6-udeb 2.13-32
  288. Jan  1 00:02:08 anna[3012]: DEBUG: retrieving libdevmapper1.02.1-udeb 2:1.02.67-2
  289. Jan  1 00:02:10 anna[3012]: DEBUG: retrieving libparted0-udeb 2.3-9.1
  290. Jan  1 00:02:12 anna[3012]: DEBUG: retrieving libpcre3-udeb 1:8.30-5
  291. Jan  1 00:02:13 anna[3012]: DEBUG: retrieving mdadm-udeb 3.2.3-2
  292. Jan  1 00:02:16 anna[3012]: DEBUG: retrieving nobootloader 1.32
  293. Jan  1 00:02:17 anna[3012]: DEBUG: retrieving partman-auto 101
  294. Jan  1 00:02:19 anna[3012]: DEBUG: retrieving partman-auto-raid 20
  295. Jan  1 00:02:20 anna[3012]: DEBUG: retrieving partman-base 153
  296. Jan  1 00:02:22 anna[3012]: DEBUG: retrieving partman-basicfilesystems 71
  297. Jan  1 00:02:25 anna[3012]: DEBUG: retrieving partman-basicmethods 49
  298. Jan  1 00:02:26 anna[3012]: DEBUG: retrieving partman-btrfs 8
  299. Jan  1 00:02:27 anna[3012]: DEBUG: retrieving partman-ext3 67
  300. Jan  1 00:02:28 anna[3012]: DEBUG: retrieving partman-jfs 35
  301. Jan  1 00:02:29 anna[3012]: DEBUG: retrieving partman-md 58
  302. Jan  1 00:02:32 anna[3012]: DEBUG: retrieving partman-partitioning 85
  303. Jan  1 00:02:35 anna[3012]: DEBUG: retrieving partman-target 77
  304. Jan  1 00:02:37 anna[3012]: DEBUG: retrieving partman-ufs 9
  305. Jan  1 00:02:38 anna[3012]: DEBUG: retrieving partman-utils 153
  306. Jan  1 00:02:39 anna[3012]: DEBUG: retrieving partman-xfs 49
  307. Jan  1 00:02:40 anna[3012]: DEBUG: retrieving pciutils-udeb 1:3.1.9-3
  308. Jan  1 00:02:42 anna[3012]: DEBUG: retrieving pkgsel 0.35
  309. Jan  1 00:02:43 anna[3012]: DEBUG: retrieving rdate-udeb 1:1.2-4
  310. Jan  1 00:02:43 anna[3012]: DEBUG: retrieving tzsetup-udeb 1:0.35
  311. Jan  1 00:02:45 anna[3012]: DEBUG: retrieving user-setup-udeb 1.42
  312. Jan  1 00:02:50 anna[3012]: DEBUG: retrieving xfsprogs-udeb 3.1.7
  313. Jan  1 00:02:53 main-menu[1312]: DEBUG: resolver (libgcc1): package doesn't exist (ignored)
  314. Jan  1 00:02:53 main-menu[1312]: DEBUG: resolver (crypto-modules): package doesn't exist (ignored)
  315. Jan  1 00:02:53 main-menu[1312]: DEBUG: resolver (libbsd0-udeb): package doesn't exist (ignored)
  316. Jan  1 00:02:53 main-menu[1312]: DEBUG: resolver (ext2-modules): package doesn't exist (ignored)
  317. Jan  1 00:02:53 main-menu[1312]: DEBUG: resolver (fat-modules): package doesn't exist (ignored)
  318. Jan  1 00:02:54 main-menu[1312]: INFO: Menu item 'user-setup-udeb' selected
  319. Jan  1 00:03:05 main-menu[1312]: DEBUG: resolver (libgcc1): package doesn't exist (ignored)
  320. Jan  1 00:03:05 main-menu[1312]: DEBUG: resolver (crypto-modules): package doesn't exist (ignored)
  321. Jan  1 00:03:05 main-menu[1312]: DEBUG: resolver (libbsd0-udeb): package doesn't exist (ignored)
  322. Jan  1 00:03:05 main-menu[1312]: DEBUG: resolver (ext2-modules): package doesn't exist (ignored)
  323. Jan  1 00:03:05 main-menu[1312]: DEBUG: resolver (fat-modules): package doesn't exist (ignored)
  324. Jan  1 00:03:05 main-menu[1312]: INFO: Menu item 'clock-setup' selected
  325. May 23 12:05:01 clock-setup: Wed May 23 12:05:01 UTC 2012
  326. May 23 12:05:01 clock-setup: rdate: adjust local clock by 1337774515.307794 seconds
  327. May 23 12:05:01 main-menu[1312]: DEBUG: resolver (libgcc1): package doesn't exist (ignored)
  328. May 23 12:05:01 main-menu[1312]: DEBUG: resolver (crypto-modules): package doesn't exist (ignored)
  329. May 23 12:05:01 main-menu[1312]: DEBUG: resolver (libbsd0-udeb): package doesn't exist (ignored)
  330. May 23 12:05:01 main-menu[1312]: DEBUG: resolver (ext2-modules): package doesn't exist (ignored)
  331. May 23 12:05:01 main-menu[1312]: DEBUG: resolver (fat-modules): package doesn't exist (ignored)
  332. May 23 12:05:02 main-menu[1312]: INFO: Menu item 'disk-detect' selected
  333. May 23 12:05:03 net/hw-detect.hotplug: Detected hotpluggable network interface eth0
  334. May 23 12:05:04 net/hw-detect.hotplug: Detected hotpluggable network interface lo
  335. May 23 12:05:08 hw-detect: Missing modules 'usb-storage (USB storage)
  336. May 23 12:05:09 check-missing-firmware: /dev/.udev/firmware-missing does not exist, skipping
  337. May 23 12:05:09 check-missing-firmware: /run/udev/firmware-missing does not exist, skipping
  338. May 23 12:05:09 check-missing-firmware: no missing firmware in /dev/.udev/firmware-missing /run/udev/firmware-missing
  339. May 23 12:05:10 check-missing-firmware: /dev/.udev/firmware-missing does not exist, skipping
  340. May 23 12:05:10 check-missing-firmware: /run/udev/firmware-missing does not exist, skipping
  341. May 23 12:05:10 check-missing-firmware: no missing firmware in /dev/.udev/firmware-missing /run/udev/firmware-missing
  342. May 23 12:05:10 main-menu[1312]: DEBUG: resolver (libgcc1): package doesn't exist (ignored)
  343. May 23 12:05:10 main-menu[1312]: DEBUG: resolver (crypto-modules): package doesn't exist (ignored)
  344. May 23 12:05:10 main-menu[1312]: DEBUG: resolver (libbsd0-udeb): package doesn't exist (ignored)
  345. May 23 12:05:10 main-menu[1312]: DEBUG: resolver (ext2-modules): package doesn't exist (ignored)
  346. May 23 12:05:10 main-menu[1312]: DEBUG: resolver (fat-modules): package doesn't exist (ignored)
  347. May 23 12:05:10 main-menu[1312]: INFO: Menu item 'partman-base' selected
  348. May 23 12:05:11 anna-install: Installing partman-auto-lvm
  349. May 23 12:05:11 anna[5133]: DEBUG: resolver (libgcc1): package doesn't exist (ignored)
  350. May 23 12:05:11 anna[5133]: DEBUG: resolver (libblkid1-udeb): package doesn't exist (ignored)
  351. May 23 12:05:11 anna[5133]: DEBUG: resolver (libuuid1-udeb): package doesn't exist (ignored)
  352. May 23 12:05:11 anna[5133]: DEBUG: resolver (ext2-modules): package doesn't exist (ignored)
  353. May 23 12:05:11 anna[5133]: DEBUG: resolver (fat-modules): package doesn't exist (ignored)
  354. May 23 12:05:11 anna[5133]: DEBUG: resolver (util-linux-udeb): package doesn't exist (ignored)
  355. May 23 12:05:11 anna[5133]: DEBUG: resolver (ext3-modules): package doesn't exist (ignored)
  356. May 23 12:05:11 anna[5133]: DEBUG: resolver (ext4-modules): package doesn't exist (ignored)
  357. May 23 12:05:11 anna[5133]: DEBUG: resolver (md-modules): package doesn't exist (ignored)
  358. May 23 12:05:11 anna[5133]: DEBUG: retrieving lvm2-udeb 2.02.88-2
  359. May 23 12:05:16 anna[5133]: DEBUG: retrieving partman-auto-lvm 42
  360. May 23 12:05:17 anna[5133]: DEBUG: retrieving partman-lvm 75
  361. May 23 12:05:21 anna[5133]: DEBUG: retrieving zlib1g-udeb 1:1.2.7.dfsg-1
  362. May 23 12:05:22 anna-install: Installing partman-auto-crypto
  363. May 23 12:05:22 anna[5264]: DEBUG: resolver (libgcc1): package doesn't exist (ignored)
  364. May 23 12:05:23 anna[5264]: DEBUG: resolver (libblkid1-udeb): package doesn't exist (ignored)
  365. May 23 12:05:23 anna[5264]: DEBUG: resolver (libuuid1-udeb): package doesn't exist (ignored)
  366. May 23 12:05:23 anna[5264]: DEBUG: resolver (ext2-modules): package doesn't exist (ignored)
  367. May 23 12:05:23 anna[5264]: DEBUG: resolver (fat-modules): package doesn't exist (ignored)
  368. May 23 12:05:23 anna[5264]: DEBUG: resolver (util-linux-udeb): package doesn't exist (ignored)
  369. May 23 12:05:23 anna[5264]: DEBUG: resolver (ext3-modules): package doesn't exist (ignored)
  370. May 23 12:05:23 anna[5264]: DEBUG: resolver (ext4-modules): package doesn't exist (ignored)
  371. May 23 12:05:23 anna[5264]: DEBUG: resolver (md-modules): package doesn't exist (ignored)
  372. May 23 12:05:23 anna[5264]: DEBUG: retrieving partman-auto-crypto 18
  373. May 23 12:05:23 anna[5264]: DEBUG: retrieving partman-crypto 50
  374. May 23 12:05:29 md-devices: mdadm: No arrays found in config file or automatically
  375. May 23 12:05:29 partman:   No matching physical volumes found
  376. May 23 12:05:29 partman:   Reading all physical volumes.  This may take a while...
  377. May 23 12:05:29 partman:  
  378. May 23 12:05:29 partman: No volume groups found
  379. May 23 12:05:29 partman:
  380. May 23 12:05:29 partman-lvm:  
  381. May 23 12:05:29 partman-lvm: No volume groups found
  382. May 23 12:05:29 partman-lvm:
  383. May 23 12:06:22 kernel: Adding 238588k swap on /dev/mmcblk0p3.  Priority:-1 extents:1 across:238588k SS
  384. May 23 12:06:23 kernel: EXT4-fs (mmcblk0p2): ext4_check_descriptors: Checksum for group 0 failed (61389!=0)
  385. May 23 12:06:23 kernel: EXT4-fs (mmcblk0p2): group descriptors corrupted!
  386. May 23 12:07:26 kernel: Adding 238588k swap on /dev/mmcblk0p3.  Priority:-1 extents:1 across:238588k SS
  387. May 23 12:07:28 kernel: EXT4-fs (mmcblk0p2): ext4_check_descriptors: Checksum for group 0 failed (61389!=0)
  388. May 23 12:07:28 kernel: EXT4-fs (mmcblk0p2): group descriptors corrupted!
  389. May 23 12:09:28 kernel: Adding 238588k swap on /dev/mmcblk0p3.  Priority:-1 extents:1 across:238588k SS
  390. May 23 12:09:28 partman: mke2fs 1.42.2 (9-Apr-2012)
  391. May 23 12:09:48 kernel: EXT4-fs (mmcblk0p2): mounted filesystem with ordered data mode. Opts: errors=remount-ro
  392. May 23 12:09:52 apt-install: Queueing package e2fsprogs for later installation
  393. May 23 12:09:52 main-menu[1312]: (process:5120): mount: mounting /dev/mmcblk0p2 on /target/ failed: Invalid argument
  394. May 23 12:09:52 main-menu[1312]: (process:5120): mount: mounting /dev/mmcblk0p2 on /target/ failed: Invalid argument
  395. May 23 12:09:53 main-menu[1312]: DEBUG: resolver (libgcc1): package doesn't exist (ignored)
  396. May 23 12:09:53 main-menu[1312]: DEBUG: resolver (crypto-modules): package doesn't exist (ignored)
  397. May 23 12:09:53 main-menu[1312]: DEBUG: resolver (libbsd0-udeb): package doesn't exist (ignored)
  398. May 23 12:09:53 main-menu[1312]: DEBUG: resolver (ext2-modules): package doesn't exist (ignored)
  399. May 23 12:09:53 main-menu[1312]: DEBUG: resolver (fat-modules): package doesn't exist (ignored)
  400. May 23 12:09:53 main-menu[1312]: INFO: Menu item 'bootstrap-base' selected
  401. May 23 12:09:53 base-installer: warning: Unknown armhf subarchitecture 'unknown'.
  402. May 23 12:13:28 kernel: bcm2708_fb_check_var info(cb88b000) 1184x928 (1184x928), 2197504, 16
  403. May 23 12:13:28 kernel: bcm2708_fb_check_var var(ca445cdc) 1184x928 (1184x928), 16, 1098752
  404. May 23 12:13:28 kernel: bcm2708_fb_set_par info(cb88b000) 1184x928 (1184x928), 2197504, 16
  405. May 23 12:13:28 kernel: BCM2708FB: start = cd000000,4d384000 width=1184, height=928, bpp=16, pitch=2368 size=2197504 success=0
  406. May 23 12:26:20 debootstrap: dpkg: warning: parsing file '/var/lib/dpkg/status' near line 5 package 'dpkg':
  407. May 23 12:26:20 debootstrap:  missing description
  408. May 23 12:26:20 debootstrap: dpkg: warning: parsing file '/var/lib/dpkg/status' near line 5 package 'dpkg':
  409. May 23 12:26:20 debootstrap:  missing architecture
  410. May 23 12:26:20 debootstrap: Selecting previously unselected package base-files.
  411. May 23 12:26:20 debootstrap: dpkg: regarding .../base-files_6.7_armhf.deb containing base-files, pre-dependency problem:
  412. May 23 12:26:20 debootstrap:  base-files pre-depends on awk
  413. May 23 12:26:20 debootstrap:   awk is not installed.
  414. May 23 12:26:20 debootstrap: (Reading database ... 0 files and directories currently installed.)
  415. May 23 12:26:20 debootstrap: Unpacking base-files (from .../base-files_6.7_armhf.deb) ...
  416. May 23 12:26:20 debootstrap: dpkg: warning: ignoring pre-dependency problem!
  417. May 23 12:26:21 debootstrap: Selecting previously unselected package base-passwd.
  418. May 23 12:26:21 debootstrap: Unpacking base-passwd (from .../base-passwd_3.5.24_armhf.deb) ...
  419. May 23 12:26:22 debootstrap: dpkg: base-passwd: dependency problems, but configuring anyway as you requested:
  420. May 23 12:26:22 debootstrap:  base-passwd depends on libc6 (>= 2.4); however:
  421. May 23 12:26:22 debootstrap:   Package libc6 is not installed.
  422. May 23 12:26:22 debootstrap: Setting up base-passwd (3.5.24) ...
  423. May 23 12:26:22 debootstrap: dpkg: base-files: dependency problems, but configuring anyway as you requested:
  424. May 23 12:26:22 debootstrap:  base-files depends on awk; however:
  425. May 23 12:26:22 debootstrap:   Package awk is not installed.
  426. May 23 12:26:22 debootstrap: Setting up base-files (6.7) ...
  427. May 23 12:26:24 debootstrap: dpkg: warning: parsing file '/var/lib/dpkg/status' near line 48 package 'dpkg':
  428. May 23 12:26:24 debootstrap:  missing description
  429. May 23 12:26:24 debootstrap: dpkg: warning: parsing file '/var/lib/dpkg/status' near line 48 package 'dpkg':
  430. May 23 12:26:24 debootstrap:  missing architecture
  431. May 23 12:26:33 debootstrap: dpkg: regarding .../archives/dpkg_1.16.3_armhf.deb containing dpkg, pre-dependency problem:
  432. May 23 12:26:33 debootstrap:  dpkg pre-depends on libbz2-1.0
  433. May 23 12:26:33 debootstrap:   libbz2-1.0 is not installed.
  434. May 23 12:26:33 debootstrap: dpkg: warning: ignoring pre-dependency problem!
  435. May 23 12:26:33 debootstrap: dpkg: regarding .../archives/dpkg_1.16.3_armhf.deb containing dpkg, pre-dependency problem:
  436. May 23 12:26:33 debootstrap:  dpkg pre-depends on libc6 (>= 2.13-28)
  437. May 23 12:26:33 debootstrap: dpkg: warning: ignoring pre-dependency problem!
  438. May 23 12:26:33 debootstrap: dpkg: regarding .../archives/dpkg_1.16.3_armhf.deb containing dpkg, pre-dependency problem:
  439. May 23 12:26:33 debootstrap:  dpkg pre-depends on libgcc1 (>= 1:4.4.0)
  440. May 23 12:26:33 debootstrap: (Reading database ... 109 files and directories currently installed.)
  441. May 23 12:26:33 debootstrap: Preparing to replace dpkg 1.16.3 (using .../archives/dpkg_1.16.3_armhf.deb) ...
  442. May 23 12:26:33 debootstrap: dpkg: warning: ignoring pre-dependency problem!
  443. May 23 12:26:33 debootstrap: dpkg: regarding .../archives/dpkg_1.16.3_armhf.deb containing dpkg, pre-dependency problem:
  444. May 23 12:26:33 debootstrap:  dpkg pre-depends on libselinux1 (>= 1.32)
  445. May 23 12:26:33 debootstrap: dpkg: warning: ignoring pre-dependency problem!
  446. May 23 12:26:33 debootstrap: dpkg: regarding .../archives/dpkg_1.16.3_armhf.deb containing dpkg, pre-dependency problem:
  447. May 23 12:26:33 debootstrap:  dpkg pre-depends on zlib1g (>= 1:1.1.4)
  448. May 23 12:26:33 debootstrap: dpkg: warning: ignoring pre-dependency problem!
  449. May 23 12:26:33 debootstrap: dpkg: regarding .../archives/dpkg_1.16.3_armhf.deb containing dpkg, pre-dependency problem:
  450. May 23 12:26:33 debootstrap:  dpkg pre-depends on tar (>= 1.23)
  451. May 23 12:26:33 debootstrap: dpkg: warning: ignoring pre-dependency problem!
  452. May 23 12:26:33 debootstrap: dpkg: regarding .../archives/dpkg_1.16.3_armhf.deb containing dpkg, pre-dependency problem:
  453. May 23 12:26:33 debootstrap:  dpkg pre-depends on xz-utils
  454. May 23 12:26:33 debootstrap:   xz-utils is not installed.
  455. May 23 12:26:33 debootstrap: dpkg: warning: ignoring pre-dependency problem!
  456. May 23 12:26:35 debootstrap: Unpacking replacement dpkg ...
  457. May 23 12:26:40 debootstrap: dpkg: dpkg: dependency problems, but configuring anyway as you requested:
  458. May 23 12:26:40 debootstrap:  dpkg depends on libbz2-1.0; however:
  459. May 23 12:26:40 debootstrap:   Package libbz2-1.0 is not installed.
  460. May 23 12:26:40 debootstrap:  dpkg depends on libc6 (>= 2.13-28); however:
  461. May 23 12:26:40 debootstrap:   Package libc6 is not installed.
  462. May 23 12:26:40 debootstrap:  dpkg depends on libgcc1 (>= 1:4.4.0); however:
  463. May 23 12:26:40 debootstrap:   Package libgcc1 is not installed.
  464. May 23 12:26:40 debootstrap:  dpkg depends on libselinux1 (>= 1.32); however:
  465. May 23 12:26:40 debootstrap:   Package libselinux1 is not installed.
  466. May 23 12:26:40 debootstrap:  dpkg depends on zlib1g (>= 1:1.1.4); however:
  467. May 23 12:26:40 debootstrap:   Package zlib1g is not installed.
  468. May 23 12:26:40 debootstrap:  dpkg depends on tar (>= 1.23); however:
  469. May 23 12:26:40 debootstrap:   Package tar is not installed.
  470. May 23 12:26:40 debootstrap:  dpkg depends on xz-utils; however:
  471. May 23 12:26:40 debootstrap:   Package xz-utils is not installed.
  472. May 23 12:26:40 debootstrap: Setting up dpkg (1.16.3) ...
  473. May 23 12:26:41 debootstrap: Selecting previously unselected package libc6:armhf.
  474. May 23 12:26:41 debootstrap: (Reading database ...
  475. May 23 12:26:41 debootstrap: 361 files and directories currently installed.)
  476. May 23 12:26:41 debootstrap: Unpacking libc6:armhf (from .../libc6_2.13-32_armhf.deb) ...
  477. May 23 12:26:46 debootstrap: dpkg: libc6:armhf: dependency problems, but configuring anyway as you requested:
  478. May 23 12:26:46 debootstrap:  libc6:armhf depends on libc-bin (= 2.13-32); however:
  479. May 23 12:26:46 debootstrap:   Package libc-bin is not installed.
  480. May 23 12:26:46 debootstrap:  libc6:armhf depends on libgcc1; however:
  481. May 23 12:26:46 debootstrap:   Package libgcc1 is not installed.
  482. May 23 12:26:46 debootstrap: Setting up libc6:armhf (2.13-32) ...
  483. May 23 12:26:55 debootstrap: Selecting previously unselected package perl-base.
  484. May 23 12:26:55 debootstrap: dpkg: regarding .../perl-base_5.14.2-9_armhf.deb containing perl-base, pre-dependency problem:
  485. May 23 12:26:55 debootstrap:  perl-base pre-depends on libgcc1 (>= 1:4.4.0)
  486. May 23 12:26:55 debootstrap: dpkg: warning: ignoring pre-dependency problem!
  487. May 23 12:26:55 debootstrap: (Reading database ...
  488. May 23 12:26:55 debootstrap: 672 files and directories currently installed.)
  489. May 23 12:26:55 debootstrap: Unpacking perl-base (from .../perl-base_5.14.2-9_armhf.deb) ...
  490. May 23 12:27:03 debootstrap: dpkg: perl-base: dependency problems, but configuring anyway as you requested:
  491. May 23 12:27:03 debootstrap:  perl-base depends on libgcc1 (>= 1:4.4.0); however:
  492. May 23 12:27:03 debootstrap:   Package libgcc1 is not installed.
  493. May 23 12:27:03 debootstrap: Setting up perl-base (5.14.2-9) ...
  494. May 23 12:27:03 debootstrap: Selecting previously unselected package mawk.
  495. May 23 12:27:03 debootstrap: (Reading database ...
  496. May 23 12:27:03 debootstrap: 1742 files and directories currently installed.)
  497. May 23 12:27:04 debootstrap: Unpacking mawk (from .../mawk_1.3.3-17_armhf.deb) ...
  498. May 23 12:27:04 debootstrap: Setting up mawk (1.3.3-17) ...
  499. May 23 12:27:06 debootstrap: Selecting previously unselected package debconf.
  500. May 23 12:27:06 debootstrap: (Reading database ...
  501. May 23 12:27:06 debootstrap: 1761 files and directories currently installed.)
  502. May 23 12:27:06 debootstrap: Unpacking debconf (from .../debconf_1.5.43_all.deb) ...
  503. May 23 12:27:07 debootstrap: Setting up debconf (1.5.43) ...
  504. May 23 12:27:21 debootstrap: (Reading database ...
  505. May 23 12:27:21 debootstrap: 1944 files and directories currently installed.)
  506. May 23 12:27:21 debootstrap: Preparing to replace base-files 6.7 (using .../base-files_6.7_armhf.deb) ...
  507. May 23 12:27:21 debootstrap: Unpacking replacement base-files ...
  508. May 23 12:27:22 debootstrap: Preparing to replace base-passwd 3.5.24 (using .../base-passwd_3.5.24_armhf.deb) ...
  509. May 23 12:27:22 debootstrap: Unpacking replacement base-passwd ...
  510. May 23 12:27:23 debootstrap: Selecting previously unselected package bash.
  511. May 23 12:27:23 debootstrap: dpkg: regarding .../archives/bash_4.2-2_armhf.deb containing bash, pre-dependency problem:
  512. May 23 12:27:23 debootstrap:  bash pre-depends on dash (>= 0.5.5.1-2.2)
  513. May 23 12:27:23 debootstrap: dpkg: warning: ignoring pre-dependency problem!
  514. May 23 12:27:23 debootstrap: dpkg: regarding .../archives/bash_4.2-2_armhf.deb containing bash, pre-dependency problem:
  515. May 23 12:27:23 debootstrap:  bash pre-depends on libgcc1 (>= 1:4.4.0)
  516. May 23 12:27:23 debootstrap: dpkg: warning: ignoring pre-dependency problem!
  517. May 23 12:27:23 debootstrap: dpkg: regarding .../archives/bash_4.2-2_armhf.deb containing bash, pre-dependency problem:
  518. May 23 12:27:23 debootstrap:  bash pre-depends on libtinfo5
  519. May 23 12:27:23 debootstrap:   libtinfo5 is not installed.
  520. May 23 12:27:23 debootstrap: dpkg: warning: ignoring pre-dependency problem!
  521. May 23 12:27:23 debootstrap: Unpacking bash (from .../archives/bash_4.2-2_armhf.deb) ...
  522. May 23 12:27:26 debootstrap: Selecting previously unselected package bsdutils.
  523. May 23 12:27:26 debootstrap: Unpacking bsdutils (from .../bsdutils_1%3a2.20.1-4_armhf.deb) ...
  524. May 23 12:27:27 debootstrap: Selecting previously unselected package coreutils.
  525. May 23 12:27:27 debootstrap: dpkg: regarding .../coreutils_8.13-3.2_armhf.deb containing coreutils, pre-dependency problem:
  526. May 23 12:27:27 debootstrap:  coreutils pre-depends on libacl1 (>= 2.2.51-5)
  527. May 23 12:27:27 debootstrap: dpkg: warning: ignoring pre-dependency problem!
  528. May 23 12:27:27 debootstrap: dpkg: regarding .../coreutils_8.13-3.2_armhf.deb containing coreutils, pre-dependency problem:
  529. May 23 12:27:27 debootstrap:  coreutils pre-depends on libattr1 (>= 1:2.4.46-5)
  530. May 23 12:27:27 debootstrap: dpkg: warning: ignoring pre-dependency problem!
  531. May 23 12:27:27 debootstrap: dpkg: regarding .../coreutils_8.13-3.2_armhf.deb containing coreutils, pre-dependency problem:
  532. May 23 12:27:27 debootstrap:  coreutils pre-depends on libgcc1 (>= 1:4.4.0)
  533. May 23 12:27:27 debootstrap: dpkg: warning: ignoring pre-dependency problem!
  534. May 23 12:27:27 debootstrap: dpkg: regarding .../coreutils_8.13-3.2_armhf.deb containing coreutils, pre-dependency problem:
  535. May 23 12:27:27 debootstrap:  coreutils pre-depends on libselinux1 (>= 1.32)
  536. May 23 12:27:27 debootstrap: dpkg: warning: ignoring pre-dependency problem!
  537. May 23 12:27:27 debootstrap: Unpacking coreutils (from .../coreutils_8.13-3.2_armhf.deb) ...
  538. May 23 12:27:37 debootstrap: Selecting previously unselected package dash.
  539. May 23 12:27:37 debootstrap: Unpacking dash (from .../dash_0.5.7-3_armhf.deb) ...
  540. May 23 12:27:37 debootstrap: Adding 'diversion of /bin/sh to /bin/sh.distrib by dash'
  541. May 23 12:27:38 debootstrap: Adding 'diversion of /usr/share/man/man1/sh.1.gz to /usr/share/man/man1/sh.distrib.1.gz by dash'
  542. May 23 12:27:38 debootstrap: Preparing to replace debconf 1.5.43 (using .../debconf_1.5.43_all.deb) ...
  543. May 23 12:27:39 debootstrap: Unpacking replacement debconf ...
  544. May 23 12:27:40 debootstrap: Selecting previously unselected package debconf-i18n.
  545. May 23 12:27:40 debootstrap: Unpacking debconf-i18n (from .../debconf-i18n_1.5.43_all.deb) ...
  546. May 23 12:27:41 debootstrap: Selecting previously unselected package debianutils.
  547. May 23 12:27:41 debootstrap: Unpacking debianutils (from .../debianutils_4.3_armhf.deb) ...
  548. May 23 12:27:42 debootstrap: Selecting previously unselected package diffutils.
  549. May 23 12:27:42 debootstrap: dpkg: regarding .../diffutils_1%3a3.2-6_armhf.deb containing diffutils, pre-dependency problem:
  550. May 23 12:27:42 debootstrap:  diffutils pre-depends on libgcc1 (>= 1:4.4.0)
  551. May 23 12:27:42 debootstrap: Unpacking diffutils (from .../diffutils_1%3a3.2-6_armhf.deb) ...
  552. May 23 12:27:42 debootstrap: dpkg: warning: ignoring pre-dependency problem!
  553. May 23 12:27:45 debootstrap: Selecting previously unselected package dmsetup.
  554. May 23 12:27:45 debootstrap: Unpacking dmsetup (from .../dmsetup_2%3a1.02.67-2_armhf.deb) ...
  555. May 23 12:27:46 debootstrap: dpkg: regarding .../archives/dpkg_1.16.3_armhf.deb containing dpkg, pre-dependency problem:
  556. May 23 12:27:46 debootstrap:  dpkg pre-depends on libbz2-1.0
  557. May 23 12:27:46 debootstrap:   libbz2-1.0 is not installed.
  558. May 23 12:27:46 debootstrap: dpkg: warning: ignoring pre-dependency problem!
  559. May 23 12:27:46 debootstrap: dpkg: regarding .../archives/dpkg_1.16.3_armhf.deb containing dpkg, pre-dependency problem:
  560. May 23 12:27:46 debootstrap:  dpkg pre-depends on libgcc1 (>= 1:4.4.0)
  561. May 23 12:27:46 debootstrap: Preparing to replace dpkg 1.16.3 (using .../archives/dpkg_1.16.3_armhf.deb) ...
  562. May 23 12:27:46 debootstrap: dpkg: warning: ignoring pre-dependency problem!
  563. May 23 12:27:46 debootstrap: dpkg: regarding .../archives/dpkg_1.16.3_armhf.deb containing dpkg, pre-dependency problem:
  564. May 23 12:27:46 debootstrap:  dpkg pre-depends on libselinux1 (>= 1.32)
  565. May 23 12:27:46 debootstrap: dpkg: warning: ignoring pre-dependency problem!
  566. May 23 12:27:46 debootstrap: dpkg: regarding .../archives/dpkg_1.16.3_armhf.deb containing dpkg, pre-dependency problem:
  567. May 23 12:27:46 debootstrap:  dpkg pre-depends on zlib1g (>= 1:1.1.4)
  568. May 23 12:27:46 debootstrap: dpkg: warning: ignoring pre-dependency problem!
  569. May 23 12:27:46 debootstrap: dpkg: regarding .../archives/dpkg_1.16.3_armhf.deb containing dpkg, pre-dependency problem:
  570. May 23 12:27:46 debootstrap:  dpkg pre-depends on tar (>= 1.23)
  571. May 23 12:27:46 debootstrap: dpkg: warning: ignoring pre-dependency problem!
  572. May 23 12:27:46 debootstrap: dpkg: regarding .../archives/dpkg_1.16.3_armhf.deb containing dpkg, pre-dependency problem:
  573. May 23 12:27:46 debootstrap:  dpkg pre-depends on xz-utils
  574. May 23 12:27:46 debootstrap:   xz-utils is not installed.
  575. May 23 12:27:46 debootstrap: dpkg: warning: ignoring pre-dependency problem!
  576. May 23 12:27:46 debootstrap: Unpacking replacement dpkg ...
  577. May 23 12:27:53 debootstrap: Selecting previously unselected package e2fslibs:armhf.
  578. May 23 12:27:53 debootstrap: dpkg: regarding .../e2fslibs_1.42.2-2_armhf.deb containing e2fslibs:armhf, pre-dependency problem:
  579. May 23 12:27:53 debootstrap:  e2fslibs pre-depends on multiarch-support
  580. May 23 12:27:53 debootstrap:   multiarch-support is not installed.
  581. May 23 12:27:53 debootstrap: dpkg: warning: ignoring pre-dependency problem!
  582. May 23 12:27:53 debootstrap: Unpacking e2fslibs:armhf (from .../e2fslibs_1.42.2-2_armhf.deb) ...
  583. May 23 12:27:54 debootstrap: Selecting previously unselected package e2fsprogs.
  584. May 23 12:27:54 debootstrap: dpkg: regarding .../e2fsprogs_1.42.2-2_armhf.deb containing e2fsprogs, pre-dependency problem:
  585. May 23 12:27:54 debootstrap:  e2fsprogs pre-depends on e2fslibs (= 1.42.2-2)
  586. May 23 12:27:54 debootstrap:   e2fslibs:armhf is unpacked, but has never been configured.
  587. May 23 12:27:54 debootstrap: dpkg: warning: ignoring pre-dependency problem!
  588. May 23 12:27:54 debootstrap: dpkg: regarding .../e2fsprogs_1.42.2-2_armhf.deb containing e2fsprogs, pre-dependency problem:
  589. May 23 12:27:54 debootstrap:  e2fsprogs pre-depends on libblkid1 (>= 2.17.2)
  590. May 23 12:27:54 debootstrap: dpkg: warning: ignoring pre-dependency problem!
  591. May 23 12:27:54 debootstrap: dpkg: regarding .../e2fsprogs_1.42.2-2_armhf.deb containing e2fsprogs, pre-dependency problem:
  592. May 23 12:27:54 debootstrap:  e2fsprogs pre-depends on libcomerr2 (>= 1.42~WIP-2011-10-05-1)
  593. May 23 12:27:54 debootstrap: dpkg: warning: ignoring pre-dependency problem!
  594. May 23 12:27:54 debootstrap: dpkg: regarding .../e2fsprogs_1.42.2-2_armhf.deb containing e2fsprogs, pre-dependency problem:
  595. May 23 12:27:54 debootstrap:  e2fsprogs pre-depends on libgcc1 (>= 1:4.4.0)
  596. May 23 12:27:54 debootstrap: dpkg: warning: ignoring pre-dependency problem!
  597. May 23 12:27:54 debootstrap: dpkg: regarding .../e2fsprogs_1.42.2-2_armhf.deb containing e2fsprogs, pre-dependency problem:
  598. May 23 12:27:54 debootstrap:  e2fsprogs pre-depends on libss2 (>= 1.34-1)
  599. May 23 12:27:54 debootstrap: dpkg: warning: ignoring pre-dependency problem!
  600. May 23 12:27:54 debootstrap: dpkg: regarding .../e2fsprogs_1.42.2-2_armhf.deb containing e2fsprogs, pre-dependency problem:
  601. May 23 12:27:54 debootstrap:  e2fsprogs pre-depends on libuuid1 (>= 2.16)
  602. May 23 12:27:54 debootstrap: dpkg: warning: ignoring pre-dependency problem!
  603. May 23 12:27:54 debootstrap: dpkg: regarding .../e2fsprogs_1.42.2-2_armhf.deb containing e2fsprogs, pre-dependency problem:
  604. May 23 12:27:54 debootstrap:  e2fsprogs pre-depends on util-linux (>= 2.15~rc1-1)
  605. May 23 12:27:54 debootstrap: dpkg: warning: ignoring pre-dependency problem!
  606. May 23 12:27:54 debootstrap: Unpacking e2fsprogs (from .../e2fsprogs_1.42.2-2_armhf.deb) ...
  607. May 23 12:27:56 debootstrap: Selecting previously unselected package findutils.
  608. May 23 12:27:56 debootstrap: dpkg: regarding .../findutils_4.4.2-4_armhf.deb containing findutils, pre-dependency problem:
  609. May 23 12:27:56 debootstrap:  findutils pre-depends on libgcc1 (>= 1:4.4.0)
  610. May 23 12:27:56 debootstrap: Unpacking findutils (from .../findutils_4.4.2-4_armhf.deb) ...
  611. May 23 12:27:56 debootstrap: dpkg: warning: ignoring pre-dependency problem!
  612. May 23 12:27:57 debootstrap: Selecting previously unselected package gcc-4.4-base:armhf.
  613. May 23 12:27:57 debootstrap: Unpacking gcc-4.4-base:armhf (from .../gcc-4.4-base_4.4.7-1.1+rpi1_armhf.deb) ...
  614. May 23 12:27:57 debootstrap: Selecting previously unselected package gcc-4.5-base:armhf.
  615. May 23 12:27:57 debootstrap: Unpacking gcc-4.5-base:armhf (from .../gcc-4.5-base_4.5.3-12+rpi1_armhf.deb) ...
  616. May 23 12:27:58 debootstrap: Selecting previously unselected package gcc-4.6-base:armhf.
  617. May 23 12:27:58 debootstrap: Unpacking gcc-4.6-base:armhf (from .../gcc-4.6-base_4.6.3-1.1+rpi2_armhf.deb) ...
  618. May 23 12:27:58 debootstrap: Selecting previously unselected package gcc-4.7-base:armhf.
  619. May 23 12:27:58 debootstrap: Unpacking gcc-4.7-base:armhf (from .../gcc-4.7-base_4.7.0-1.1+rpi_armhf.deb) ...
  620. May 23 12:27:58 debootstrap: Selecting previously unselected package grep.
  621. May 23 12:27:58 debootstrap: dpkg: regarding .../archives/grep_2.11-3_armhf.deb containing grep, pre-dependency problem:
  622. May 23 12:27:58 debootstrap:  grep pre-depends on libgcc1 (>= 1:4.4.0)
  623. May 23 12:27:58 debootstrap: dpkg: warning: ignoring pre-dependency problem!
  624. May 23 12:27:58 debootstrap: Unpacking grep (from .../archives/grep_2.11-3_armhf.deb) ...
  625. May 23 12:28:00 debootstrap: Selecting previously unselected package gzip.
  626. May 23 12:28:00 debootstrap: dpkg: regarding .../archives/gzip_1.4-5_armhf.deb containing gzip, pre-dependency problem:
  627. May 23 12:28:00 debootstrap:  gzip pre-depends on libgcc1 (>= 1:4.4.0)
  628. May 23 12:28:00 debootstrap: Unpacking gzip (from .../archives/gzip_1.4-5_armhf.deb) ...
  629. May 23 12:28:00 debootstrap: dpkg: warning: ignoring pre-dependency problem!
  630. May 23 12:28:00 debootstrap: Selecting previously unselected package hostname.
  631. May 23 12:28:00 debootstrap: Unpacking hostname (from .../hostname_3.11_armhf.deb) ...
  632. May 23 12:28:01 debootstrap: Selecting previously unselected package initscripts.
  633. May 23 12:28:01 debootstrap: Unpacking initscripts (from .../initscripts_2.88dsf-22.1_armhf.deb) ...
  634. May 23 12:28:02 debootstrap: Selecting previously unselected package insserv.
  635. May 23 12:28:02 debootstrap: Unpacking insserv (from .../insserv_1.14.0-3_armhf.deb) ...
  636. May 23 12:28:02 debootstrap: Selecting previously unselected package libacl1:armhf.
  637. May 23 12:28:02 debootstrap: dpkg: regarding .../libacl1_2.2.51-5_armhf.deb containing libacl1:armhf, pre-dependency problem:
  638. May 23 12:28:02 debootstrap:  libacl1 pre-depends on multiarch-support
  639. May 23 12:28:02 debootstrap:   multiarch-support is not installed.
  640. May 23 12:28:02 debootstrap: Unpacking libacl1:armhf (from .../libacl1_2.2.51-5_armhf.deb) ...
  641. May 23 12:28:02 debootstrap: dpkg: warning: ignoring pre-dependency problem!
  642. May 23 12:28:03 debootstrap: Selecting previously unselected package libattr1:armhf.
  643. May 23 12:28:03 debootstrap: dpkg: regarding .../libattr1_1%3a2.4.46-5_armhf.deb containing libattr1:armhf, pre-dependency problem:
  644. May 23 12:28:03 debootstrap:  libattr1 pre-depends on multiarch-support
  645. May 23 12:28:03 debootstrap:   multiarch-support is not installed.
  646. May 23 12:28:03 debootstrap: Unpacking libattr1:armhf (from .../libattr1_1%3a2.4.46-5_armhf.deb) ...
  647. May 23 12:28:03 debootstrap: dpkg: warning: ignoring pre-dependency problem!
  648. May 23 12:28:03 debootstrap: Selecting previously unselected package libblkid1:armhf.
  649. May 23 12:28:03 debootstrap: dpkg: regarding .../libblkid1_2.20.1-4_armhf.deb containing libblkid1:armhf, pre-dependency problem:
  650. May 23 12:28:03 debootstrap:  libblkid1 pre-depends on multiarch-support
  651. May 23 12:28:03 debootstrap:   multiarch-support is not installed.
  652. May 23 12:28:03 debootstrap: Unpacking libblkid1:armhf (from .../libblkid1_2.20.1-4_armhf.deb) ...
  653. May 23 12:28:03 debootstrap: dpkg: warning: ignoring pre-dependency problem!
  654. May 23 12:28:04 debootstrap: Selecting previously unselected package libbz2-1.0:armhf.
  655. May 23 12:28:04 debootstrap: dpkg: regarding .../libbz2-1.0_1.0.6-1_armhf.deb containing libbz2-1.0:armhf, pre-dependency problem:
  656. May 23 12:28:04 debootstrap:  libbz2-1.0 pre-depends on multiarch-support
  657. May 23 12:28:04 debootstrap:   multiarch-support is not installed.
  658. May 23 12:28:04 debootstrap: dpkg: warning: ignoring pre-dependency problem!
  659. May 23 12:28:04 debootstrap: Unpacking libbz2-1.0:armhf (from .../libbz2-1.0_1.0.6-1_armhf.deb) ...
  660. May 23 12:28:04 debootstrap: Selecting previously unselected package libc-bin.
  661. May 23 12:28:04 debootstrap: Unpacking libc-bin (from .../libc-bin_2.13-32_armhf.deb) ...
  662. May 23 12:28:06 debootstrap: Preparing to replace libc6:armhf 2.13-32 (using .../libc6_2.13-32_armhf.deb) ...
  663. May 23 12:28:11 debootstrap: Unpacking replacement libc6:armhf ...
  664. May 23 12:28:17 debootstrap: Selecting previously unselected package libcomerr2:armhf.
  665. May 23 12:28:17 debootstrap: dpkg: regarding .../libcomerr2_1.42.2-2_armhf.deb containing libcomerr2:armhf, pre-dependency problem:
  666. May 23 12:28:17 debootstrap:  libcomerr2 pre-depends on multiarch-support
  667. May 23 12:28:17 debootstrap:   multiarch-support is not installed.
  668. May 23 12:28:17 debootstrap: dpkg: warning: ignoring pre-dependency problem!
  669. May 23 12:28:17 debootstrap: Unpacking libcomerr2:armhf (from .../libcomerr2_1.42.2-2_armhf.deb) ...
  670. May 23 12:28:17 debootstrap: Selecting previously unselected package libdb5.1:armhf.
  671. May 23 12:28:17 debootstrap: dpkg: regarding .../libdb5.1_5.1.29-1_armhf.deb containing libdb5.1:armhf, pre-dependency problem:
  672. May 23 12:28:17 debootstrap:  libdb5.1 pre-depends on multiarch-support
  673. May 23 12:28:17 debootstrap:   multiarch-support is not installed.
  674. May 23 12:28:17 debootstrap: dpkg: warning: ignoring pre-dependency problem!
  675. May 23 12:28:18 debootstrap: Unpacking libdb5.1:armhf (from .../libdb5.1_5.1.29-1_armhf.deb) ...
  676. May 23 12:28:19 debootstrap: Selecting previously unselected package libdevmapper1.02.1.
  677. May 23 12:28:19 debootstrap: Unpacking libdevmapper1.02.1 (from .../libdevmapper1.02.1_2%3a1.02.67-2_armhf.deb) ...
  678. May 23 12:28:20 debootstrap: Selecting previously unselected package libgcc1:armhf.
  679. May 23 12:28:20 debootstrap: dpkg: regarding .../libgcc1_1%3a4.7.0-1.1+rpi_armhf.deb containing libgcc1:armhf, pre-dependency problem:
  680. May 23 12:28:20 debootstrap:  libgcc1 pre-depends on multiarch-support
  681. May 23 12:28:20 debootstrap:   multiarch-support is not installed.
  682. May 23 12:28:20 debootstrap: dpkg: warning: ignoring pre-dependency problem!
  683. May 23 12:28:20 debootstrap: Unpacking libgcc1:armhf (from .../libgcc1_1%3a4.7.0-1.1+rpi_armhf.deb) ...
  684. May 23 12:28:20 debootstrap: Selecting previously unselected package liblocale-gettext-perl.
  685. May 23 12:28:20 debootstrap: Unpacking liblocale-gettext-perl (from .../liblocale-gettext-perl_1.05-7_armhf.deb) ...
  686. May 23 12:28:21 debootstrap: Selecting previously unselected package liblzma5:armhf.
  687. May 23 12:28:21 debootstrap: dpkg: regarding .../liblzma5_5.1.1alpha+20110809-3_armhf.deb containing liblzma5:armhf, pre-dependency problem:
  688. May 23 12:28:21 debootstrap:  liblzma5 pre-depends on multiarch-support
  689. May 23 12:28:21 debootstrap:   multiarch-support is not installed.
  690. May 23 12:28:21 debootstrap: dpkg: warning: ignoring pre-dependency problem!
  691. May 23 12:28:21 debootstrap: Unpacking liblzma5:armhf (from .../liblzma5_5.1.1alpha+20110809-3_armhf.deb) ...
  692. May 23 12:28:22 debootstrap: Selecting previously unselected package libmount1.
  693. May 23 12:28:22 debootstrap: dpkg: regarding .../libmount1_2.20.1-4_armhf.deb containing libmount1, pre-dependency problem:
  694. May 23 12:28:22 debootstrap:  libmount1 pre-depends on multiarch-support
  695. May 23 12:28:22 debootstrap:   multiarch-support is not installed.
  696. May 23 12:28:22 debootstrap: dpkg: warning: ignoring pre-dependency problem!
  697. May 23 12:28:22 debootstrap: Unpacking libmount1 (from .../libmount1_2.20.1-4_armhf.deb) ...
  698. May 23 12:28:23 debootstrap: Selecting previously unselected package libncurses5:armhf.
  699. May 23 12:28:23 debootstrap: dpkg: regarding .../libncurses5_5.9-7_armhf.deb containing libncurses5:armhf, pre-dependency problem:
  700. May 23 12:28:23 debootstrap:  libncurses5 pre-depends on multiarch-support
  701. May 23 12:28:23 debootstrap:   multiarch-support is not installed.
  702. May 23 12:28:23 debootstrap: dpkg: warning: ignoring pre-dependency problem!
  703. May 23 12:28:23 debootstrap: dpkg: regarding .../libncurses5_5.9-7_armhf.deb containing libncurses5:armhf, pre-dependency problem:
  704. May 23 12:28:23 debootstrap:  libncurses5 pre-depends on libtinfo5 (>= 5.9-3)
  705. May 23 12:28:23 debootstrap: dpkg: warning: ignoring pre-dependency problem!
  706. May 23 12:28:23 debootstrap: Unpacking libncurses5:armhf (from .../libncurses5_5.9-7_armhf.deb) ...
  707. May 23 12:28:23 debootstrap: Selecting previously unselected package libncursesw5:armhf.
  708. May 23 12:28:23 debootstrap: dpkg: regarding .../libncursesw5_5.9-7_armhf.deb containing libncursesw5:armhf, pre-dependency problem:
  709. May 23 12:28:23 debootstrap:  libncursesw5 pre-depends on multiarch-support
  710. May 23 12:28:23 debootstrap:   multiarch-support is not installed.
  711. May 23 12:28:23 debootstrap: dpkg: warning: ignoring pre-dependency problem!
  712. May 23 12:28:23 debootstrap: Unpacking libncursesw5:armhf (from .../libncursesw5_5.9-7_armhf.deb) ...
  713. May 23 12:28:24 debootstrap: Selecting previously unselected package libpam-modules:armhf.
  714. May 23 12:28:24 debootstrap: dpkg: regarding .../libpam-modules_1.1.3-7.1_armhf.deb containing libpam-modules:armhf, pre-dependency problem:
  715. May 23 12:28:24 debootstrap:  libpam-modules pre-depends on libdb5.1
  716. May 23 12:28:24 debootstrap:   libdb5.1:armhf is unpacked, but has never been configured.
  717. May 23 12:28:24 debootstrap: dpkg: warning: ignoring pre-dependency problem!
  718. May 23 12:28:24 debootstrap: dpkg: regarding .../libpam-modules_1.1.3-7.1_armhf.deb containing libpam-modules:armhf, pre-dependency problem:
  719. May 23 12:28:24 debootstrap:  libpam-modules pre-depends on libpam0g (>= 1.1.3-2)
  720. May 23 12:28:24 debootstrap: dpkg: warning: ignoring pre-dependency problem!
  721. May 23 12:28:24 debootstrap: dpkg: regarding .../libpam-modules_1.1.3-7.1_armhf.deb containing libpam-modules:armhf, pre-dependency problem:
  722. May 23 12:28:24 debootstrap:  libpam-modules pre-depends on libselinux1 (>= 2.0.85)
  723. May 23 12:28:24 debootstrap: dpkg: warning: ignoring pre-dependency problem!
  724. May 23 12:28:24 debootstrap: dpkg: regarding .../libpam-modules_1.1.3-7.1_armhf.deb containing libpam-modules:armhf, pre-dependency problem:
  725. May 23 12:28:24 debootstrap:  libpam-modules pre-depends on libpam-modules-bin (= 1.1.3-7.1)
  726. May 23 12:28:24 debootstrap: dpkg: warning: ignoring pre-dependency problem!
  727. May 23 12:28:24 debootstrap: Unpacking libpam-modules:armhf (from .../libpam-modules_1.1.3-7.1_armhf.deb) ...
  728. May 23 12:28:28 debootstrap: Selecting previously unselected package libpam-modules-bin.
  729. May 23 12:28:28 debootstrap: Unpacking libpam-modules-bin (from .../libpam-modules-bin_1.1.3-7.1_armhf.deb) ...
  730. May 23 12:28:28 debootstrap: Selecting previously unselected package libpam-runtime.
  731. May 23 12:28:28 debootstrap: Unpacking libpam-runtime (from .../libpam-runtime_1.1.3-7.1_all.deb) ...
  732. May 23 12:28:30 debootstrap: Selecting previously unselected package libpam0g:armhf.
  733. May 23 12:28:30 debootstrap: dpkg: regarding .../libpam0g_1.1.3-7.1_armhf.deb containing libpam0g:armhf, pre-dependency problem:
  734. May 23 12:28:30 debootstrap:  libpam0g pre-depends on multiarch-support
  735. May 23 12:28:30 debootstrap:   multiarch-support is not installed.
  736. May 23 12:28:30 debootstrap: dpkg: warning: ignoring pre-dependency problem!
  737. May 23 12:28:30 debootstrap: Unpacking libpam0g:armhf (from .../libpam0g_1.1.3-7.1_armhf.deb) ...
  738. May 23 12:28:30 debootstrap: Selecting previously unselected package libselinux1:armhf.
  739. May 23 12:28:30 debootstrap: dpkg: regarding .../libselinux1_2.1.9-2_armhf.deb containing libselinux1:armhf, pre-dependency problem:
  740. May 23 12:28:30 debootstrap:  libselinux1 pre-depends on multiarch-support
  741. May 23 12:28:30 debootstrap:   multiarch-support is not installed.
  742. May 23 12:28:30 debootstrap: dpkg: warning: ignoring pre-dependency problem!
  743. May 23 12:28:30 debootstrap: Unpacking libselinux1:armhf (from .../libselinux1_2.1.9-2_armhf.deb) ...
  744. May 23 12:28:31 debootstrap: Selecting previously unselected package libsemanage-common.
  745. May 23 12:28:31 debootstrap: Unpacking libsemanage-common (from .../libsemanage-common_2.1.6-2_all.deb) ...
  746. May 23 12:28:31 debootstrap: Selecting previously unselected package libsemanage1.
  747. May 23 12:28:31 debootstrap: Unpacking libsemanage1 (from .../libsemanage1_2.1.6-2_armhf.deb) ...
  748. May 23 12:28:32 debootstrap: Selecting previously unselected package libsepol1:armhf.
  749. May 23 12:28:32 debootstrap: dpkg: regarding .../libsepol1_2.1.4-3_armhf.deb containing libsepol1:armhf, pre-dependency problem:
  750. May 23 12:28:32 debootstrap:  libsepol1 pre-depends on multiarch-support
  751. May 23 12:28:32 debootstrap:   multiarch-support is not installed.
  752. May 23 12:28:32 debootstrap: Unpacking libsepol1:armhf (from .../libsepol1_2.1.4-3_armhf.deb) ...
  753. May 23 12:28:32 debootstrap: dpkg: warning: ignoring pre-dependency problem!
  754. May 23 12:28:33 debootstrap: Selecting previously unselected package libslang2:armhf.
  755. May 23 12:28:33 debootstrap: dpkg: regarding .../libslang2_2.2.4-10_armhf.deb containing libslang2:armhf, pre-dependency problem:
  756. May 23 12:28:33 debootstrap:  libslang2 pre-depends on multiarch-support
  757. May 23 12:28:33 debootstrap:   multiarch-support is not installed.
  758. May 23 12:28:33 debootstrap: dpkg: warning: ignoring pre-dependency problem!
  759. May 23 12:28:33 debootstrap: Unpacking libslang2:armhf (from .../libslang2_2.2.4-10_armhf.deb) ...
  760. May 23 12:28:34 debootstrap: Selecting previously unselected package libss2:armhf.
  761. May 23 12:28:34 debootstrap: dpkg: regarding .../libss2_1.42.2-2_armhf.deb containing libss2:armhf, pre-dependency problem:
  762. May 23 12:28:34 debootstrap:  libss2 pre-depends on multiarch-support
  763. May 23 12:28:34 debootstrap:   multiarch-support is not installed.
  764. May 23 12:28:34 debootstrap: dpkg: warning: ignoring pre-dependency problem!
  765. May 23 12:28:34 debootstrap: Unpacking libss2:armhf (from .../libss2_1.42.2-2_armhf.deb) ...
  766. May 23 12:28:34 debootstrap: Selecting previously unselected package libtext-charwidth-perl.
  767. May 23 12:28:34 debootstrap: Unpacking libtext-charwidth-perl (from .../libtext-charwidth-perl_0.04-7_armhf.deb) ...
  768. May 23 12:28:35 debootstrap: Selecting previously unselected package libtext-iconv-perl.
  769. May 23 12:28:35 debootstrap: Unpacking libtext-iconv-perl (from .../libtext-iconv-perl_1.7-5_armhf.deb) ...
  770. May 23 12:28:35 debootstrap: Selecting previously unselected package libtext-wrapi18n-perl.
  771. May 23 12:28:35 debootstrap: Unpacking libtext-wrapi18n-perl (from .../libtext-wrapi18n-perl_0.06-7_all.deb) ...
  772. May 23 12:28:36 debootstrap: Selecting previously unselected package libtinfo5:armhf.
  773. May 23 12:28:36 debootstrap: dpkg: regarding .../libtinfo5_5.9-7_armhf.deb containing libtinfo5:armhf, pre-dependency problem:
  774. May 23 12:28:36 debootstrap:  libtinfo5 pre-depends on multiarch-support
  775. May 23 12:28:36 debootstrap:   multiarch-support is not installed.
  776. May 23 12:28:36 debootstrap: dpkg: warning: ignoring pre-dependency problem!
  777. May 23 12:28:36 debootstrap: Unpacking libtinfo5:armhf (from .../libtinfo5_5.9-7_armhf.deb) ...
  778. May 23 12:28:36 debootstrap: Selecting previously unselected package libudev0:armhf.
  779. May 23 12:28:36 debootstrap: dpkg: regarding .../libudev0_175-3.1_armhf.deb containing libudev0:armhf, pre-dependency problem:
  780. May 23 12:28:36 debootstrap:  libudev0 pre-depends on multiarch-support
  781. May 23 12:28:36 debootstrap:   multiarch-support is not installed.
  782. May 23 12:28:36 debootstrap: Unpacking libudev0:armhf (from .../libudev0_175-3.1_armhf.deb) ...
  783. May 23 12:28:36 debootstrap: dpkg: warning: ignoring pre-dependency problem!
  784. May 23 12:28:37 debootstrap: Selecting previously unselected package libustr-1.0-1.
  785. May 23 12:28:37 debootstrap: Unpacking libustr-1.0-1 (from .../libustr-1.0-1_1.0.4-2_armhf.deb) ...
  786. May 23 12:28:37 debootstrap: Selecting previously unselected package libuuid1:armhf.
  787. May 23 12:28:37 debootstrap: dpkg: regarding .../libuuid1_2.20.1-4_armhf.deb containing libuuid1:armhf, pre-dependency problem:
  788. May 23 12:28:37 debootstrap:  libuuid1 pre-depends on multiarch-support
  789. May 23 12:28:37 debootstrap:   multiarch-support is not installed.
  790. May 23 12:28:37 debootstrap: dpkg: warning: ignoring pre-dependency problem!
  791. May 23 12:28:37 debootstrap: Unpacking libuuid1:armhf (from .../libuuid1_2.20.1-4_armhf.deb) ...
  792. May 23 12:28:38 debootstrap: Selecting previously unselected package login.
  793. May 23 12:28:38 debootstrap: dpkg: regarding .../login_1%3a4.1.5-1_armhf.deb containing login, pre-dependency problem:
  794. May 23 12:28:38 debootstrap:  login pre-depends on libgcc1 (>= 1:4.4.0)
  795. May 23 12:28:38 debootstrap:   libgcc1:armhf is unpacked, but has never been configured.
  796. May 23 12:28:38 debootstrap: dpkg: warning: ignoring pre-dependency problem!
  797. May 23 12:28:38 debootstrap: dpkg: regarding .../login_1%3a4.1.5-1_armhf.deb containing login, pre-dependency problem:
  798. May 23 12:28:38 debootstrap:  login pre-depends on libpam0g (>= 0.99.7.1)
  799. May 23 12:28:38 debootstrap:   libpam0g:armhf is unpacked, but has never been configured.
  800. May 23 12:28:38 debootstrap: dpkg: warning: ignoring pre-dependency problem!
  801. May 23 12:28:38 debootstrap: dpkg: regarding .../login_1%3a4.1.5-1_armhf.deb containing login, pre-dependency problem:
  802. May 23 12:28:38 debootstrap:  login pre-depends on libpam-runtime
  803. May 23 12:28:38 debootstrap:   libpam-runtime is unpacked, but has never been configured.
  804. May 23 12:28:38 debootstrap: dpkg: warning: ignoring pre-dependency problem!
  805. May 23 12:28:38 debootstrap: dpkg: regarding .../login_1%3a4.1.5-1_armhf.deb containing login, pre-dependency problem:
  806. May 23 12:28:38 debootstrap:  login pre-depends on libpam-modules
  807. May 23 12:28:38 debootstrap:   libpam-modules:armhf is unpacked, but has never been configured.
  808. May 23 12:28:38 debootstrap: dpkg: warning: ignoring pre-dependency problem!
  809. May 23 12:28:38 debootstrap: Unpacking login (from .../login_1%3a4.1.5-1_armhf.deb) ...
  810. May 23 12:28:42 debootstrap: Selecting previously unselected package lsb-base.
  811. May 23 12:28:42 debootstrap: Unpacking lsb-base (from .../lsb-base_4.1+Debian3_all.deb) ...
  812. May 23 12:28:42 debootstrap: Preparing to replace mawk 1.3.3-17 (using .../mawk_1.3.3-17_armhf.deb) ...
  813. May 23 12:28:43 debootstrap: Unpacking replacement mawk ...
  814. May 23 12:28:43 debootstrap: Selecting previously unselected package mount.
  815. May 23 12:28:43 debootstrap: dpkg: regarding .../mount_2.20.1-4_armhf.deb containing mount, pre-dependency problem:
  816. May 23 12:28:43 debootstrap:  mount pre-depends on libblkid1 (>= 2.20.1)
  817. May 23 12:28:43 debootstrap:   libblkid1:armhf is unpacked, but has never been configured.
  818. May 23 12:28:43 debootstrap: dpkg: warning: ignoring pre-dependency problem!
  819. May 23 12:28:43 debootstrap: dpkg: regarding .../mount_2.20.1-4_armhf.deb containing mount, pre-dependency problem:
  820. May 23 12:28:43 debootstrap:  mount pre-depends on libgcc1 (>= 1:4.4.0)
  821. May 23 12:28:43 debootstrap:   libgcc1:armhf is unpacked, but has never been configured.
  822. May 23 12:28:43 debootstrap: dpkg: warning: ignoring pre-dependency problem!
  823. May 23 12:28:43 debootstrap: dpkg: regarding .../mount_2.20.1-4_armhf.deb containing mount, pre-dependency problem:
  824. May 23 12:28:43 debootstrap:  mount pre-depends on libmount1 (>= 2.20.1)
  825. May 23 12:28:43 debootstrap:   libmount1 is unpacked, but has never been configured.
  826. May 23 12:28:43 debootstrap: dpkg: warning: ignoring pre-dependency problem!
  827. May 23 12:28:43 debootstrap: dpkg: regarding .../mount_2.20.1-4_armhf.deb containing mount, pre-dependency problem:
  828. May 23 12:28:43 debootstrap:  mount pre-depends on libselinux1 (>= 2.0.15)
  829. May 23 12:28:43 debootstrap:   libselinux1:armhf is unpacked, but has never been configured.
  830. May 23 12:28:43 debootstrap: dpkg: warning: ignoring pre-dependency problem!
  831. May 23 12:28:43 debootstrap: Unpacking mount (from .../mount_2.20.1-4_armhf.deb) ...
  832. May 23 12:28:44 debootstrap: Selecting previously unselected package multiarch-support.
  833. May 23 12:28:44 debootstrap: Unpacking multiarch-support (from .../multiarch-support_2.13-32_armhf.deb) ...
  834. May 23 12:28:45 debootstrap: Selecting previously unselected package ncurses-base.
  835. May 23 12:28:45 debootstrap: Unpacking ncurses-base (from .../ncurses-base_5.9-7_all.deb) ...
  836. May 23 12:28:46 debootstrap: Selecting previously unselected package ncurses-bin.
  837. May 23 12:28:46 debootstrap: dpkg: regarding .../ncurses-bin_5.9-7_armhf.deb containing ncurses-bin, pre-dependency problem:
  838. May 23 12:28:46 debootstrap:  ncurses-bin pre-depends on libtinfo5 (>= 5.9-3~)
  839. May 23 12:28:46 debootstrap:   libtinfo5:armhf is unpacked, but has never been configured.
  840. May 23 12:28:46 debootstrap: Unpacking ncurses-bin (from .../ncurses-bin_5.9-7_armhf.deb) ...
  841. May 23 12:28:46 debootstrap: dpkg: warning: ignoring pre-dependency problem!
  842. May 23 12:28:46 debootstrap: Selecting previously unselected package passwd.
  843. May 23 12:28:46 debootstrap: Unpacking passwd (from .../passwd_1%3a4.1.5-1_armhf.deb) ...
  844. May 23 12:28:52 debootstrap: dpkg: regarding .../perl-base_5.14.2-9_armhf.deb containing perl-base, pre-dependency problem:
  845. May 23 12:28:52 debootstrap:  perl-base pre-depends on libgcc1 (>= 1:4.4.0)
  846. May 23 12:28:52 debootstrap:   libgcc1:armhf is unpacked, but has never been configured.
  847. May 23 12:28:52 debootstrap: dpkg: warning: ignoring pre-dependency problem!
  848. May 23 12:28:52 debootstrap: Preparing to replace perl-base 5.14.2-9 (using .../perl-base_5.14.2-9_armhf.deb) ...
  849. May 23 12:28:52 debootstrap: Unpacking replacement perl-base ...
  850. May 23 12:28:58 debootstrap: Selecting previously unselected package sed.
  851. May 23 12:28:58 debootstrap: dpkg: regarding .../archives/sed_4.2.1-9_armhf.deb containing sed, pre-dependency problem:
  852. May 23 12:28:58 debootstrap:  sed pre-depends on libselinux1 (>= 1.32)
  853. May 23 12:28:58 debootstrap:   libselinux1:armhf is unpacked, but has never been configured.
  854. May 23 12:28:58 debootstrap: dpkg: warning: ignoring pre-dependency problem!
  855. May 23 12:28:58 debootstrap: Unpacking sed (from .../archives/sed_4.2.1-9_armhf.deb) ...
  856. May 23 12:28:58 debootstrap: Selecting previously unselected package sensible-utils.
  857. May 23 12:28:58 debootstrap: Unpacking sensible-utils (from .../sensible-utils_0.0.6_all.deb) ...
  858. May 23 12:28:59 debootstrap: Selecting previously unselected package sysv-rc.
  859. May 23 12:28:59 debootstrap: Unpacking sysv-rc (from .../sysv-rc_2.88dsf-22.1_all.deb) ...
  860. May 23 12:29:00 debootstrap: Selecting previously unselected package sysvinit.
  861. May 23 12:29:00 debootstrap: dpkg: regarding .../sysvinit_2.88dsf-22.1_armhf.deb containing sysvinit, pre-dependency problem:
  862. May 23 12:29:00 debootstrap:  sysvinit pre-depends on initscripts (>= 2.88dsf-13.3)
  863. May 23 12:29:00 debootstrap:   initscripts is unpacked, but has never been configured.
  864. May 23 12:29:00 debootstrap: dpkg: warning: ignoring pre-dependency problem!
  865. May 23 12:29:00 debootstrap: dpkg: regarding .../sysvinit_2.88dsf-22.1_armhf.deb containing sysvinit, pre-dependency problem:
  866. May 23 12:29:00 debootstrap:  sysvinit pre-depends on sysv-rc | file-rc
  867. May 23 12:29:00 debootstrap:   sysv-rc is unpacked, but has never been configured.
  868. May 23 12:29:00 debootstrap:   file-rc is not installed.
  869. May 23 12:29:00 debootstrap: dpkg: warning: ignoring pre-dependency problem!
  870. May 23 12:29:00 debootstrap: dpkg: regarding .../sysvinit_2.88dsf-22.1_armhf.deb containing sysvinit, pre-dependency problem:
  871. May 23 12:29:00 debootstrap:  sysvinit pre-depends on sysvinit-utils (>= 2.86.ds1-66)
  872. May 23 12:29:00 debootstrap: dpkg: warning: ignoring pre-dependency problem!
  873. May 23 12:29:00 debootstrap: Unpacking sysvinit (from .../sysvinit_2.88dsf-22.1_armhf.deb) ...
  874. May 23 12:29:00 debootstrap: Selecting previously unselected package sysvinit-utils.
  875. May 23 12:29:00 debootstrap: Unpacking sysvinit-utils (from .../sysvinit-utils_2.88dsf-22.1_armhf.deb) ...
  876. May 23 12:29:01 debootstrap: Selecting previously unselected package tar.
  877. May 23 12:29:01 debootstrap: dpkg: regarding .../archives/tar_1.26-4_armhf.deb containing tar, pre-dependency problem:
  878. May 23 12:29:01 debootstrap:  tar pre-depends on libgcc1 (>= 1:4.4.0)
  879. May 23 12:29:01 debootstrap:   libgcc1:armhf is unpacked, but has never been configured.
  880. May 23 12:29:01 debootstrap: dpkg: warning: ignoring pre-dependency problem!
  881. May 23 12:29:01 debootstrap: Unpacking tar (from .../archives/tar_1.26-4_armhf.deb) ...
  882. May 23 12:29:04 debootstrap: Selecting previously unselected package tzdata.
  883. May 23 12:29:04 debootstrap: Unpacking tzdata (from .../tzdata_2012c-1_all.deb) ...
  884. May 23 12:29:10 debootstrap: Selecting previously unselected package ucf.
  885. May 23 12:29:10 debootstrap: Unpacking ucf (from .../ucf_3.0025+nmu3_all.deb) ...
  886. May 23 12:29:10 debootstrap: Moving old data out of the way
  887. May 23 12:29:11 debootstrap: Selecting previously unselected package util-linux.
  888. May 23 12:29:11 debootstrap: dpkg: regarding .../util-linux_2.20.1-4_armhf.deb containing util-linux, pre-dependency problem:
  889. May 23 12:29:11 debootstrap:  util-linux pre-depends on libblkid1 (>= 2.20.1)
  890. May 23 12:29:11 debootstrap:   libblkid1:armhf is unpacked, but has never been configured.
  891. May 23 12:29:11 debootstrap: dpkg: warning: ignoring pre-dependency problem!
  892. May 23 12:29:11 debootstrap: dpkg: regarding .../util-linux_2.20.1-4_armhf.deb containing util-linux, pre-dependency problem:
  893. May 23 12:29:11 debootstrap:  util-linux pre-depends on libgcc1 (>= 1:4.4.0)
  894. May 23 12:29:11 debootstrap:   libgcc1:armhf is unpacked, but has never been configured.
  895. May 23 12:29:11 debootstrap: dpkg: warning: ignoring pre-dependency problem!
  896. May 23 12:29:11 debootstrap: dpkg: regarding .../util-linux_2.20.1-4_armhf.deb containing util-linux, pre-dependency problem:
  897. May 23 12:29:11 debootstrap:  util-linux pre-depends on libncursesw5 (>= 5.6+20070908)
  898. May 23 12:29:11 debootstrap:   libncursesw5:armhf is unpacked, but has never been configured.
  899. May 23 12:29:11 debootstrap: dpkg: warning: ignoring pre-dependency problem!
  900. May 23 12:29:11 debootstrap: dpkg: regarding .../util-linux_2.20.1-4_armhf.deb containing util-linux, pre-dependency problem:
  901. May 23 12:29:11 debootstrap:  util-linux pre-depends on libselinux1 (>= 1.32)
  902. May 23 12:29:11 debootstrap:   libselinux1:armhf is unpacked, but has never been configured.
  903. May 23 12:29:11 debootstrap: dpkg: warning: ignoring pre-dependency problem!
  904. May 23 12:29:11 debootstrap: dpkg: regarding .../util-linux_2.20.1-4_armhf.deb containing util-linux, pre-dependency problem:
  905. May 23 12:29:11 debootstrap:  util-linux pre-depends on libslang2 (>= 2.0.7-1)
  906. May 23 12:29:11 debootstrap:   libslang2:armhf is unpacked, but has never been configured.
  907. May 23 12:29:11 debootstrap: dpkg: warning: ignoring pre-dependency problem!
  908. May 23 12:29:11 debootstrap: dpkg: regarding .../util-linux_2.20.1-4_armhf.deb containing util-linux, pre-dependency problem:
  909. May 23 12:29:11 debootstrap:  util-linux pre-depends on libtinfo5
  910. May 23 12:29:11 debootstrap:   libtinfo5:armhf is unpacked, but has never been configured.
  911. May 23 12:29:11 debootstrap: dpkg: warning: ignoring pre-dependency problem!
  912. May 23 12:29:11 debootstrap: dpkg: regarding .../util-linux_2.20.1-4_armhf.deb containing util-linux, pre-dependency problem:
  913. May 23 12:29:11 debootstrap:  util-linux pre-depends on libuuid1 (>= 2.16)
  914. May 23 12:29:11 debootstrap:   libuuid1:armhf is unpacked, but has never been configured.
  915. May 23 12:29:11 debootstrap: dpkg: warning: ignoring pre-dependency problem!
  916. May 23 12:29:11 debootstrap: dpkg: regarding .../util-linux_2.20.1-4_armhf.deb containing util-linux, pre-dependency problem:
  917. May 23 12:29:11 debootstrap:  util-linux pre-depends on zlib1g (>= 1:1.1.4)
  918. May 23 12:29:11 debootstrap: dpkg: warning: ignoring pre-dependency problem!
  919. May 23 12:29:11 debootstrap: Unpacking util-linux (from .../util-linux_2.20.1-4_armhf.deb) ...
  920. May 23 12:29:12 debootstrap: Selecting previously unselected package xz-utils.
  921. May 23 12:29:12 debootstrap: Unpacking xz-utils (from .../xz-utils_5.1.1alpha+20110809-3_armhf.deb) ...
  922. May 23 12:29:13 debootstrap: Selecting previously unselected package zlib1g:armhf.
  923. May 23 12:29:13 debootstrap: dpkg: regarding .../zlib1g_1%3a1.2.7.dfsg-1_armhf.deb containing zlib1g:armhf, pre-dependency problem:
  924. May 23 12:29:13 debootstrap:  zlib1g pre-depends on multiarch-support
  925. May 23 12:29:13 debootstrap:   multiarch-support is unpacked, but has never been configured.
  926. May 23 12:29:13 debootstrap: dpkg: warning: ignoring pre-dependency problem!
  927. May 23 12:29:13 debootstrap: Unpacking zlib1g:armhf (from .../zlib1g_1%3a1.2.7.dfsg-1_armhf.deb) ...
  928. May 23 12:29:14 debootstrap: Setting up lsb-base (4.1+Debian3) ...
  929. May 23 12:29:14 debootstrap: Setting up ncurses-base (5.9-7) ...
  930. May 23 12:29:15 debootstrap: Setting up sensible-utils (0.0.6) ...
  931. May 23 12:29:15 debootstrap: Setting up libsemanage-common (2.1.6-2) ...
  932. May 23 12:29:15 debootstrap: Setting up gcc-4.7-base:armhf (4.7.0-1.1+rpi) ...
  933. May 23 12:29:15 debootstrap: Setting up libc-bin (2.13-32) ...
  934. May 23 12:29:16 debootstrap: Setting up gcc-4.5-base:armhf (4.5.3-12+rpi1) ...
  935. May 23 12:29:16 debootstrap: Setting up gcc-4.6-base:armhf (4.6.3-1.1+rpi2) ...
  936. May 23 12:29:16 debootstrap: Setting up gcc-4.4-base:armhf (4.4.7-1.1+rpi1) ...
  937. May 23 12:29:16 debootstrap: Setting up libc6:armhf (2.13-32) ...
  938. May 23 12:29:29 debootstrap: Setting up debianutils (4.3) ...
  939. May 23 12:29:29 debootstrap: Setting up base-passwd (3.5.24) ...
  940. May 23 12:29:29 debootstrap: Setting up mawk (1.3.3-17) ...
  941. May 23 12:29:29 debootstrap: Setting up hostname (3.11) ...
  942. May 23 12:29:29 debootstrap: Setting up insserv (1.14.0-3) ...
  943. May 23 12:29:29 debootstrap: Setting up multiarch-support (2.13-32) ...
  944. May 23 12:29:29 debootstrap: Setting up libselinux1:armhf (2.1.9-2) ...
  945. May 23 12:29:31 debootstrap: Setting up libsepol1:armhf (2.1.4-3) ...
  946. May 23 12:29:32 debootstrap: Setting up libgcc1:armhf (1:4.7.0-1.1+rpi) ...
  947. May 23 12:29:32 debootstrap: Setting up base-files (6.7) ...
  948. May 23 12:29:33 debootstrap: Setting up libattr1:armhf (1:2.4.46-5) ...
  949. May 23 12:29:33 debootstrap: Setting up e2fslibs:armhf (1.42.2-2) ...
  950. May 23 12:29:33 debootstrap: Setting up libcomerr2:armhf (1.42.2-2) ...
  951. May 23 12:29:33 debootstrap: Setting up libacl1:armhf (2.2.51-5) ...
  952. May 23 12:29:33 debootstrap: Setting up libslang2:armhf (2.2.4-10) ...
  953. May 23 12:29:33 debootstrap: Setting up libss2:armhf (1.42.2-2) ...
  954. May 23 12:29:34 debootstrap: Setting up liblzma5:armhf (5.1.1alpha+20110809-3) ...
  955. May 23 12:29:34 debootstrap: Setting up libdb5.1:armhf (5.1.29-1) ...
  956. May 23 12:29:34 debootstrap: Setting up libbz2-1.0:armhf (1.0.6-1) ...
  957. May 23 12:29:34 debootstrap: Setting up libtinfo5:armhf (5.9-7) ...
  958. May 23 12:29:34 debootstrap: Setting up sysvinit-utils (2.88dsf-22.1) ...
  959. May 23 12:29:34 debootstrap: Setting up libustr-1.0-1 (1.0.4-2) ...
  960. May 23 12:29:35 debootstrap: Setting up bsdutils (1:2.20.1-4) ...
  961. May 23 12:29:35 debootstrap: Setting up ncurses-bin (5.9-7) ...
  962. May 23 12:29:35 debootstrap: Setting up libudev0:armhf (175-3.1) ...
  963. May 23 12:29:35 debootstrap: Setting up libsemanage1 (2.1.6-2) ...
  964. May 23 12:29:35 debootstrap: Setting up tar (1.26-4) ...
  965. May 23 12:29:35 debootstrap: update-alternatives:
  966. May 23 12:29:35 debootstrap: using /usr/sbin/rmt-tar to provide /usr/sbin/rmt (rmt) in auto mode.
  967. May 23 12:29:35 debootstrap:
  968. May 23 12:29:35 debootstrap: Setting up zlib1g:armhf (1:1.2.7.dfsg-1) ...
  969. May 23 12:29:36 debootstrap: Setting up libncurses5:armhf (5.9-7) ...
  970. May 23 12:29:36 debootstrap: Setting up libdevmapper1.02.1 (2:1.02.67-2) ...
  971. May 23 12:29:36 debootstrap: Setting up xz-utils (5.1.1alpha+20110809-3) ...
  972. May 23 12:29:36 debootstrap: Setting up dpkg (1.16.3) ...
  973. May 23 12:29:37 debootstrap: Setting up libncursesw5:armhf (5.9-7) ...
  974. May 23 12:29:37 debootstrap: Setting up dash (0.5.7-3) ...
  975. May 23 12:29:42 debootstrap: Setting up coreutils (8.13-3.2) ...
  976. May 23 12:29:42 debootstrap: Setting up perl-base (5.14.2-9) ...
  977. May 23 12:29:42 debootstrap: Setting up diffutils (1:3.2-6) ...
  978. May 23 12:29:42 debootstrap: Setting up libtext-iconv-perl (1.7-5) ...
  979. May 23 12:29:42 debootstrap: Setting up sed (4.2.1-9) ...
  980. May 23 12:29:42 debootstrap: Setting up grep (2.11-3) ...
  981. May 23 12:29:43 debootstrap: Setting up findutils (4.4.2-4) ...
  982. May 23 12:29:43 debootstrap: Setting up gzip (1.4-5) ...
  983. May 23 12:29:43 debootstrap: Setting up liblocale-gettext-perl (1.05-7) ...
  984. May 23 12:29:43 debootstrap: Setting up bash (4.2-2) ...
  985. May 23 12:29:43 debootstrap: update-alternatives:
  986. May 23 12:29:43 debootstrap: using /usr/share/man/man7/bash-builtins.7.gz to provide /usr/share/man/man7/builtins.7.gz (builtins.7.gz) in auto mode.
  987. May 23 12:29:43 debootstrap:
  988. May 23 12:29:44 debootstrap: Setting up libtext-charwidth-perl (0.04-7) ...
  989. May 23 12:29:44 debootstrap: Setting up libtext-wrapi18n-perl (0.06-7) ...
  990. May 23 12:29:44 debootstrap: Setting up debconf (1.5.43) ...
  991. May 23 12:29:49 debootstrap: Setting up libpam0g:armhf (1.1.3-7.1) ...
  992. May 23 12:29:53 debootstrap: Setting up ucf (3.0025+nmu3) ...
  993. May 23 12:29:57 debootstrap: Setting up sysv-rc (2.88dsf-22.1) ...
  994. May 23 12:30:03 debootstrap: Setting up tzdata (2012c-1) ...
  995. May 23 12:30:07 debootstrap:
  996. May 23 12:30:07 debootstrap: Current default time zone: 'Etc/UTC'
  997. May 23 12:30:07 debootstrap: Local time is now:      Wed May 23 12:30:07 UTC 2012.
  998. May 23 12:30:07 debootstrap: Universal Time is now:  Wed May 23 12:30:07 UTC 2012.
  999. May 23 12:30:07 debootstrap: Run 'dpkg-reconfigure tzdata' if you wish to change it.
  1000. May 23 12:30:07 debootstrap:
  1001. May 23 12:30:08 debootstrap: Setting up debconf-i18n (1.5.43) ...
  1002. May 23 12:30:08 debootstrap: Setting up initscripts (2.88dsf-22.1) ...
  1003. May 23 12:30:32 debootstrap: Setting up libpam-modules-bin (1.1.3-7.1) ...
  1004. May 23 12:30:32 debootstrap: Setting up libpam-modules:armhf (1.1.3-7.1) ...
  1005. May 23 12:30:33 debootstrap: Setting up passwd (1:4.1.5-1) ...
  1006. May 23 12:30:33 debootstrap: Usage: grpck [options] [group [gshadow]]
  1007. May 23 12:30:33 debootstrap:
  1008. May 23 12:30:33 debootstrap: Options:
  1009. May 23 12:30:33 debootstrap:   -h, --help                    display this help message and exit
  1010. May 23 12:30:33 debootstrap:   -r, --read-only               display errors and warnings
  1011. May 23 12:30:33 debootstrap:                                 but do not change files
  1012. May 23 12:30:33 debootstrap:   -R, --root CHROOT_DIR         directory to chroot into
  1013. May 23 12:30:33 debootstrap:   -s, --sort                    sort entries by UID
  1014. May 23 12:30:33 debootstrap:
  1015. May 23 12:30:33 debootstrap: Shadow passwords are now on.
  1016. May 23 12:30:34 debootstrap: Setting up libpam-runtime (1.1.3-7.1) ...
  1017. May 23 12:30:40 debootstrap: Setting up sysvinit (2.88dsf-22.1) ...
  1018. May 23 12:30:40 debootstrap: sysvinit: creating /run/initctl
  1019. May 23 12:30:40 debootstrap: Not restarting sysvinit: chroot detected
  1020. May 23 12:30:40 debootstrap: Setting up login (1:4.1.5-1) ...
  1021. May 23 12:30:40 debootstrap: Setting up libuuid1:armhf (2.20.1-4) ...
  1022. May 23 12:30:41 debootstrap: Setting up libblkid1:armhf (2.20.1-4) ...
  1023. May 23 12:30:41 debootstrap: Setting up util-linux (2.20.1-4) ...
  1024. May 23 12:30:42 debootstrap: update-alternatives:
  1025. May 23 12:30:42 debootstrap: using /bin/more to provide /usr/bin/pager (pager) in auto mode.
  1026. May 23 12:30:42 debootstrap:
  1027. May 23 12:30:44 debootstrap: Setting up libmount1 (2.20.1-4) ...
  1028. May 23 12:30:44 debootstrap: Setting up mount (2.20.1-4) ...
  1029. May 23 12:30:44 debootstrap: Setting up e2fsprogs (1.42.2-2) ...
  1030. May 23 12:30:44 debootstrap: Setting up dmsetup (2:1.02.67-2) ...
  1031. May 23 12:30:58 debootstrap: (Reading database ...
  1032. May 23 12:30:59 debootstrap: 6309 files and directories currently installed.)
  1033. May 23 12:30:59 debootstrap: Unpacking adduser (from .../adduser_3.113+nmu1_all.deb) ...
  1034. May 23 12:31:01 debootstrap: Unpacking apt (from .../archives/apt_0.9.3_armhf.deb) ...
  1035. May 23 12:31:04 debootstrap: Unpacking apt-utils (from .../apt-utils_0.9.3_armhf.deb) ...
  1036. May 23 12:31:06 debootstrap: Unpacking aptitude (from .../aptitude_0.6.7-1+b1_armhf.deb) ...
  1037. May 23 12:31:22 debootstrap: Unpacking bsdmainutils (from .../bsdmainutils_9.0.1_armhf.deb) ...
  1038. May 23 12:31:23 debootstrap: Unpacking cpio (from .../archives/cpio_2.11-7_armhf.deb) ...
  1039. May 23 12:31:24 debootstrap: Unpacking cron (from .../cron_3.0pl1-121_armhf.deb) ...
  1040. May 23 12:31:25 debootstrap: Unpacking debian-archive-keyring (from .../debian-archive-keyring_2012.1_all.deb) ...
  1041. May 23 12:31:25 debootstrap: Unpacking gnupg (from .../gnupg_1.4.12-4_armhf.deb) ...
  1042. May 23 12:31:30 debootstrap: Unpacking gpgv (from .../gpgv_1.4.12-4_armhf.deb) ...
  1043. May 23 12:31:30 debootstrap: Unpacking groff-base (from .../groff-base_1.21-7_armhf.deb) ...
  1044. May 23 12:31:32 debootstrap: Unpacking ifupdown (from .../ifupdown_0.7~rc3_armhf.deb) ...
  1045. May 23 12:31:33 debootstrap: Unpacking info (from .../info_4.13a.dfsg.1-10_armhf.deb) ...
  1046. May 23 12:31:33 debootstrap: Unpacking install-info (from .../install-info_4.13a.dfsg.1-10_armhf.deb) ...
  1047. May 23 12:31:34 debootstrap: Unpacking iproute (from .../iproute_20120319-1_armhf.deb) ...
  1048. May 23 12:31:35 debootstrap: Unpacking iptables (from .../iptables_1.4.13-1.1_armhf.deb) ...
  1049. May 23 12:31:36 debootstrap: Unpacking iputils-ping (from .../iputils-ping_3%3a20101006-1_armhf.deb) ...
  1050. May 23 12:31:37 debootstrap: Unpacking isc-dhcp-client (from .../isc-dhcp-client_4.2.2.dfsg.1-5_armhf.deb) ...
  1051. May 23 12:31:38 debootstrap: Unpacking isc-dhcp-common (from .../isc-dhcp-common_4.2.2.dfsg.1-5_armhf.deb) ...
  1052. May 23 12:31:39 debootstrap: Unpacking kmod (from .../archives/kmod_6-2_armhf.deb) ...
  1053. May 23 12:31:40 debootstrap: Unpacking libapt-inst1.5:armhf (from .../libapt-inst1.5_0.9.3_armhf.deb) ...
  1054. May 23 12:31:41 debootstrap: Unpacking libapt-pkg-dev:armhf (from .../libapt-pkg-dev_0.9.3_armhf.deb) ...
  1055. May 23 12:31:42 debootstrap: Unpacking libapt-pkg4.12:armhf (from .../libapt-pkg4.12_0.9.3_armhf.deb) ...
  1056. May 23 12:31:43 debootstrap: Unpacking libboost-iostreams1.46.1 (from .../libboost-iostreams1.46.1_1.46.1-8_armhf.deb) ...
  1057. May 23 12:31:44 debootstrap: Unpacking libboost-iostreams1.48.0 (from .../libboost-iostreams1.48.0_1.48.0-3_armhf.deb) ...
  1058. May 23 12:31:44 debootstrap: Unpacking libboost-iostreams1.49.0 (from .../libboost-iostreams1.49.0_1.49.0-2_armhf.deb) ...
  1059. May 23 12:31:45 debootstrap: Unpacking libbsd0:armhf (from .../libbsd0_0.3.0-2_armhf.deb) ...
  1060. May 23 12:31:47 debootstrap: Unpacking libc-dev-bin (from .../libc-dev-bin_2.13-32_armhf.deb) ...
  1061. May 23 12:31:48 debootstrap: Unpacking libc6-dev (from .../libc6-dev_2.13-32_armhf.deb) ...
  1062. May 23 12:31:53 debootstrap: Unpacking libclass-isa-perl (from .../libclass-isa-perl_0.36-3_all.deb) ...
  1063. May 23 12:31:53 debootstrap: Unpacking libcwidget3 (from .../libcwidget3_0.5.16-3.2_armhf.deb) ...
  1064. May 23 12:31:54 debootstrap: Unpacking libept-dev (from .../libept-dev_1.0.6.1+b2_armhf.deb) ...
  1065. May 23 12:31:56 debootstrap: Unpacking libept1.4.12 (from .../libept1.4.12_1.0.6.1+b2_armhf.deb) ...
  1066. May 23 12:31:57 debootstrap: Unpacking libffi5:armhf (from .../libffi5_3.0.10-3+b3_armhf.deb) ...
  1067. May 23 12:31:58 debootstrap: Unpacking libgcrypt11:armhf (from .../libgcrypt11_1.5.0-3_armhf.deb) ...
  1068. May 23 12:31:59 debootstrap: Unpacking libgdbm3:armhf (from .../libgdbm3_1.8.3-10_armhf.deb) ...
  1069. May 23 12:31:59 debootstrap: Unpacking libglib2.0-0:armhf (from .../libglib2.0-0_2.32.2-1_armhf.deb) ...
  1070. May 23 12:32:03 debootstrap: Unpacking libgnutls26:armhf (from .../libgnutls26_2.12.19-1_armhf.deb) ...
  1071. May 23 12:32:04 debootstrap: Unpacking libgpg-error0:armhf (from .../libgpg-error0_1.10-3_armhf.deb) ...
  1072. May 23 12:32:05 debootstrap: Unpacking libident (from .../libident_0.22-3_armhf.deb) ...
  1073. May 23 12:32:05 debootstrap: Unpacking libidn11:armhf (from .../libidn11_1.24-2_armhf.deb) ...
  1074. May 23 12:32:06 debootstrap: Unpacking libkmod2:armhf (from .../libkmod2_6-2_armhf.deb) ...
  1075. May 23 12:32:06 debootstrap: Unpacking libnewt0.52 (from .../libnewt0.52_0.52.14-9_armhf.deb) ...
  1076. May 23 12:32:07 debootstrap: Unpacking libnfnetlink0 (from .../libnfnetlink0_1.0.0-1_armhf.deb) ...
  1077. May 23 12:32:08 debootstrap: Unpacking libp11-kit0:armhf (from .../libp11-kit0_0.12-3_armhf.deb) ...
  1078. May 23 12:32:08 debootstrap: Unpacking libpcre3:armhf (from .../libpcre3_1%3a8.30-5_armhf.deb) ...
  1079. May 23 12:32:09 debootstrap: Unpacking libpipeline1:armhf (from .../libpipeline1_1.2.1-1_armhf.deb) ...
  1080. May 23 12:32:10 debootstrap: Unpacking libpopt0:armhf (from .../libpopt0_1.16-4_armhf.deb) ...
  1081. May 23 12:32:10 debootstrap: Unpacking libprocps0:armhf (from .../libprocps0_1%3a3.3.2-3_armhf.deb) ...
  1082. May 23 12:32:11 debootstrap: Unpacking libreadline6:armhf (from .../libreadline6_6.2-8_armhf.deb) ...
  1083. May 23 12:32:11 debootstrap: Unpacking libsigc++-1.2-5c2 (from .../libsigc++-1.2-5c2_1.2.7-2_armhf.deb) ...
  1084. May 23 12:32:12 debootstrap: Unpacking libsigc++-1.2-dev (from .../libsigc++-1.2-dev_1.2.7-2_armhf.deb) ...
  1085. May 23 12:32:13 debootstrap: Unpacking libsigc++-2.0-0c2a (from .../libsigc++-2.0-0c2a_2.2.10-0.1_armhf.deb) ...
  1086. May 23 12:32:13 debootstrap: Unpacking libsqlite3-0:armhf (from .../libsqlite3-0_3.7.11-3_armhf.deb) ...
  1087. May 23 12:32:14 debootstrap: Unpacking libssl1.0.0:armhf (from .../libssl1.0.0_1.0.1c-1_armhf.deb) ...
  1088. May 23 12:32:16 debootstrap: Unpacking libstdc++6:armhf (from .../libstdc++6_4.7.0-1.1+rpi_armhf.deb) ...
  1089. May 23 12:32:17 debootstrap: Unpacking libswitch-perl (from .../libswitch-perl_2.16-2_all.deb) ...
  1090. May 23 12:32:17 debootstrap: Unpacking libsysfs2 (from .../libsysfs2_2.1.0+repack-1_armhf.deb) ...
  1091. May 23 12:32:17 debootstrap: Unpacking libtagcoll2-dev (from .../libtagcoll2-dev_2.0.13-1.1_armhf.deb) ...
  1092. May 23 12:32:18 debootstrap: Unpacking libtasn1-3:armhf (from .../libtasn1-3_2.12-1_armhf.deb) ...
  1093. May 23 12:32:19 debootstrap: Unpacking libusb-0.1-4:armhf (from .../libusb-0.1-4_2%3a0.1.12-20_armhf.deb) ...
  1094. May 23 12:32:19 debootstrap: Unpacking libwibble-dev (from .../libwibble-dev_0.1.28-1.1_armhf.deb) ...
  1095. May 23 12:32:29 debootstrap: Unpacking libxapian-dev (from .../libxapian-dev_1.2.10-1_armhf.deb) ...
  1096. May 23 12:32:32 debootstrap: Unpacking libxapian22 (from .../libxapian22_1.2.10-1_armhf.deb) ...
  1097. May 23 12:32:33 debootstrap: Unpacking linux-libc-dev:armhf (from .../linux-libc-dev_3.2.12-1_armhf.deb) ...
  1098. May 23 12:32:37 debootstrap: Unpacking logrotate (from .../logrotate_3.8.1-1_armhf.deb) ...
  1099. May 23 12:32:37 debootstrap: Unpacking man-db (from .../man-db_2.6.1-2_armhf.deb) ...
  1100. May 23 12:32:39 debootstrap: Unpacking manpages (from .../manpages_3.40-0.1_all.deb) ...
  1101. May 23 12:32:41 debootstrap: Unpacking nano (from .../nano_2.2.6-1_armhf.deb) ...
  1102. May 23 12:32:42 debootstrap: Unpacking net-tools (from .../net-tools_1.60-24.1_armhf.deb) ...
  1103. May 23 12:32:42 debootstrap: Unpacking netbase (from .../archives/netbase_5.0_all.deb) ...
  1104. May 23 12:32:43 debootstrap: Unpacking netcat-openbsd (from .../netcat-openbsd_1.105-6_armhf.deb) ...
  1105. May 23 12:32:43 debootstrap: Unpacking netcat-traditional (from .../netcat-traditional_1.10-39_armhf.deb) ...
  1106. May 23 12:32:44 debootstrap: Unpacking perl (from .../perl_5.14.2-9_armhf.deb) ...
  1107. May 23 12:32:50 debootstrap: Unpacking perl-modules (from .../perl-modules_5.14.2-9_all.deb) ...
  1108. May 23 12:32:56 debootstrap: Unpacking pkg-config (from .../pkg-config_0.26-1_armhf.deb) ...
  1109. May 23 12:32:57 debootstrap: Unpacking procps (from .../procps_1%3a3.3.2-3_armhf.deb) ...
  1110. May 23 12:32:57 debootstrap: Unpacking readline-common (from .../readline-common_6.2-8_all.deb) ...
  1111. May 23 12:32:58 debootstrap: Unpacking rsyslog (from .../rsyslog_5.8.11-1_armhf.deb) ...
  1112. May 23 12:32:59 debootstrap: Unpacking tasksel (from .../archives/tasksel_3.09_all.deb) ...
  1113. May 23 12:33:04 debootstrap: Unpacking tasksel-data (from .../tasksel-data_3.09_all.deb) ...
  1114. May 23 12:33:06 debootstrap: Unpacking traceroute (from .../traceroute_1%3a2.0.18-1_armhf.deb) ...
  1115. May 23 12:33:07 debootstrap: Unpacking udev (from .../udev_175-3.1_armhf.deb) ...
  1116. May 23 12:33:13 debootstrap: Unpacking vim-common (from .../vim-common_2%3a7.3.429-2_armhf.deb) ...
  1117. May 23 12:33:15 debootstrap: Unpacking vim-tiny (from .../vim-tiny_2%3a7.3.429-2_armhf.deb) ...
  1118. May 23 12:33:16 debootstrap: Unpacking wget (from .../wget_1.13.4-3_armhf.deb) ...
  1119. May 23 12:33:17 debootstrap: Unpacking whiptail (from .../whiptail_0.52.14-9_armhf.deb) ...
  1120. May 23 12:33:18 debootstrap: Unpacking zlib1g-dev:armhf (from .../zlib1g-dev_1%3a1.2.7.dfsg-1_armhf.deb) ...
  1121. May 23 12:33:19 debootstrap: Setting up libsysfs2 (2.1.0+repack-1) ...
  1122. May 23 12:33:21 debootstrap: Setting up gpgv (1.4.12-4) ...
  1123. May 23 12:33:21 debootstrap: Setting up libssl1.0.0:armhf (1.0.1c-1) ...
  1124. May 23 12:33:30 debootstrap: Setting up libffi5:armhf (3.0.10-3+b3) ...
  1125. May 23 12:33:30 debootstrap: Setting up libgdbm3:armhf (1.8.3-10) ...
  1126. May 23 12:33:36 debootstrap: Setting up isc-dhcp-common (4.2.2.dfsg.1-5) ...
  1127. May 23 12:33:36 debootstrap: Setting up libtasn1-3:armhf (2.12-1) ...
  1128. May 23 12:33:36 debootstrap: Setting up libpopt0:armhf (1.16-4) ...
  1129. May 23 12:33:37 debootstrap: Setting up libusb-0.1-4:armhf (2:0.1.12-20) ...
  1130. May 23 12:33:37 debootstrap: Setting up libgpg-error0:armhf (1.10-3) ...
  1131. May 23 12:33:37 debootstrap: Setting up libident (0.22-3) ...
  1132. May 23 12:33:38 debootstrap: Setting up install-info (4.13a.dfsg.1-10) ...
  1133. May 23 12:33:39 debootstrap: Setting up vim-common (2:7.3.429-2) ...
  1134. May 23 12:33:39 debootstrap: Setting up libprocps0:armhf (1:3.3.2-3) ...
  1135. May 23 12:33:39 debootstrap: Setting up netbase (5.0) ...
  1136. May 23 12:33:39 debootstrap: Setting up libc-dev-bin (2.13-32) ...
  1137. May 23 12:33:40 debootstrap: dpkg: dependency problems prevent configuration of libsigc++-1.2-dev:
  1138. May 23 12:33:40 debootstrap:  libsigc++-1.2-dev depends on libstdc++-dev; however:
  1139. May 23 12:33:40 debootstrap:   Package libstdc++-dev is not installed.
  1140. May 23 12:33:40 debootstrap: dpkg: error processing libsigc++-1.2-dev (--configure):
  1141. May 23 12:33:40 debootstrap:  dependency problems - leaving unconfigured
  1142. May 23 12:33:40 debootstrap: Setting up linux-libc-dev:armhf (3.2.12-1) ...
  1143. May 23 12:33:40 debootstrap: Setting up libkmod2:armhf (6-2) ...
  1144. May 23 12:33:40 debootstrap: Setting up libclass-isa-perl (0.36-3) ...
  1145. May 23 12:33:40 debootstrap: Setting up adduser (3.113+nmu1) ...
  1146. May 23 12:33:45 debootstrap: Setting up traceroute (1:2.0.18-1) ...
  1147. May 23 12:33:45 debootstrap: update-alternatives:
  1148. May 23 12:33:45 debootstrap: using /usr/bin/traceroute.db to provide /usr/bin/traceroute (traceroute) in auto mode.
  1149. May 23 12:33:45 debootstrap:
  1150. May 23 12:33:45 debootstrap: update-alternatives:
  1151. May 23 12:33:45 debootstrap: using /usr/bin/traceroute6.db to provide /usr/bin/traceroute6 (traceroute6) in auto mode.
  1152. May 23 12:33:45 debootstrap:
  1153. May 23 12:33:45 debootstrap: update-alternatives:
  1154. May 23 12:33:45 debootstrap: using /usr/bin/lft.db to provide /usr/bin/lft (lft) in auto mode.
  1155. May 23 12:33:45 debootstrap:
  1156. May 23 12:33:45 debootstrap: update-alternatives:
  1157. May 23 12:33:45 debootstrap: using /usr/bin/traceproto.db to provide /usr/bin/traceproto (traceproto) in auto mode.
  1158. May 23 12:33:45 debootstrap:
  1159. May 23 12:33:45 debootstrap: update-alternatives:
  1160. May 23 12:33:45 debootstrap: using /usr/sbin/tcptraceroute.db to provide /usr/sbin/tcptraceroute (tcptraceroute) in auto mode.
  1161. May 23 12:33:45 debootstrap:
  1162. May 23 12:33:45 debootstrap: Setting up manpages (3.40-0.1) ...
  1163. May 23 12:33:46 debootstrap: Setting up libsqlite3-0:armhf (3.7.11-3) ...
  1164. May 23 12:33:46 debootstrap: Setting up iproute (20120319-1) ...
  1165. May 23 12:33:46 debootstrap: Setting up libidn11:armhf (1.24-2) ...
  1166. May 23 12:33:46 debootstrap: Setting up libnewt0.52 (0.52.14-9) ...
  1167. May 23 12:33:47 debootstrap: Setting up net-tools (1.60-24.1) ...
  1168. May 23 12:33:47 debootstrap: Setting up libpipeline1:armhf (1.2.1-1) ...
  1169. May 23 12:33:47 debootstrap: Setting up bsdmainutils (9.0.1) ...
  1170. May 23 12:33:47 debootstrap: update-alternatives:
  1171. May 23 12:33:47 debootstrap: using /usr/bin/bsd-write to provide /usr/bin/write (write) in auto mode.
  1172. May 23 12:33:47 debootstrap:
  1173. May 23 12:33:47 debootstrap: update-alternatives:
  1174. May 23 12:33:47 debootstrap: using /usr/bin/bsd-from to provide /usr/bin/from (from) in auto mode.
  1175. May 23 12:33:47 debootstrap:
  1176. May 23 12:33:47 debootstrap: Setting up libbsd0:armhf (0.3.0-2) ...
  1177. May 23 12:33:47 debootstrap: Setting up netcat-traditional (1.10-39) ...
  1178. May 23 12:33:48 debootstrap: update-alternatives:
  1179. May 23 12:33:48 debootstrap: using /bin/nc.traditional to provide /bin/nc (nc) in auto mode.
  1180. May 23 12:33:48 debootstrap:
  1181. May 23 12:33:48 debootstrap: Setting up libpcre3:armhf (1:8.30-5) ...
  1182. May 23 12:33:48 debootstrap: Setting up libwibble-dev (0.1.28-1.1) ...
  1183. May 23 12:33:48 debootstrap: Setting up info (4.13a.dfsg.1-10) ...
  1184. May 23 12:33:48 debootstrap: update-alternatives:
  1185. May 23 12:33:48 debootstrap: using /usr/bin/info to provide /usr/bin/infobrowser (infobrowser) in auto mode.
  1186. May 23 12:33:48 debootstrap:
  1187. May 23 12:33:49 debootstrap: Setting up iputils-ping (3:20101006-1) ...
  1188. May 23 12:33:49 debootstrap: Setting up cron (3.0pl1-121) ...
  1189. May 23 12:33:51 debootstrap: Adding group `crontab' (GID 102) ...
  1190. May 23 12:33:51 debootstrap: Done.
  1191. May 23 12:33:52 debootstrap: Starting periodic command scheduler: cron
  1192. May 23 12:33:52 debootstrap:
  1193. May 23 12:33:52 debootstrap: Warning: Fake start-stop-daemon called, doing nothing
  1194. May 23 12:33:52 debootstrap: .
  1195. May 23 12:33:52 debootstrap: Setting up nano (2.2.6-1) ...
  1196. May 23 12:33:52 debootstrap: update-alternatives:
  1197. May 23 12:33:52 debootstrap: using /bin/nano to provide /usr/bin/editor (editor) in auto mode.
  1198. May 23 12:33:52 debootstrap:
  1199. May 23 12:33:52 debootstrap: update-alternatives:
  1200. May 23 12:33:52 debootstrap: using /bin/nano to provide /usr/bin/pico (pico) in auto mode.
  1201. May 23 12:33:52 debootstrap:
  1202. May 23 12:33:52 debootstrap: Setting up libp11-kit0:armhf (0.12-3) ...
  1203. May 23 12:33:53 debootstrap: Setting up udev (175-3.1) ...
  1204. May 23 12:33:53 debootstrap: A chroot environment has been detected, udev not started.
  1205. May 23 12:33:54 debootstrap: Setting up rsyslog (5.8.11-1) ...
  1206. May 23 12:33:55 debootstrap: Starting enhanced syslogd: rsyslogd
  1207. May 23 12:33:55 debootstrap:
  1208. May 23 12:33:55 debootstrap: Warning: Fake start-stop-daemon called, doing nothing
  1209. May 23 12:33:55 debootstrap: .
  1210. May 23 12:33:55 debootstrap: Setting up cpio (2.11-7) ...
  1211. May 23 12:33:56 debootstrap: update-alternatives:
  1212. May 23 12:33:56 debootstrap: using /bin/mt-gnu to provide /bin/mt (mt) in auto mode.
  1213. May 23 12:33:56 debootstrap:
  1214. May 23 12:33:56 debootstrap: Setting up libstdc++6:armhf (4.7.0-1.1+rpi) ...
  1215. May 23 12:33:56 debootstrap: Setting up isc-dhcp-client (4.2.2.dfsg.1-5) ...
  1216. May 23 12:34:00 debootstrap: Setting up vim-tiny (2:7.3.429-2) ...
  1217. May 23 12:34:00 debootstrap: update-alternatives:
  1218. May 23 12:34:00 debootstrap: using /usr/bin/vim.tiny to provide /usr/bin/rview (rview) in auto mode.
  1219. May 23 12:34:00 debootstrap:
  1220. May 23 12:34:00 debootstrap: update-alternatives:
  1221. May 23 12:34:00 debootstrap: using /usr/bin/vim.tiny to provide /usr/bin/vi (vi) in auto mode.
  1222. May 23 12:34:00 debootstrap:
  1223. May 23 12:34:00 debootstrap: update-alternatives:
  1224. May 23 12:34:00 debootstrap: using /usr/bin/vim.tiny to provide /usr/bin/view (view) in auto mode.
  1225. May 23 12:34:00 debootstrap:
  1226. May 23 12:34:00 debootstrap: update-alternatives:
  1227. May 23 12:34:00 debootstrap: using /usr/bin/vim.tiny to provide /usr/bin/ex (ex) in auto mode.
  1228. May 23 12:34:00 debootstrap:
  1229. May 23 12:34:00 debootstrap: Setting up libglib2.0-0:armhf (2.32.2-1) ...
  1230. May 23 12:34:01 debootstrap: No schema files found: doing nothing.
  1231. May 23 12:34:01 debootstrap: Setting up readline-common (6.2-8) ...
  1232. May 23 12:34:01 debootstrap: Setting up libnfnetlink0 (1.0.0-1) ...
  1233. May 23 12:34:01 debootstrap: Setting up libgcrypt11:armhf (1.5.0-3) ...
  1234. May 23 12:34:01 debootstrap: Setting up procps (1:3.3.2-3) ...
  1235. May 23 12:34:02 debootstrap: update-alternatives:
  1236. May 23 12:34:02 debootstrap: using /usr/bin/w.procps to provide /usr/bin/w (w) in auto mode.
  1237. May 23 12:34:02 debootstrap:
  1238. May 23 12:34:06 debootstrap: Setting kernel variables ...
  1239. May 23 12:34:06 debootstrap: done.
  1240. May 23 12:34:06 debootstrap: Setting up libxapian22 (1.2.10-1) ...
  1241. May 23 12:34:07 debootstrap: Setting up libc6-dev (2.13-32) ...
  1242. May 23 12:34:07 debootstrap: Setting up libboost-iostreams1.46.1 (1.46.1-8) ...
  1243. May 23 12:34:07 debootstrap: Setting up whiptail (0.52.14-9) ...
  1244. May 23 12:34:07 debootstrap: Setting up ifupdown (0.7~rc3) ...
  1245. May 23 12:34:08 debootstrap: Creating /etc/network/interfaces.
  1246. May 23 12:34:10 debootstrap: Setting up kmod (6-2) ...
  1247. May 23 12:34:10 debootstrap: Setting up libapt-pkg4.12:armhf (0.9.3) ...
  1248. May 23 12:34:11 debootstrap: Setting up libept1.4.12 (1.0.6.1+b2) ...
  1249. May 23 12:34:11 debootstrap: Setting up netcat-openbsd (1.105-6) ...
  1250. May 23 12:34:11 debootstrap: update-alternatives:
  1251. May 23 12:34:11 debootstrap: using /bin/nc.openbsd to provide /bin/nc (nc) in auto mode.
  1252. May 23 12:34:11 debootstrap:
  1253. May 23 12:34:11 debootstrap: Setting up libboost-iostreams1.48.0 (1.48.0-3) ...
  1254. May 23 12:34:11 debootstrap: Setting up libapt-inst1.5:armhf (0.9.3) ...
  1255. May 23 12:34:11 debootstrap: Setting up libreadline6:armhf (6.2-8) ...
  1256. May 23 12:34:11 debootstrap: Setting up logrotate (3.8.1-1) ...
  1257. May 23 12:34:12 debootstrap: Setting up libboost-iostreams1.49.0 (1.49.0-2) ...
  1258. May 23 12:34:12 debootstrap: Setting up libxapian-dev (1.2.10-1) ...
  1259. May 23 12:34:12 debootstrap: Setting up groff-base (1.21-7) ...
  1260. May 23 12:34:13 debootstrap: Setting up gnupg (1.4.12-4) ...
  1261. May 23 12:34:13 debootstrap: Setting up libsigc++-2.0-0c2a (2.2.10-0.1) ...
  1262. May 23 12:34:13 debootstrap: Setting up libgnutls26:armhf (2.12.19-1) ...
  1263. May 23 12:34:14 debootstrap: Setting up pkg-config (0.26-1) ...
  1264. May 23 12:34:14 debootstrap: Setting up zlib1g-dev:armhf (1:1.2.7.dfsg-1) ...
  1265. May 23 12:34:14 debootstrap: Setting up apt-utils (0.9.3) ...
  1266. May 23 12:34:14 debootstrap: Setting up libtagcoll2-dev (2.0.13-1.1) ...
  1267. May 23 12:34:14 debootstrap: Setting up iptables (1.4.13-1.1) ...
  1268. May 23 12:34:15 debootstrap: Setting up libsigc++-1.2-5c2 (1.2.7-2) ...
  1269. May 23 12:34:15 debootstrap: Setting up man-db (2.6.1-2) ...
  1270. May 23 12:34:19 debootstrap: Building database of manual pages ...
  1271. May 23 12:35:12 debootstrap: Setting up wget (1.13.4-3) ...
  1272. May 23 12:35:12 debootstrap: Setting up libcwidget3 (0.5.16-3.2) ...
  1273. May 23 12:35:12 debootstrap: Setting up aptitude (0.6.7-1+b1) ...
  1274. May 23 12:35:12 debootstrap: update-alternatives:
  1275. May 23 12:35:12 debootstrap: using /usr/bin/aptitude-curses to provide /usr/bin/aptitude (aptitude) in auto mode.
  1276. May 23 12:35:12 debootstrap:
  1277. May 23 12:35:13 debootstrap: Setting up libapt-pkg-dev:armhf (0.9.3) ...
  1278. May 23 12:35:13 debootstrap: Setting up libept-dev (1.0.6.1+b2) ...
  1279. May 23 12:35:13 debootstrap: Setting up debian-archive-keyring (2012.1) ...
  1280. May 23 12:35:14 debootstrap: Setting up apt (0.9.3) ...
  1281. May 23 12:35:14 debootstrap: gpg:
  1282. May 23 12:35:14 debootstrap: keyring `/etc/apt/trusted.gpg' created
  1283. May 23 12:35:14 debootstrap: gpg:
  1284. May 23 12:35:14 debootstrap: key B98321F9: "Squeeze Stable Release Key <debian-release@lists.debian.org>" not changed
  1285. May 23 12:35:14 debootstrap: gpg:
  1286. May 23 12:35:14 debootstrap: key 473041FA: "Debian Archive Automatic Signing Key (6.0/squeeze) <ftpmaster@debian.org>" not changed
  1287. May 23 12:35:14 debootstrap: gpg:
  1288. May 23 12:35:14 debootstrap: Total number processed: 2
  1289. May 23 12:35:14 debootstrap: gpg:
  1290. May 23 12:35:14 debootstrap:              unchanged: 2
  1291. May 23 12:35:14 debootstrap: gpg:
  1292. May 23 12:35:14 debootstrap: /etc/apt/trustdb.gpg: trustdb created
  1293. May 23 12:35:15 debootstrap: Setting up libswitch-perl (2.16-2) ...
  1294. May 23 12:35:15 debootstrap: Setting up tasksel-data (3.09) ...
  1295. May 23 12:35:15 debootstrap: Setting up perl-modules (5.14.2-9) ...
  1296. May 23 12:35:15 debootstrap: Setting up perl (5.14.2-9) ...
  1297. May 23 12:35:16 debootstrap: update-alternatives:
  1298. May 23 12:35:16 debootstrap: using /usr/bin/prename to provide /usr/bin/rename (rename) in auto mode.
  1299. May 23 12:35:16 debootstrap:
  1300. May 23 12:35:16 debootstrap: Setting up tasksel (3.09) ...
  1301. May 23 12:35:25 debootstrap: Errors were encountered while processing:
  1302. May 23 12:35:25 debootstrap:  libsigc++-1.2-dev
  1303. May 23 12:35:27 debootstrap: dpkg: dependency problems prevent configuration of libsigc++-1.2-dev:
  1304. May 23 12:35:27 debootstrap:  libsigc++-1.2-dev depends on libstdc++-dev; however:
  1305. May 23 12:35:27 debootstrap:   Package libstdc++-dev is not installed.
  1306. May 23 12:35:27 debootstrap: dpkg: error processing libsigc++-1.2-dev (--configure):
  1307. May 23 12:35:27 debootstrap:  dependency problems - leaving unconfigured
  1308. May 23 12:35:27 debootstrap: Errors were encountered while processing:
  1309. May 23 12:35:27 debootstrap:  libsigc++-1.2-dev
  1310. May 23 12:35:28 debootstrap: dpkg: dependency problems prevent configuration of libsigc++-1.2-dev:
  1311. May 23 12:35:28 debootstrap:  libsigc++-1.2-dev depends on libstdc++-dev; however:
  1312. May 23 12:35:28 debootstrap:   Package libstdc++-dev is not installed.
  1313. May 23 12:35:28 debootstrap: dpkg: error processing libsigc++-1.2-dev (--configure):
  1314. May 23 12:35:28 debootstrap:  dependency problems - leaving unconfigured
  1315. May 23 12:35:28 debootstrap: Errors were encountered while processing:
  1316. May 23 12:35:28 debootstrap:  libsigc++-1.2-dev
  1317. May 23 12:35:29 debootstrap: dpkg: dependency problems prevent configuration of libsigc++-1.2-dev:
  1318. May 23 12:35:29 debootstrap:  libsigc++-1.2-dev depends on libstdc++-dev; however:
  1319. May 23 12:35:29 debootstrap:   Package libstdc++-dev is not installed.
  1320. May 23 12:35:29 debootstrap: dpkg: error processing libsigc++-1.2-dev (--configure):
  1321. May 23 12:35:29 debootstrap:  dependency problems - leaving unconfigured
  1322. May 23 12:35:29 debootstrap: Errors were encountered while processing:
  1323. May 23 12:35:29 debootstrap:  libsigc++-1.2-dev
  1324. May 23 12:35:30 debootstrap: dpkg: dependency problems prevent configuration of libsigc++-1.2-dev:
  1325. May 23 12:35:30 debootstrap:  libsigc++-1.2-dev depends on libstdc++-dev; however:
  1326. May 23 12:35:30 debootstrap:   Package libstdc++-dev is not installed.
  1327. May 23 12:35:30 debootstrap: dpkg: error processing libsigc++-1.2-dev (--configure):
  1328. May 23 12:35:30 debootstrap:  dependency problems - leaving unconfigured
  1329. May 23 12:35:30 debootstrap: Errors were encountered while processing:
  1330. May 23 12:35:30 debootstrap:  libsigc++-1.2-dev
  1331. May 23 12:35:47 base-installer: error: exiting on error base-installer/debootstrap-failed
  1332. May 23 12:35:49 main-menu[1312]: WARNING **: Configuring 'bootstrap-base' failed with error code 1
  1333. May 23 12:35:49 main-menu[1312]: WARNING **: Menu item 'bootstrap-base' failed.
  1334. May 23 12:35:53 main-menu[1312]: INFO: Modifying debconf priority limit from 'high' to 'medium'
  1335. May 23 12:35:53 debconf: Setting debconf/priority to medium
  1336. May 23 12:35:53 main-menu[1312]: DEBUG: resolver (libgcc1): package doesn't exist (ignored)
  1337. May 23 12:35:53 main-menu[1312]: DEBUG: resolver (crypto-modules): package doesn't exist (ignored)
  1338. May 23 12:35:53 main-menu[1312]: DEBUG: resolver (libbsd0-udeb): package doesn't exist (ignored)
  1339. May 23 12:35:53 main-menu[1312]: DEBUG: resolver (ext2-modules): package doesn't exist (ignored)
  1340. May 23 12:35:53 main-menu[1312]: DEBUG: resolver (fat-modules): package doesn't exist (ignored)
  1341. May 23 12:35:57 main-menu[1312]: INFO: Menu item 'di-utils-shell' selected
  1342. May 23 12:36:15 main-menu[1312]: DEBUG: resolver (libgcc1): package doesn't exist (ignored)
  1343. May 23 12:36:15 main-menu[1312]: DEBUG: resolver (crypto-modules): package doesn't exist (ignored)
  1344. May 23 12:36:15 main-menu[1312]: DEBUG: resolver (libbsd0-udeb): package doesn't exist (ignored)
  1345. May 23 12:36:15 main-menu[1312]: DEBUG: resolver (ext2-modules): package doesn't exist (ignored)
  1346. May 23 12:36:15 main-menu[1312]: DEBUG: resolver (fat-modules): package doesn't exist (ignored)
  1347. May 23 12:36:18 main-menu[1312]: INFO: Menu item 'save-logs' selected
  1348. May 23 12:36:21 main-menu[1312]: (process:27001): mkdir: can't create directory '/mnt/install.2': File exists
  1349. May 23 12:36:21 main-menu[1312]: WARNING **: Configuring 'save-logs' failed with error code 1
  1350. May 23 12:36:21 main-menu[1312]: WARNING **: Menu item 'save-logs' failed.
  1351. May 23 12:36:27 main-menu[1312]: INFO: Modifying debconf priority limit from 'medium' to 'low'
  1352. May 23 12:36:27 debconf: Setting debconf/priority to low
  1353. May 23 12:36:27 main-menu[1312]: DEBUG: resolver (libgcc1): package doesn't exist (ignored)
  1354. May 23 12:36:27 main-menu[1312]: DEBUG: resolver (crypto-modules): package doesn't exist (ignored)
  1355. May 23 12:36:27 main-menu[1312]: DEBUG: resolver (libbsd0-udeb): package doesn't exist (ignored)
  1356. May 23 12:36:27 main-menu[1312]: DEBUG: resolver (ext2-modules): package doesn't exist (ignored)
  1357. May 23 12:36:27 main-menu[1312]: DEBUG: resolver (fat-modules): package doesn't exist (ignored)
  1358. May 23 12:36:34 kernel: bcm2708_fb_check_var info(cb88b000) 1184x928 (1184x928), 2197504, 16
  1359. May 23 12:36:34 kernel: bcm2708_fb_check_var var(ca445cdc) 1184x928 (1184x928), 16, 1098752
  1360. May 23 12:36:34 kernel: bcm2708_fb_set_par info(cb88b000) 1184x928 (1184x928), 2197504, 16
  1361. May 23 12:36:34 kernel: BCM2708FB: start = cd400000,4d384000 width=1184, height=928, bpp=16, pitch=2368 size=2197504 success=0
  1362. May 23 12:36:59 main-menu[1312]: INFO: Menu item 'di-utils-shell' selected
  1363. May 23 12:38:03 main-menu[1312]: DEBUG: resolver (libgcc1): package doesn't exist (ignored)
  1364. May 23 12:38:03 main-menu[1312]: DEBUG: resolver (crypto-modules): package doesn't exist (ignored)
  1365. May 23 12:38:03 main-menu[1312]: DEBUG: resolver (libbsd0-udeb): package doesn't exist (ignored)
  1366. May 23 12:38:03 main-menu[1312]: DEBUG: resolver (ext2-modules): package doesn't exist (ignored)
  1367. May 23 12:38:03 main-menu[1312]: DEBUG: resolver (fat-modules): package doesn't exist (ignored)
  1368. May 23 12:38:05 main-menu[1312]: INFO: Menu item 'save-logs' selected
RAW Paste Data
Top