Guest User

Untitled

a guest
Jun 17th, 2021
13
Never
Not a member of Pastebin yet? Sign Up, it unlocks many cool features!
  1. Command line: -mp -release -static -static-runtime -confirm-license -opengl dynamic -optimize-size -opensource -no-feature-d3d12 -nomake tools -nomake examples -ssl -openssl -openssl-linked -I C:\Qt\OpenSSL\OpenSSL-1.1.1\static\x64\Release\include -L C:\Qt\OpenSSL\OpenSSL-1.1.1\static\x64\Release\lib -prefix C:\Qt\QtStatic\x64\5.15.2-NoD3D\msvc
  2. executing config test verifyspec
  3. + cd /d C:\qt-everywhere-src-5.15.1\config.tests\verifyspec && C:\qt-everywhere-src-5.15.1\qtbase\bin\qmake.exe "CONFIG -= qt debug_and_release app_bundle lib_bundle" "CONFIG += static warn_off console single_arch" "QMAKE_LIBDIR += C:\\Qt\\OpenSSL\\OpenSSL-1.1.1\\static\\x64\\Release\\lib" "INCLUDEPATH += C:\\Qt\\OpenSSL\\OpenSSL-1.1.1\\static\\x64\\Release\\include" C:/qt-everywhere-src-5.15.1/qtbase/config.tests/verifyspec
  4. + cd /d C:\qt-everywhere-src-5.15.1\config.tests\verifyspec && set MAKEFLAGS=& nmake
  5. > Microsoft (R) Program Maintenance Utility Version 14.16.27045.0
  6. > Copyright (C) Microsoft Corporation. All rights reserved.
  7. > cl -c -nologo -Zc:wchar_t -FS -Zc:rvalueCast -Zc:inline -Zc:strictStrings -Zc:throwingNew -Zc:referenceBinding -Zc:__cplusplus -O2 -MT -W0 -EHsc -DUNICODE -D_UNICODE -DWIN32 -D_ENABLE_EXTENDED_ALIGNED_STORAGE -DWIN64 -DNDEBUG -IC:\qt-everywhere-src-5.15.1\qtbase\config.tests\verifyspec -I. -IC:\Qt\OpenSSL\OpenSSL-1.1.1\static\x64\Release\include -IC:\qt-everywhere-src-5.15.1\qtbase\mkspecs\win32-msvc -Fo @C:\Users\MyUser\AppData\Local\Temp\nmD46C.tmp
  8. > verifyspec.cpp
  9. > link /NOLOGO /DYNAMICBASE /NXCOMPAT /OPT:REF /INCREMENTAL:NO /SUBSYSTEM:CONSOLE "/MANIFESTDEPENDENCY:type='win32' name='Microsoft.Windows.Common-Controls' version='6.0.0.0' publicKeyToken='6595b64144ccf1df' language='*' processorArchitecture='*'" /MANIFEST:embed /OUT:verifyspec.exe @C:\Users\MyUser\AppData\Local\Temp\nmD48C.tmp
  10. test config.qtbase.tests.verifyspec succeeded
  11. executing config test architecture
  12. + cd /d C:\qt-everywhere-src-5.15.1\config.tests\arch && C:\qt-everywhere-src-5.15.1\qtbase\bin\qmake.exe "CONFIG -= qt debug_and_release app_bundle lib_bundle" "CONFIG += static warn_off console single_arch" "QMAKE_LIBDIR += C:\\Qt\\OpenSSL\\OpenSSL-1.1.1\\static\\x64\\Release\\lib" "INCLUDEPATH += C:\\Qt\\OpenSSL\\OpenSSL-1.1.1\\static\\x64\\Release\\include" C:/qt-everywhere-src-5.15.1/qtbase/config.tests/arch
  13. + cd /d C:\qt-everywhere-src-5.15.1\config.tests\arch && set MAKEFLAGS=& nmake
  14. > Microsoft (R) Program Maintenance Utility Version 14.16.27045.0
  15. > Copyright (C) Microsoft Corporation. All rights reserved.
  16. > cl -c -nologo -Zc:wchar_t -FS -Zc:rvalueCast -Zc:inline -Zc:strictStrings -Zc:throwingNew -Zc:referenceBinding -Zc:__cplusplus -O2 -MT -W0 -EHsc -DUNICODE -D_UNICODE -DWIN32 -D_ENABLE_EXTENDED_ALIGNED_STORAGE -DWIN64 -DNDEBUG -IC:\qt-everywhere-src-5.15.1\qtbase\config.tests\arch -I. -IC:\Qt\OpenSSL\OpenSSL-1.1.1\static\x64\Release\include -IC:\qt-everywhere-src-5.15.1\qtbase\mkspecs\win32-msvc -Fo @C:\Users\MyUser\AppData\Local\Temp\nmD518.tmp
  17. > arch.cpp
  18. > link /NOLOGO /DYNAMICBASE /NXCOMPAT /OPT:REF /INCREMENTAL:NO /SUBSYSTEM:CONSOLE "/MANIFESTDEPENDENCY:type='win32' name='Microsoft.Windows.Common-Controls' version='6.0.0.0' publicKeyToken='6595b64144ccf1df' language='*' processorArchitecture='*'" /MANIFEST:embed /OUT:arch.exe @C:\Users\MyUser\AppData\Local\Temp\nmD547.tmp
  19. Detected architecture: x86_64 (sse sse2)
  20. test config.qtbase.tests.architecture gave result x86_64
  21. executing config test sse2
  22. + cd /d C:\qt-everywhere-src-5.15.1\config.tests\x86_simd && C:\qt-everywhere-src-5.15.1\qtbase\bin\qmake.exe "CONFIG -= qt debug_and_release app_bundle lib_bundle" "CONFIG += static warn_off console single_arch" "QMAKE_LIBDIR += C:\\Qt\\OpenSSL\\OpenSSL-1.1.1\\static\\x64\\Release\\lib" "INCLUDEPATH += C:\\Qt\\OpenSSL\\OpenSSL-1.1.1\\static\\x64\\Release\\include" "CONFIG+=add_cflags" "DEFINES+=NO_ATTRIBUTE" "SIMD=sse2" C:/qt-everywhere-src-5.15.1/qtbase/config.tests/x86_simd
  23. + cd /d C:\qt-everywhere-src-5.15.1\config.tests\x86_simd && set MAKEFLAGS=& nmake
  24. > Microsoft (R) Program Maintenance Utility Version 14.16.27045.0
  25. > Copyright (C) Microsoft Corporation. All rights reserved.
  26. > cl -c -nologo -Zc:wchar_t -FS -Zc:rvalueCast -Zc:inline -Zc:strictStrings -Zc:throwingNew -Zc:referenceBinding -Zc:__cplusplus -O2 -MT -W0 -EHsc -DUNICODE -D_UNICODE -DWIN32 -D_ENABLE_EXTENDED_ALIGNED_STORAGE -DWIN64 -DNO_ATTRIBUTE -DQT_COMPILER_SUPPORTS_SSE2 -DNDEBUG -IC:\qt-everywhere-src-5.15.1\qtbase\config.tests\x86_simd -I. -IC:\Qt\OpenSSL\OpenSSL-1.1.1\static\x64\Release\include -IC:\qt-everywhere-src-5.15.1\qtbase\mkspecs\win32-msvc -Fo @C:\Users\MyUser\AppData\Local\Temp\nmD602.tmp
  27. > main.cpp
  28. > link /NOLOGO /DYNAMICBASE /NXCOMPAT /OPT:REF /INCREMENTAL:NO /SUBSYSTEM:CONSOLE "/MANIFESTDEPENDENCY:type='win32' name='Microsoft.Windows.Common-Controls' version='6.0.0.0' publicKeyToken='6595b64144ccf1df' language='*' processorArchitecture='*'" /MANIFEST:embed /OUT:x86_simd.exe @C:\Users\MyUser\AppData\Local\Temp\nmD641.tmp
  29. test config.qtbase.tests.sse2 succeeded
  30. executing config test aesni
  31. + cd /d C:\qt-everywhere-src-5.15.1\config.tests\x86_simd && C:\qt-everywhere-src-5.15.1\qtbase\bin\qmake.exe "CONFIG -= qt debug_and_release app_bundle lib_bundle" "CONFIG += static warn_off console single_arch" "QMAKE_LIBDIR += C:\\Qt\\OpenSSL\\OpenSSL-1.1.1\\static\\x64\\Release\\lib" "INCLUDEPATH += C:\\Qt\\OpenSSL\\OpenSSL-1.1.1\\static\\x64\\Release\\include" "CONFIG+=add_cflags" "DEFINES+=NO_ATTRIBUTE" "SIMD=aesni" C:/qt-everywhere-src-5.15.1/qtbase/config.tests/x86_simd
  32. + cd /d C:\qt-everywhere-src-5.15.1\config.tests\x86_simd && set MAKEFLAGS=& nmake clean && set MAKEFLAGS=& nmake
  33. > Microsoft (R) Program Maintenance Utility Version 14.16.27045.0
  34. > Copyright (C) Microsoft Corporation. All rights reserved.
  35. > del main.obj
  36. > Microsoft (R) Program Maintenance Utility Version 14.16.27045.0
  37. > Copyright (C) Microsoft Corporation. All rights reserved.
  38. > cl -c -nologo -Zc:wchar_t -FS -Zc:rvalueCast -Zc:inline -Zc:strictStrings -Zc:throwingNew -Zc:referenceBinding -Zc:__cplusplus -O2 -MT -W0 -EHsc -DUNICODE -D_UNICODE -DWIN32 -D_ENABLE_EXTENDED_ALIGNED_STORAGE -DWIN64 -DNO_ATTRIBUTE -DQT_COMPILER_SUPPORTS_AESNI -DNDEBUG -IC:\qt-everywhere-src-5.15.1\qtbase\config.tests\x86_simd -I. -IC:\Qt\OpenSSL\OpenSSL-1.1.1\static\x64\Release\include -IC:\qt-everywhere-src-5.15.1\qtbase\mkspecs\win32-msvc -Fo @C:\Users\MyUser\AppData\Local\Temp\nmD6CD.tmp
  39. > main.cpp
  40. > link /NOLOGO /DYNAMICBASE /NXCOMPAT /OPT:REF /INCREMENTAL:NO /SUBSYSTEM:CONSOLE "/MANIFESTDEPENDENCY:type='win32' name='Microsoft.Windows.Common-Controls' version='6.0.0.0' publicKeyToken='6595b64144ccf1df' language='*' processorArchitecture='*'" /MANIFEST:embed /OUT:x86_simd.exe @C:\Users\MyUser\AppData\Local\Temp\nmD70D.tmp
  41. test config.qtbase.tests.aesni succeeded
  42. executing config test alloca_h
  43. + cd /d C:\qt-everywhere-src-5.15.1\config.tests\alloca_h && C:\qt-everywhere-src-5.15.1\qtbase\bin\qmake.exe "CONFIG -= qt debug_and_release app_bundle lib_bundle" "CONFIG += static warn_off console single_arch" "QMAKE_LIBDIR += C:\\Qt\\OpenSSL\\OpenSSL-1.1.1\\static\\x64\\Release\\lib" "INCLUDEPATH += C:\\Qt\\OpenSSL\\OpenSSL-1.1.1\\static\\x64\\Release\\include" C:/qt-everywhere-src-5.15.1/config.tests/alloca_h
  44. + cd /d C:\qt-everywhere-src-5.15.1\config.tests\alloca_h && set MAKEFLAGS=& nmake
  45. > Microsoft (R) Program Maintenance Utility Version 14.16.27045.0
  46. > Copyright (C) Microsoft Corporation. All rights reserved.
  47. > cl -c -nologo -Zc:wchar_t -FS -Zc:rvalueCast -Zc:inline -Zc:strictStrings -Zc:throwingNew -Zc:referenceBinding -Zc:__cplusplus -O2 -MT -W0 -EHsc -DUNICODE -D_UNICODE -DWIN32 -D_ENABLE_EXTENDED_ALIGNED_STORAGE -DWIN64 -DNDEBUG -I. -IC:\Qt\OpenSSL\OpenSSL-1.1.1\static\x64\Release\include -IC:\qt-everywhere-src-5.15.1\qtbase\mkspecs\win32-msvc -Fo @C:\Users\MyUser\AppData\Local\Temp\nmD798.tmp
  48. > main.cpp
  49. > .\main.cpp(2): fatal error C1083: Cannot open include file: 'alloca.h': No such file or directory
  50. > NMAKE : fatal error U1077: '"C:\Program Files (x86)\Microsoft Visual Studio\2017\Professional\VC\Tools\MSVC\14.16.27023\bin\HostX64\x64\cl.EXE"' : return code '0x2'
  51. > Stop.
  52. test config.qtbase.tests.alloca_h FAILED
  53. executing config test alloca_malloc_h
  54. + cd /d C:\qt-everywhere-src-5.15.1\config.tests\alloca_malloc_h && C:\qt-everywhere-src-5.15.1\qtbase\bin\qmake.exe "CONFIG -= qt debug_and_release app_bundle lib_bundle" "CONFIG += static warn_off console single_arch" "QMAKE_LIBDIR += C:\\Qt\\OpenSSL\\OpenSSL-1.1.1\\static\\x64\\Release\\lib" "INCLUDEPATH += C:\\Qt\\OpenSSL\\OpenSSL-1.1.1\\static\\x64\\Release\\include" C:/qt-everywhere-src-5.15.1/config.tests/alloca_malloc_h
  55. + cd /d C:\qt-everywhere-src-5.15.1\config.tests\alloca_malloc_h && set MAKEFLAGS=& nmake
  56. > Microsoft (R) Program Maintenance Utility Version 14.16.27045.0
  57. > Copyright (C) Microsoft Corporation. All rights reserved.
  58. > cl -c -nologo -Zc:wchar_t -FS -Zc:rvalueCast -Zc:inline -Zc:strictStrings -Zc:throwingNew -Zc:referenceBinding -Zc:__cplusplus -O2 -MT -W0 -EHsc -DUNICODE -D_UNICODE -DWIN32 -D_ENABLE_EXTENDED_ALIGNED_STORAGE -DWIN64 -DNDEBUG -I. -IC:\Qt\OpenSSL\OpenSSL-1.1.1\static\x64\Release\include -IC:\qt-everywhere-src-5.15.1\qtbase\mkspecs\win32-msvc -Fo @C:\Users\MyUser\AppData\Local\Temp\nmD7F6.tmp
  59. > main.cpp
  60. > link /NOLOGO /DYNAMICBASE /NXCOMPAT /OPT:REF /INCREMENTAL:NO /SUBSYSTEM:CONSOLE "/MANIFESTDEPENDENCY:type='win32' name='Microsoft.Windows.Common-Controls' version='6.0.0.0' publicKeyToken='6595b64144ccf1df' language='*' processorArchitecture='*'" /MANIFEST:embed /OUT:alloca_malloc_h.exe @C:\Users\MyUser\AppData\Local\Temp\nmD816.tmp
  61. test config.qtbase.tests.alloca_malloc_h succeeded
  62. executing config test sse3
  63. + cd /d C:\qt-everywhere-src-5.15.1\config.tests\x86_simd && C:\qt-everywhere-src-5.15.1\qtbase\bin\qmake.exe "CONFIG -= qt debug_and_release app_bundle lib_bundle" "CONFIG += static warn_off console single_arch" "QMAKE_LIBDIR += C:\\Qt\\OpenSSL\\OpenSSL-1.1.1\\static\\x64\\Release\\lib" "INCLUDEPATH += C:\\Qt\\OpenSSL\\OpenSSL-1.1.1\\static\\x64\\Release\\include" "CONFIG+=add_cflags" "DEFINES+=NO_ATTRIBUTE" "SIMD=sse3" C:/qt-everywhere-src-5.15.1/qtbase/config.tests/x86_simd
  64. + cd /d C:\qt-everywhere-src-5.15.1\config.tests\x86_simd && set MAKEFLAGS=& nmake clean && set MAKEFLAGS=& nmake
  65. > Microsoft (R) Program Maintenance Utility Version 14.16.27045.0
  66. > Copyright (C) Microsoft Corporation. All rights reserved.
  67. > del main.obj
  68. > Microsoft (R) Program Maintenance Utility Version 14.16.27045.0
  69. > Copyright (C) Microsoft Corporation. All rights reserved.
  70. > cl -c -nologo -Zc:wchar_t -FS -Zc:rvalueCast -Zc:inline -Zc:strictStrings -Zc:throwingNew -Zc:referenceBinding -Zc:__cplusplus -O2 -MT -W0 -EHsc -DUNICODE -D_UNICODE -DWIN32 -D_ENABLE_EXTENDED_ALIGNED_STORAGE -DWIN64 -DNO_ATTRIBUTE -DQT_COMPILER_SUPPORTS_SSE3 -DNDEBUG -IC:\qt-everywhere-src-5.15.1\qtbase\config.tests\x86_simd -I. -IC:\Qt\OpenSSL\OpenSSL-1.1.1\static\x64\Release\include -IC:\qt-everywhere-src-5.15.1\qtbase\mkspecs\win32-msvc -Fo @C:\Users\MyUser\AppData\Local\Temp\nmD8B1.tmp
  71. > main.cpp
  72. > link /NOLOGO /DYNAMICBASE /NXCOMPAT /OPT:REF /INCREMENTAL:NO /SUBSYSTEM:CONSOLE "/MANIFESTDEPENDENCY:type='win32' name='Microsoft.Windows.Common-Controls' version='6.0.0.0' publicKeyToken='6595b64144ccf1df' language='*' processorArchitecture='*'" /MANIFEST:embed /OUT:x86_simd.exe @C:\Users\MyUser\AppData\Local\Temp\nmD8F1.tmp
  73. test config.qtbase.tests.sse3 succeeded
  74. executing config test ssse3
  75. + cd /d C:\qt-everywhere-src-5.15.1\config.tests\x86_simd && C:\qt-everywhere-src-5.15.1\qtbase\bin\qmake.exe "CONFIG -= qt debug_and_release app_bundle lib_bundle" "CONFIG += static warn_off console single_arch" "QMAKE_LIBDIR += C:\\Qt\\OpenSSL\\OpenSSL-1.1.1\\static\\x64\\Release\\lib" "INCLUDEPATH += C:\\Qt\\OpenSSL\\OpenSSL-1.1.1\\static\\x64\\Release\\include" "CONFIG+=add_cflags" "DEFINES+=NO_ATTRIBUTE" "SIMD=ssse3" C:/qt-everywhere-src-5.15.1/qtbase/config.tests/x86_simd
  76. + cd /d C:\qt-everywhere-src-5.15.1\config.tests\x86_simd && set MAKEFLAGS=& nmake clean && set MAKEFLAGS=& nmake
  77. > Microsoft (R) Program Maintenance Utility Version 14.16.27045.0
  78. > Copyright (C) Microsoft Corporation. All rights reserved.
  79. > del main.obj
  80. > Microsoft (R) Program Maintenance Utility Version 14.16.27045.0
  81. > Copyright (C) Microsoft Corporation. All rights reserved.
  82. > cl -c -nologo -Zc:wchar_t -FS -Zc:rvalueCast -Zc:inline -Zc:strictStrings -Zc:throwingNew -Zc:referenceBinding -Zc:__cplusplus -O2 -MT -W0 -EHsc -DUNICODE -D_UNICODE -DWIN32 -D_ENABLE_EXTENDED_ALIGNED_STORAGE -DWIN64 -DNO_ATTRIBUTE -DQT_COMPILER_SUPPORTS_SSSE3 -DNDEBUG -IC:\qt-everywhere-src-5.15.1\qtbase\config.tests\x86_simd -I. -IC:\Qt\OpenSSL\OpenSSL-1.1.1\static\x64\Release\include -IC:\qt-everywhere-src-5.15.1\qtbase\mkspecs\win32-msvc -Fo @C:\Users\MyUser\AppData\Local\Temp\nmD98C.tmp
  83. > main.cpp
  84. > link /NOLOGO /DYNAMICBASE /NXCOMPAT /OPT:REF /INCREMENTAL:NO /SUBSYSTEM:CONSOLE "/MANIFESTDEPENDENCY:type='win32' name='Microsoft.Windows.Common-Controls' version='6.0.0.0' publicKeyToken='6595b64144ccf1df' language='*' processorArchitecture='*'" /MANIFEST:embed /OUT:x86_simd.exe @C:\Users\MyUser\AppData\Local\Temp\nmD9CC.tmp
  85. test config.qtbase.tests.ssse3 succeeded
  86. executing config test sse4_1
  87. + cd /d C:\qt-everywhere-src-5.15.1\config.tests\x86_simd && C:\qt-everywhere-src-5.15.1\qtbase\bin\qmake.exe "CONFIG -= qt debug_and_release app_bundle lib_bundle" "CONFIG += static warn_off console single_arch" "QMAKE_LIBDIR += C:\\Qt\\OpenSSL\\OpenSSL-1.1.1\\static\\x64\\Release\\lib" "INCLUDEPATH += C:\\Qt\\OpenSSL\\OpenSSL-1.1.1\\static\\x64\\Release\\include" "CONFIG+=add_cflags" "DEFINES+=NO_ATTRIBUTE" "SIMD=sse4_1" C:/qt-everywhere-src-5.15.1/qtbase/config.tests/x86_simd
  88. + cd /d C:\qt-everywhere-src-5.15.1\config.tests\x86_simd && set MAKEFLAGS=& nmake clean && set MAKEFLAGS=& nmake
  89. > Microsoft (R) Program Maintenance Utility Version 14.16.27045.0
  90. > Copyright (C) Microsoft Corporation. All rights reserved.
  91. > del main.obj
  92. > Microsoft (R) Program Maintenance Utility Version 14.16.27045.0
  93. > Copyright (C) Microsoft Corporation. All rights reserved.
  94. > cl -c -nologo -Zc:wchar_t -FS -Zc:rvalueCast -Zc:inline -Zc:strictStrings -Zc:throwingNew -Zc:referenceBinding -Zc:__cplusplus -O2 -MT -W0 -EHsc -DUNICODE -D_UNICODE -DWIN32 -D_ENABLE_EXTENDED_ALIGNED_STORAGE -DWIN64 -DNO_ATTRIBUTE -DQT_COMPILER_SUPPORTS_SSE4_1 -DNDEBUG -IC:\qt-everywhere-src-5.15.1\qtbase\config.tests\x86_simd -I. -IC:\Qt\OpenSSL\OpenSSL-1.1.1\static\x64\Release\include -IC:\qt-everywhere-src-5.15.1\qtbase\mkspecs\win32-msvc -Fo @C:\Users\MyUser\AppData\Local\Temp\nmDA67.tmp
  95. > main.cpp
  96. > link /NOLOGO /DYNAMICBASE /NXCOMPAT /OPT:REF /INCREMENTAL:NO /SUBSYSTEM:CONSOLE "/MANIFESTDEPENDENCY:type='win32' name='Microsoft.Windows.Common-Controls' version='6.0.0.0' publicKeyToken='6595b64144ccf1df' language='*' processorArchitecture='*'" /MANIFEST:embed /OUT:x86_simd.exe @C:\Users\MyUser\AppData\Local\Temp\nmDA97.tmp
  97. test config.qtbase.tests.sse4_1 succeeded
  98. executing config test sse4_2
  99. + cd /d C:\qt-everywhere-src-5.15.1\config.tests\x86_simd && C:\qt-everywhere-src-5.15.1\qtbase\bin\qmake.exe "CONFIG -= qt debug_and_release app_bundle lib_bundle" "CONFIG += static warn_off console single_arch" "QMAKE_LIBDIR += C:\\Qt\\OpenSSL\\OpenSSL-1.1.1\\static\\x64\\Release\\lib" "INCLUDEPATH += C:\\Qt\\OpenSSL\\OpenSSL-1.1.1\\static\\x64\\Release\\include" "CONFIG+=add_cflags" "DEFINES+=NO_ATTRIBUTE" "SIMD=sse4_2" C:/qt-everywhere-src-5.15.1/qtbase/config.tests/x86_simd
  100. + cd /d C:\qt-everywhere-src-5.15.1\config.tests\x86_simd && set MAKEFLAGS=& nmake clean && set MAKEFLAGS=& nmake
  101. > Microsoft (R) Program Maintenance Utility Version 14.16.27045.0
  102. > Copyright (C) Microsoft Corporation. All rights reserved.
  103. > del main.obj
  104. > Microsoft (R) Program Maintenance Utility Version 14.16.27045.0
  105. > Copyright (C) Microsoft Corporation. All rights reserved.
  106. > cl -c -nologo -Zc:wchar_t -FS -Zc:rvalueCast -Zc:inline -Zc:strictStrings -Zc:throwingNew -Zc:referenceBinding -Zc:__cplusplus -O2 -MT -W0 -EHsc -DUNICODE -D_UNICODE -DWIN32 -D_ENABLE_EXTENDED_ALIGNED_STORAGE -DWIN64 -DNO_ATTRIBUTE -DQT_COMPILER_SUPPORTS_SSE4_2 -DNDEBUG -IC:\qt-everywhere-src-5.15.1\qtbase\config.tests\x86_simd -I. -IC:\Qt\OpenSSL\OpenSSL-1.1.1\static\x64\Release\include -IC:\qt-everywhere-src-5.15.1\qtbase\mkspecs\win32-msvc -Fo @C:\Users\MyUser\AppData\Local\Temp\nmDB32.tmp
  107. > main.cpp
  108. > link /NOLOGO /DYNAMICBASE /NXCOMPAT /OPT:REF /INCREMENTAL:NO /SUBSYSTEM:CONSOLE "/MANIFESTDEPENDENCY:type='win32' name='Microsoft.Windows.Common-Controls' version='6.0.0.0' publicKeyToken='6595b64144ccf1df' language='*' processorArchitecture='*'" /MANIFEST:embed /OUT:x86_simd.exe @C:\Users\MyUser\AppData\Local\Temp\nmDB72.tmp
  109. test config.qtbase.tests.sse4_2 succeeded
  110. executing config test avx
  111. + cd /d C:\qt-everywhere-src-5.15.1\config.tests\x86_simd && C:\qt-everywhere-src-5.15.1\qtbase\bin\qmake.exe "CONFIG -= qt debug_and_release app_bundle lib_bundle" "CONFIG += static warn_off console single_arch" "QMAKE_LIBDIR += C:\\Qt\\OpenSSL\\OpenSSL-1.1.1\\static\\x64\\Release\\lib" "INCLUDEPATH += C:\\Qt\\OpenSSL\\OpenSSL-1.1.1\\static\\x64\\Release\\include" "CONFIG+=add_cflags" "DEFINES+=NO_ATTRIBUTE" "SIMD=avx" C:/qt-everywhere-src-5.15.1/qtbase/config.tests/x86_simd
  112. + cd /d C:\qt-everywhere-src-5.15.1\config.tests\x86_simd && set MAKEFLAGS=& nmake clean && set MAKEFLAGS=& nmake
  113. > Microsoft (R) Program Maintenance Utility Version 14.16.27045.0
  114. > Copyright (C) Microsoft Corporation. All rights reserved.
  115. > del main.obj
  116. > Microsoft (R) Program Maintenance Utility Version 14.16.27045.0
  117. > Copyright (C) Microsoft Corporation. All rights reserved.
  118. > cl -c -nologo -Zc:wchar_t -FS -Zc:rvalueCast -Zc:inline -Zc:strictStrings -Zc:throwingNew -Zc:referenceBinding -Zc:__cplusplus -arch:AVX -O2 -MT -W0 -EHsc -DUNICODE -D_UNICODE -DWIN32 -D_ENABLE_EXTENDED_ALIGNED_STORAGE -DWIN64 -DNO_ATTRIBUTE -DQT_COMPILER_SUPPORTS_AVX -DNDEBUG -IC:\qt-everywhere-src-5.15.1\qtbase\config.tests\x86_simd -I. -IC:\Qt\OpenSSL\OpenSSL-1.1.1\static\x64\Release\include -IC:\qt-everywhere-src-5.15.1\qtbase\mkspecs\win32-msvc -Fo @C:\Users\MyUser\AppData\Local\Temp\nmDC1C.tmp
  119. > main.cpp
  120. > link /NOLOGO /DYNAMICBASE /NXCOMPAT /OPT:REF /INCREMENTAL:NO /SUBSYSTEM:CONSOLE "/MANIFESTDEPENDENCY:type='win32' name='Microsoft.Windows.Common-Controls' version='6.0.0.0' publicKeyToken='6595b64144ccf1df' language='*' processorArchitecture='*'" /MANIFEST:embed /OUT:x86_simd.exe @C:\Users\MyUser\AppData\Local\Temp\nmDC5C.tmp
  121. test config.qtbase.tests.avx succeeded
  122. executing config test avx2
  123. + cd /d C:\qt-everywhere-src-5.15.1\config.tests\x86_simd && C:\qt-everywhere-src-5.15.1\qtbase\bin\qmake.exe "CONFIG -= qt debug_and_release app_bundle lib_bundle" "CONFIG += static warn_off console single_arch" "QMAKE_LIBDIR += C:\\Qt\\OpenSSL\\OpenSSL-1.1.1\\static\\x64\\Release\\lib" "INCLUDEPATH += C:\\Qt\\OpenSSL\\OpenSSL-1.1.1\\static\\x64\\Release\\include" "CONFIG+=add_cflags" "DEFINES+=NO_ATTRIBUTE" "SIMD=avx2" C:/qt-everywhere-src-5.15.1/qtbase/config.tests/x86_simd
  124. + cd /d C:\qt-everywhere-src-5.15.1\config.tests\x86_simd && set MAKEFLAGS=& nmake clean && set MAKEFLAGS=& nmake
  125. > Microsoft (R) Program Maintenance Utility Version 14.16.27045.0
  126. > Copyright (C) Microsoft Corporation. All rights reserved.
  127. > del main.obj
  128. > Microsoft (R) Program Maintenance Utility Version 14.16.27045.0
  129. > Copyright (C) Microsoft Corporation. All rights reserved.
  130. > cl -c -nologo -Zc:wchar_t -FS -Zc:rvalueCast -Zc:inline -Zc:strictStrings -Zc:throwingNew -Zc:referenceBinding -Zc:__cplusplus -arch:AVX2 -O2 -MT -W0 -EHsc -DUNICODE -D_UNICODE -DWIN32 -D_ENABLE_EXTENDED_ALIGNED_STORAGE -DWIN64 -DNO_ATTRIBUTE -DQT_COMPILER_SUPPORTS_AVX2 -DNDEBUG -IC:\qt-everywhere-src-5.15.1\qtbase\config.tests\x86_simd -I. -IC:\Qt\OpenSSL\OpenSSL-1.1.1\static\x64\Release\include -IC:\qt-everywhere-src-5.15.1\qtbase\mkspecs\win32-msvc -Fo @C:\Users\MyUser\AppData\Local\Temp\nmDCF7.tmp
  131. > main.cpp
  132. > link /NOLOGO /DYNAMICBASE /NXCOMPAT /OPT:REF /INCREMENTAL:NO /SUBSYSTEM:CONSOLE "/MANIFESTDEPENDENCY:type='win32' name='Microsoft.Windows.Common-Controls' version='6.0.0.0' publicKeyToken='6595b64144ccf1df' language='*' processorArchitecture='*'" /MANIFEST:embed /OUT:x86_simd.exe @C:\Users\MyUser\AppData\Local\Temp\nmDD37.tmp
  133. test config.qtbase.tests.avx2 succeeded
  134. executing config test avx512f
  135. + cd /d C:\qt-everywhere-src-5.15.1\config.tests\x86_simd && C:\qt-everywhere-src-5.15.1\qtbase\bin\qmake.exe "CONFIG -= qt debug_and_release app_bundle lib_bundle" "CONFIG += static warn_off console single_arch" "QMAKE_LIBDIR += C:\\Qt\\OpenSSL\\OpenSSL-1.1.1\\static\\x64\\Release\\lib" "INCLUDEPATH += C:\\Qt\\OpenSSL\\OpenSSL-1.1.1\\static\\x64\\Release\\include" "CONFIG+=add_cflags" "DEFINES+=NO_ATTRIBUTE" "SIMD=avx512f" C:/qt-everywhere-src-5.15.1/qtbase/config.tests/x86_simd
  136. + cd /d C:\qt-everywhere-src-5.15.1\config.tests\x86_simd && set MAKEFLAGS=& nmake clean && set MAKEFLAGS=& nmake
  137. > Microsoft (R) Program Maintenance Utility Version 14.16.27045.0
  138. > Copyright (C) Microsoft Corporation. All rights reserved.
  139. > del main.obj
  140. > Microsoft (R) Program Maintenance Utility Version 14.16.27045.0
  141. > Copyright (C) Microsoft Corporation. All rights reserved.
  142. > cl -c -nologo -Zc:wchar_t -FS -Zc:rvalueCast -Zc:inline -Zc:strictStrings -Zc:throwingNew -Zc:referenceBinding -Zc:__cplusplus -arch:AVX512 -O2 -MT -W0 -EHsc -DUNICODE -D_UNICODE -DWIN32 -D_ENABLE_EXTENDED_ALIGNED_STORAGE -DWIN64 -DNO_ATTRIBUTE -DQT_COMPILER_SUPPORTS_AVX512F -DNDEBUG -IC:\qt-everywhere-src-5.15.1\qtbase\config.tests\x86_simd -I. -IC:\Qt\OpenSSL\OpenSSL-1.1.1\static\x64\Release\include -IC:\qt-everywhere-src-5.15.1\qtbase\mkspecs\win32-msvc -Fo @C:\Users\MyUser\AppData\Local\Temp\nmDDC2.tmp
  143. > main.cpp
  144. > link /NOLOGO /DYNAMICBASE /NXCOMPAT /OPT:REF /INCREMENTAL:NO /SUBSYSTEM:CONSOLE "/MANIFESTDEPENDENCY:type='win32' name='Microsoft.Windows.Common-Controls' version='6.0.0.0' publicKeyToken='6595b64144ccf1df' language='*' processorArchitecture='*'" /MANIFEST:embed /OUT:x86_simd.exe @C:\Users\MyUser\AppData\Local\Temp\nmDE02.tmp
  145. test config.qtbase.tests.avx512f succeeded
  146. executing config test avx512bw
  147. + cd /d C:\qt-everywhere-src-5.15.1\config.tests\x86_simd && C:\qt-everywhere-src-5.15.1\qtbase\bin\qmake.exe "CONFIG -= qt debug_and_release app_bundle lib_bundle" "CONFIG += static warn_off console single_arch" "QMAKE_LIBDIR += C:\\Qt\\OpenSSL\\OpenSSL-1.1.1\\static\\x64\\Release\\lib" "INCLUDEPATH += C:\\Qt\\OpenSSL\\OpenSSL-1.1.1\\static\\x64\\Release\\include" "CONFIG+=add_cflags" "DEFINES+=NO_ATTRIBUTE" "SIMD=avx512bw" C:/qt-everywhere-src-5.15.1/qtbase/config.tests/x86_simd
  148. + cd /d C:\qt-everywhere-src-5.15.1\config.tests\x86_simd && set MAKEFLAGS=& nmake clean && set MAKEFLAGS=& nmake
  149. > Microsoft (R) Program Maintenance Utility Version 14.16.27045.0
  150. > Copyright (C) Microsoft Corporation. All rights reserved.
  151. > del main.obj
  152. > Microsoft (R) Program Maintenance Utility Version 14.16.27045.0
  153. > Copyright (C) Microsoft Corporation. All rights reserved.
  154. > cl -c -nologo -Zc:wchar_t -FS -Zc:rvalueCast -Zc:inline -Zc:strictStrings -Zc:throwingNew -Zc:referenceBinding -Zc:__cplusplus -arch:AVX512 -O2 -MT -W0 -EHsc -DUNICODE -D_UNICODE -DWIN32 -D_ENABLE_EXTENDED_ALIGNED_STORAGE -DWIN64 -DNO_ATTRIBUTE -DQT_COMPILER_SUPPORTS_AVX512BW -DNDEBUG -IC:\qt-everywhere-src-5.15.1\qtbase\config.tests\x86_simd -I. -IC:\Qt\OpenSSL\OpenSSL-1.1.1\static\x64\Release\include -IC:\qt-everywhere-src-5.15.1\qtbase\mkspecs\win32-msvc -Fo @C:\Users\MyUser\AppData\Local\Temp\nmDE9D.tmp
  155. > main.cpp
  156. > link /NOLOGO /DYNAMICBASE /NXCOMPAT /OPT:REF /INCREMENTAL:NO /SUBSYSTEM:CONSOLE "/MANIFESTDEPENDENCY:type='win32' name='Microsoft.Windows.Common-Controls' version='6.0.0.0' publicKeyToken='6595b64144ccf1df' language='*' processorArchitecture='*'" /MANIFEST:embed /OUT:x86_simd.exe @C:\Users\MyUser\AppData\Local\Temp\nmDEDD.tmp
  157. test config.qtbase.tests.avx512bw succeeded
  158. executing config test avx512cd
  159. + cd /d C:\qt-everywhere-src-5.15.1\config.tests\x86_simd && C:\qt-everywhere-src-5.15.1\qtbase\bin\qmake.exe "CONFIG -= qt debug_and_release app_bundle lib_bundle" "CONFIG += static warn_off console single_arch" "QMAKE_LIBDIR += C:\\Qt\\OpenSSL\\OpenSSL-1.1.1\\static\\x64\\Release\\lib" "INCLUDEPATH += C:\\Qt\\OpenSSL\\OpenSSL-1.1.1\\static\\x64\\Release\\include" "CONFIG+=add_cflags" "DEFINES+=NO_ATTRIBUTE" "SIMD=avx512cd" C:/qt-everywhere-src-5.15.1/qtbase/config.tests/x86_simd
  160. + cd /d C:\qt-everywhere-src-5.15.1\config.tests\x86_simd && set MAKEFLAGS=& nmake clean && set MAKEFLAGS=& nmake
  161. > Microsoft (R) Program Maintenance Utility Version 14.16.27045.0
  162. > Copyright (C) Microsoft Corporation. All rights reserved.
  163. > del main.obj
  164. > Microsoft (R) Program Maintenance Utility Version 14.16.27045.0
  165. > Copyright (C) Microsoft Corporation. All rights reserved.
  166. > cl -c -nologo -Zc:wchar_t -FS -Zc:rvalueCast -Zc:inline -Zc:strictStrings -Zc:throwingNew -Zc:referenceBinding -Zc:__cplusplus -arch:AVX512 -O2 -MT -W0 -EHsc -DUNICODE -D_UNICODE -DWIN32 -D_ENABLE_EXTENDED_ALIGNED_STORAGE -DWIN64 -DNO_ATTRIBUTE -DQT_COMPILER_SUPPORTS_AVX512CD -DNDEBUG -IC:\qt-everywhere-src-5.15.1\qtbase\config.tests\x86_simd -I. -IC:\Qt\OpenSSL\OpenSSL-1.1.1\static\x64\Release\include -IC:\qt-everywhere-src-5.15.1\qtbase\mkspecs\win32-msvc -Fo @C:\Users\MyUser\AppData\Local\Temp\nmDF78.tmp
  167. > main.cpp
  168. > link /NOLOGO /DYNAMICBASE /NXCOMPAT /OPT:REF /INCREMENTAL:NO /SUBSYSTEM:CONSOLE "/MANIFESTDEPENDENCY:type='win32' name='Microsoft.Windows.Common-Controls' version='6.0.0.0' publicKeyToken='6595b64144ccf1df' language='*' processorArchitecture='*'" /MANIFEST:embed /OUT:x86_simd.exe @C:\Users\MyUser\AppData\Local\Temp\nmDFB7.tmp
  169. test config.qtbase.tests.avx512cd succeeded
  170. executing config test avx512dq
  171. + cd /d C:\qt-everywhere-src-5.15.1\config.tests\x86_simd && C:\qt-everywhere-src-5.15.1\qtbase\bin\qmake.exe "CONFIG -= qt debug_and_release app_bundle lib_bundle" "CONFIG += static warn_off console single_arch" "QMAKE_LIBDIR += C:\\Qt\\OpenSSL\\OpenSSL-1.1.1\\static\\x64\\Release\\lib" "INCLUDEPATH += C:\\Qt\\OpenSSL\\OpenSSL-1.1.1\\static\\x64\\Release\\include" "CONFIG+=add_cflags" "DEFINES+=NO_ATTRIBUTE" "SIMD=avx512dq" C:/qt-everywhere-src-5.15.1/qtbase/config.tests/x86_simd
  172. + cd /d C:\qt-everywhere-src-5.15.1\config.tests\x86_simd && set MAKEFLAGS=& nmake clean && set MAKEFLAGS=& nmake
  173. > Microsoft (R) Program Maintenance Utility Version 14.16.27045.0
  174. > Copyright (C) Microsoft Corporation. All rights reserved.
  175. > del main.obj
  176. > Microsoft (R) Program Maintenance Utility Version 14.16.27045.0
  177. > Copyright (C) Microsoft Corporation. All rights reserved.
  178. > cl -c -nologo -Zc:wchar_t -FS -Zc:rvalueCast -Zc:inline -Zc:strictStrings -Zc:throwingNew -Zc:referenceBinding -Zc:__cplusplus -arch:AVX512 -O2 -MT -W0 -EHsc -DUNICODE -D_UNICODE -DWIN32 -D_ENABLE_EXTENDED_ALIGNED_STORAGE -DWIN64 -DNO_ATTRIBUTE -DQT_COMPILER_SUPPORTS_AVX512DQ -DNDEBUG -IC:\qt-everywhere-src-5.15.1\qtbase\config.tests\x86_simd -I. -IC:\Qt\OpenSSL\OpenSSL-1.1.1\static\x64\Release\include -IC:\qt-everywhere-src-5.15.1\qtbase\mkspecs\win32-msvc -Fo @C:\Users\MyUser\AppData\Local\Temp\nmE043.tmp
  179. > main.cpp
  180. > link /NOLOGO /DYNAMICBASE /NXCOMPAT /OPT:REF /INCREMENTAL:NO /SUBSYSTEM:CONSOLE "/MANIFESTDEPENDENCY:type='win32' name='Microsoft.Windows.Common-Controls' version='6.0.0.0' publicKeyToken='6595b64144ccf1df' language='*' processorArchitecture='*'" /MANIFEST:embed /OUT:x86_simd.exe @C:\Users\MyUser\AppData\Local\Temp\nmE082.tmp
  181. test config.qtbase.tests.avx512dq succeeded
  182. executing config test avx512er
  183. + cd /d C:\qt-everywhere-src-5.15.1\config.tests\x86_simd && C:\qt-everywhere-src-5.15.1\qtbase\bin\qmake.exe "CONFIG -= qt debug_and_release app_bundle lib_bundle" "CONFIG += static warn_off console single_arch" "QMAKE_LIBDIR += C:\\Qt\\OpenSSL\\OpenSSL-1.1.1\\static\\x64\\Release\\lib" "INCLUDEPATH += C:\\Qt\\OpenSSL\\OpenSSL-1.1.1\\static\\x64\\Release\\include" "CONFIG+=add_cflags" "DEFINES+=NO_ATTRIBUTE" "SIMD=avx512er" C:/qt-everywhere-src-5.15.1/qtbase/config.tests/x86_simd
  184. + cd /d C:\qt-everywhere-src-5.15.1\config.tests\x86_simd && set MAKEFLAGS=& nmake clean && set MAKEFLAGS=& nmake
  185. > Microsoft (R) Program Maintenance Utility Version 14.16.27045.0
  186. > Copyright (C) Microsoft Corporation. All rights reserved.
  187. > del main.obj
  188. > Microsoft (R) Program Maintenance Utility Version 14.16.27045.0
  189. > Copyright (C) Microsoft Corporation. All rights reserved.
  190. > cl -c -nologo -Zc:wchar_t -FS -Zc:rvalueCast -Zc:inline -Zc:strictStrings -Zc:throwingNew -Zc:referenceBinding -Zc:__cplusplus -arch:AVX512 -O2 -MT -W0 -EHsc -DUNICODE -D_UNICODE -DWIN32 -D_ENABLE_EXTENDED_ALIGNED_STORAGE -DWIN64 -DNO_ATTRIBUTE -DQT_COMPILER_SUPPORTS_AVX512ER -DNDEBUG -IC:\qt-everywhere-src-5.15.1\qtbase\config.tests\x86_simd -I. -IC:\Qt\OpenSSL\OpenSSL-1.1.1\static\x64\Release\include -IC:\qt-everywhere-src-5.15.1\qtbase\mkspecs\win32-msvc -Fo @C:\Users\MyUser\AppData\Local\Temp\nmE11E.tmp
  191. > main.cpp
  192. > link /NOLOGO /DYNAMICBASE /NXCOMPAT /OPT:REF /INCREMENTAL:NO /SUBSYSTEM:CONSOLE "/MANIFESTDEPENDENCY:type='win32' name='Microsoft.Windows.Common-Controls' version='6.0.0.0' publicKeyToken='6595b64144ccf1df' language='*' processorArchitecture='*'" /MANIFEST:embed /OUT:x86_simd.exe @C:\Users\MyUser\AppData\Local\Temp\nmE15D.tmp
  193. test config.qtbase.tests.avx512er succeeded
  194. executing config test avx512ifma
  195. + cd /d C:\qt-everywhere-src-5.15.1\config.tests\x86_simd && C:\qt-everywhere-src-5.15.1\qtbase\bin\qmake.exe "CONFIG -= qt debug_and_release app_bundle lib_bundle" "CONFIG += static warn_off console single_arch" "QMAKE_LIBDIR += C:\\Qt\\OpenSSL\\OpenSSL-1.1.1\\static\\x64\\Release\\lib" "INCLUDEPATH += C:\\Qt\\OpenSSL\\OpenSSL-1.1.1\\static\\x64\\Release\\include" "CONFIG+=add_cflags" "DEFINES+=NO_ATTRIBUTE" "SIMD=avx512ifma" C:/qt-everywhere-src-5.15.1/qtbase/config.tests/x86_simd
  196. + cd /d C:\qt-everywhere-src-5.15.1\config.tests\x86_simd && set MAKEFLAGS=& nmake clean && set MAKEFLAGS=& nmake
  197. > Microsoft (R) Program Maintenance Utility Version 14.16.27045.0
  198. > Copyright (C) Microsoft Corporation. All rights reserved.
  199. > del main.obj
  200. > Microsoft (R) Program Maintenance Utility Version 14.16.27045.0
  201. > Copyright (C) Microsoft Corporation. All rights reserved.
  202. > cl -c -nologo -Zc:wchar_t -FS -Zc:rvalueCast -Zc:inline -Zc:strictStrings -Zc:throwingNew -Zc:referenceBinding -Zc:__cplusplus -arch:AVX512 -O2 -MT -W0 -EHsc -DUNICODE -D_UNICODE -DWIN32 -D_ENABLE_EXTENDED_ALIGNED_STORAGE -DWIN64 -DNO_ATTRIBUTE -DQT_COMPILER_SUPPORTS_AVX512IFMA -DNDEBUG -IC:\qt-everywhere-src-5.15.1\qtbase\config.tests\x86_simd -I. -IC:\Qt\OpenSSL\OpenSSL-1.1.1\static\x64\Release\include -IC:\qt-everywhere-src-5.15.1\qtbase\mkspecs\win32-msvc -Fo @C:\Users\MyUser\AppData\Local\Temp\nmE1F8.tmp
  203. > main.cpp
  204. > link /NOLOGO /DYNAMICBASE /NXCOMPAT /OPT:REF /INCREMENTAL:NO /SUBSYSTEM:CONSOLE "/MANIFESTDEPENDENCY:type='win32' name='Microsoft.Windows.Common-Controls' version='6.0.0.0' publicKeyToken='6595b64144ccf1df' language='*' processorArchitecture='*'" /MANIFEST:embed /OUT:x86_simd.exe @C:\Users\MyUser\AppData\Local\Temp\nmE238.tmp
  205. test config.qtbase.tests.avx512ifma succeeded
  206. executing config test avx512pf
  207. + cd /d C:\qt-everywhere-src-5.15.1\config.tests\x86_simd && C:\qt-everywhere-src-5.15.1\qtbase\bin\qmake.exe "CONFIG -= qt debug_and_release app_bundle lib_bundle" "CONFIG += static warn_off console single_arch" "QMAKE_LIBDIR += C:\\Qt\\OpenSSL\\OpenSSL-1.1.1\\static\\x64\\Release\\lib" "INCLUDEPATH += C:\\Qt\\OpenSSL\\OpenSSL-1.1.1\\static\\x64\\Release\\include" "CONFIG+=add_cflags" "DEFINES+=NO_ATTRIBUTE" "SIMD=avx512pf" C:/qt-everywhere-src-5.15.1/qtbase/config.tests/x86_simd
  208. + cd /d C:\qt-everywhere-src-5.15.1\config.tests\x86_simd && set MAKEFLAGS=& nmake clean && set MAKEFLAGS=& nmake
  209. > Microsoft (R) Program Maintenance Utility Version 14.16.27045.0
  210. > Copyright (C) Microsoft Corporation. All rights reserved.
  211. > del main.obj
  212. > Microsoft (R) Program Maintenance Utility Version 14.16.27045.0
  213. > Copyright (C) Microsoft Corporation. All rights reserved.
  214. > cl -c -nologo -Zc:wchar_t -FS -Zc:rvalueCast -Zc:inline -Zc:strictStrings -Zc:throwingNew -Zc:referenceBinding -Zc:__cplusplus -arch:AVX512 -O2 -MT -W0 -EHsc -DUNICODE -D_UNICODE -DWIN32 -D_ENABLE_EXTENDED_ALIGNED_STORAGE -DWIN64 -DNO_ATTRIBUTE -DQT_COMPILER_SUPPORTS_AVX512PF -DNDEBUG -IC:\qt-everywhere-src-5.15.1\qtbase\config.tests\x86_simd -I. -IC:\Qt\OpenSSL\OpenSSL-1.1.1\static\x64\Release\include -IC:\qt-everywhere-src-5.15.1\qtbase\mkspecs\win32-msvc -Fo @C:\Users\MyUser\AppData\Local\Temp\nmE2D3.tmp
  215. > main.cpp
  216. > link /NOLOGO /DYNAMICBASE /NXCOMPAT /OPT:REF /INCREMENTAL:NO /SUBSYSTEM:CONSOLE "/MANIFESTDEPENDENCY:type='win32' name='Microsoft.Windows.Common-Controls' version='6.0.0.0' publicKeyToken='6595b64144ccf1df' language='*' processorArchitecture='*'" /MANIFEST:embed /OUT:x86_simd.exe @C:\Users\MyUser\AppData\Local\Temp\nmE303.tmp
  217. test config.qtbase.tests.avx512pf succeeded
  218. executing config test avx512vbmi
  219. + cd /d C:\qt-everywhere-src-5.15.1\config.tests\x86_simd && C:\qt-everywhere-src-5.15.1\qtbase\bin\qmake.exe "CONFIG -= qt debug_and_release app_bundle lib_bundle" "CONFIG += static warn_off console single_arch" "QMAKE_LIBDIR += C:\\Qt\\OpenSSL\\OpenSSL-1.1.1\\static\\x64\\Release\\lib" "INCLUDEPATH += C:\\Qt\\OpenSSL\\OpenSSL-1.1.1\\static\\x64\\Release\\include" "CONFIG+=add_cflags" "DEFINES+=NO_ATTRIBUTE" "SIMD=avx512vbmi" C:/qt-everywhere-src-5.15.1/qtbase/config.tests/x86_simd
  220. + cd /d C:\qt-everywhere-src-5.15.1\config.tests\x86_simd && set MAKEFLAGS=& nmake clean && set MAKEFLAGS=& nmake
  221. > Microsoft (R) Program Maintenance Utility Version 14.16.27045.0
  222. > Copyright (C) Microsoft Corporation. All rights reserved.
  223. > del main.obj
  224. > Microsoft (R) Program Maintenance Utility Version 14.16.27045.0
  225. > Copyright (C) Microsoft Corporation. All rights reserved.
  226. > cl -c -nologo -Zc:wchar_t -FS -Zc:rvalueCast -Zc:inline -Zc:strictStrings -Zc:throwingNew -Zc:referenceBinding -Zc:__cplusplus -arch:AVX512 -O2 -MT -W0 -EHsc -DUNICODE -D_UNICODE -DWIN32 -D_ENABLE_EXTENDED_ALIGNED_STORAGE -DWIN64 -DNO_ATTRIBUTE -DQT_COMPILER_SUPPORTS_AVX512VBMI -DNDEBUG -IC:\qt-everywhere-src-5.15.1\qtbase\config.tests\x86_simd -I. -IC:\Qt\OpenSSL\OpenSSL-1.1.1\static\x64\Release\include -IC:\qt-everywhere-src-5.15.1\qtbase\mkspecs\win32-msvc -Fo @C:\Users\MyUser\AppData\Local\Temp\nmE3AE.tmp
  227. > main.cpp
  228. > link /NOLOGO /DYNAMICBASE /NXCOMPAT /OPT:REF /INCREMENTAL:NO /SUBSYSTEM:CONSOLE "/MANIFESTDEPENDENCY:type='win32' name='Microsoft.Windows.Common-Controls' version='6.0.0.0' publicKeyToken='6595b64144ccf1df' language='*' processorArchitecture='*'" /MANIFEST:embed /OUT:x86_simd.exe @C:\Users\MyUser\AppData\Local\Temp\nmE3ED.tmp
  229. test config.qtbase.tests.avx512vbmi succeeded
  230. executing config test avx512vl
  231. + cd /d C:\qt-everywhere-src-5.15.1\config.tests\x86_simd && C:\qt-everywhere-src-5.15.1\qtbase\bin\qmake.exe "CONFIG -= qt debug_and_release app_bundle lib_bundle" "CONFIG += static warn_off console single_arch" "QMAKE_LIBDIR += C:\\Qt\\OpenSSL\\OpenSSL-1.1.1\\static\\x64\\Release\\lib" "INCLUDEPATH += C:\\Qt\\OpenSSL\\OpenSSL-1.1.1\\static\\x64\\Release\\include" "CONFIG+=add_cflags" "DEFINES+=NO_ATTRIBUTE" "SIMD=avx512vl" C:/qt-everywhere-src-5.15.1/qtbase/config.tests/x86_simd
  232. + cd /d C:\qt-everywhere-src-5.15.1\config.tests\x86_simd && set MAKEFLAGS=& nmake clean && set MAKEFLAGS=& nmake
  233. > Microsoft (R) Program Maintenance Utility Version 14.16.27045.0
  234. > Copyright (C) Microsoft Corporation. All rights reserved.
  235. > del main.obj
  236. > Microsoft (R) Program Maintenance Utility Version 14.16.27045.0
  237. > Copyright (C) Microsoft Corporation. All rights reserved.
  238. > cl -c -nologo -Zc:wchar_t -FS -Zc:rvalueCast -Zc:inline -Zc:strictStrings -Zc:throwingNew -Zc:referenceBinding -Zc:__cplusplus -arch:AVX512 -O2 -MT -W0 -EHsc -DUNICODE -D_UNICODE -DWIN32 -D_ENABLE_EXTENDED_ALIGNED_STORAGE -DWIN64 -DNO_ATTRIBUTE -DQT_COMPILER_SUPPORTS_AVX512VL -DNDEBUG -IC:\qt-everywhere-src-5.15.1\qtbase\config.tests\x86_simd -I. -IC:\Qt\OpenSSL\OpenSSL-1.1.1\static\x64\Release\include -IC:\qt-everywhere-src-5.15.1\qtbase\mkspecs\win32-msvc -Fo @C:\Users\MyUser\AppData\Local\Temp\nmE489.tmp
  239. > main.cpp
  240. > link /NOLOGO /DYNAMICBASE /NXCOMPAT /OPT:REF /INCREMENTAL:NO /SUBSYSTEM:CONSOLE "/MANIFESTDEPENDENCY:type='win32' name='Microsoft.Windows.Common-Controls' version='6.0.0.0' publicKeyToken='6595b64144ccf1df' language='*' processorArchitecture='*'" /MANIFEST:embed /OUT:x86_simd.exe @C:\Users\MyUser\AppData\Local\Temp\nmE4C8.tmp
  241. test config.qtbase.tests.avx512vl succeeded
  242. executing config test cxx14
  243. + cd /d C:\qt-everywhere-src-5.15.1\config.tests\cxx14 && C:\qt-everywhere-src-5.15.1\qtbase\bin\qmake.exe "CONFIG -= qt debug_and_release app_bundle lib_bundle" "CONFIG += static warn_off console single_arch" "QMAKE_LIBDIR += C:\\Qt\\OpenSSL\\OpenSSL-1.1.1\\static\\x64\\Release\\lib" "INCLUDEPATH += C:\\Qt\\OpenSSL\\OpenSSL-1.1.1\\static\\x64\\Release\\include" C:/qt-everywhere-src-5.15.1/config.tests/cxx14
  244. + cd /d C:\qt-everywhere-src-5.15.1\config.tests\cxx14 && set MAKEFLAGS=& nmake
  245. > Microsoft (R) Program Maintenance Utility Version 14.16.27045.0
  246. > Copyright (C) Microsoft Corporation. All rights reserved.
  247. > cl -c -nologo -Zc:wchar_t -FS -Zc:rvalueCast -Zc:inline -Zc:strictStrings -Zc:throwingNew -Zc:referenceBinding -Zc:__cplusplus -O2 -MT -std:c++14 -W0 -EHsc -DUNICODE -D_UNICODE -DWIN32 -D_ENABLE_EXTENDED_ALIGNED_STORAGE -DWIN64 -DNDEBUG -I. -IC:\Qt\OpenSSL\OpenSSL-1.1.1\static\x64\Release\include -IC:\qt-everywhere-src-5.15.1\qtbase\mkspecs\win32-msvc -Fo @C:\Users\MyUser\AppData\Local\Temp\nmE544.tmp
  248. > main.cpp
  249. > link /NOLOGO /DYNAMICBASE /NXCOMPAT /OPT:REF /INCREMENTAL:NO /SUBSYSTEM:CONSOLE "/MANIFESTDEPENDENCY:type='win32' name='Microsoft.Windows.Common-Controls' version='6.0.0.0' publicKeyToken='6595b64144ccf1df' language='*' processorArchitecture='*'" /MANIFEST:embed /OUT:cxx14.exe @C:\Users\MyUser\AppData\Local\Temp\nmE564.tmp
  250. test config.qtbase.tests.cxx14 succeeded
  251. executing config test cxx17
  252. + cd /d C:\qt-everywhere-src-5.15.1\config.tests\cxx17 && C:\qt-everywhere-src-5.15.1\qtbase\bin\qmake.exe "CONFIG -= qt debug_and_release app_bundle lib_bundle" "CONFIG += static warn_off console single_arch" "QMAKE_LIBDIR += C:\\Qt\\OpenSSL\\OpenSSL-1.1.1\\static\\x64\\Release\\lib" "INCLUDEPATH += C:\\Qt\\OpenSSL\\OpenSSL-1.1.1\\static\\x64\\Release\\include" C:/qt-everywhere-src-5.15.1/config.tests/cxx17
  253. + cd /d C:\qt-everywhere-src-5.15.1\config.tests\cxx17 && set MAKEFLAGS=& nmake
  254. > Microsoft (R) Program Maintenance Utility Version 14.16.27045.0
  255. > Copyright (C) Microsoft Corporation. All rights reserved.
  256. > cl -c -nologo -Zc:wchar_t -FS -Zc:rvalueCast -Zc:inline -Zc:strictStrings -Zc:throwingNew -Zc:referenceBinding -Zc:__cplusplus -O2 -MT -std:c++17 -W0 -EHsc -DUNICODE -D_UNICODE -DWIN32 -D_ENABLE_EXTENDED_ALIGNED_STORAGE -DWIN64 -DNDEBUG -I. -IC:\Qt\OpenSSL\OpenSSL-1.1.1\static\x64\Release\include -IC:\qt-everywhere-src-5.15.1\qtbase\mkspecs\win32-msvc -Fo @C:\Users\MyUser\AppData\Local\Temp\nmE5E0.tmp
  257. > main.cpp
  258. > link /NOLOGO /DYNAMICBASE /NXCOMPAT /OPT:REF /INCREMENTAL:NO /SUBSYSTEM:CONSOLE "/MANIFESTDEPENDENCY:type='win32' name='Microsoft.Windows.Common-Controls' version='6.0.0.0' publicKeyToken='6595b64144ccf1df' language='*' processorArchitecture='*'" /MANIFEST:embed /OUT:cxx17.exe @C:\Users\MyUser\AppData\Local\Temp\nmE68D.tmp
  259. test config.qtbase.tests.cxx17 succeeded
  260. executing config test c99
  261. + cd /d C:\qt-everywhere-src-5.15.1\config.tests\c99 && C:\qt-everywhere-src-5.15.1\qtbase\bin\qmake.exe "CONFIG -= qt debug_and_release app_bundle lib_bundle" "CONFIG += static warn_off console single_arch" "QMAKE_LIBDIR += C:\\Qt\\OpenSSL\\OpenSSL-1.1.1\\static\\x64\\Release\\lib" "INCLUDEPATH += C:\\Qt\\OpenSSL\\OpenSSL-1.1.1\\static\\x64\\Release\\include" C:/qt-everywhere-src-5.15.1/config.tests/c99
  262. + cd /d C:\qt-everywhere-src-5.15.1\config.tests\c99 && set MAKEFLAGS=& nmake
  263. > Microsoft (R) Program Maintenance Utility Version 14.16.27045.0
  264. > Copyright (C) Microsoft Corporation. All rights reserved.
  265. > cl -c -nologo -Zc:wchar_t -FS -Zc:strictStrings -O2 -MT -W0 -DUNICODE -D_UNICODE -DWIN32 -D_ENABLE_EXTENDED_ALIGNED_STORAGE -DWIN64 -DNDEBUG -I. -IC:\Qt\OpenSSL\OpenSSL-1.1.1\static\x64\Release\include -IC:\qt-everywhere-src-5.15.1\qtbase\mkspecs\win32-msvc -Fo @C:\Users\MyUser\AppData\Local\Temp\nmE719.tmp
  266. > main.c
  267. > .\main.c(5): fatal error C1189: #error: __STDC_VERSION__ must be >= 199901L
  268. > NMAKE : fatal error U1077: '"C:\Program Files (x86)\Microsoft Visual Studio\2017\Professional\VC\Tools\MSVC\14.16.27023\bin\HostX64\x64\cl.EXE"' : return code '0x2'
  269. > Stop.
  270. test config.qtbase.tests.c99 FAILED
  271. Global lib dirs: [C:\\Qt\\OpenSSL\\OpenSSL-1.1.1\\static\\x64\\Release\\lib] ["C:\\Program Files (x86)\\Microsoft Visual Studio\\2017\\Professional\\VC\\Tools\\MSVC\\14.16.27023\\ATLMFC\\lib\\x64" "C:\\Program Files (x86)\\Microsoft Visual Studio\\2017\\Professional\\VC\\Tools\\MSVC\\14.16.27023\\lib\\x64" "C:\\Program Files (x86)\\Windows Kits\\NETFXSDK\\4.6.1\\lib\\um\\x64" "C:\\Program Files (x86)\\Windows Kits\\10\\lib\\10.0.18362.0\\ucrt\\x64" "C:\\Program Files (x86)\\Windows Kits\\10\\lib\\10.0.18362.0\\um\\x64"]
  272. Global inc dirs: [C:\\Qt\\OpenSSL\\OpenSSL-1.1.1\\static\\x64\\Release\\include] ["C:\\Program Files (x86)\\Microsoft Visual Studio\\2017\\Professional\\VC\\Tools\\MSVC\\14.16.27023\\ATLMFC\\include" "C:\\Program Files (x86)\\Microsoft Visual Studio\\2017\\Professional\\VC\\Tools\\MSVC\\14.16.27023\\include" "C:\\Program Files (x86)\\Windows Kits\\NETFXSDK\\4.6.1\\include\\um" "C:\\Program Files (x86)\\Windows Kits\\10\\include\\10.0.18362.0\\ucrt" "C:\\Program Files (x86)\\Windows Kits\\10\\include\\10.0.18362.0\\shared" "C:\\Program Files (x86)\\Windows Kits\\10\\include\\10.0.18362.0\\um" "C:\\Program Files (x86)\\Windows Kits\\10\\include\\10.0.18362.0\\winrt" "C:\\Program Files (x86)\\Windows Kits\\10\\include\\10.0.18362.0\\cppwinrt"]
  273. looking for library dbus
  274. Trying source 0 (type pkgConfig) of library dbus ...
  275. pkg-config use disabled globally.
  276. => source produced no result.
  277. Trying source 1 (type inline) of library dbus ...
  278. dbus/dbus.h not found in [] and global paths.
  279. => source produced no result.
  280. Trying source 2 (type inline) of library dbus ...
  281. => source failed condition '!config.win32'.
  282. test config.qtbase.libraries.dbus FAILED
  283. executing config test f16c
  284. + cd /d C:\qt-everywhere-src-5.15.1\config.tests\x86_simd && C:\qt-everywhere-src-5.15.1\qtbase\bin\qmake.exe "CONFIG -= qt debug_and_release app_bundle lib_bundle" "CONFIG += static warn_off console single_arch" "QMAKE_LIBDIR += C:\\Qt\\OpenSSL\\OpenSSL-1.1.1\\static\\x64\\Release\\lib" "INCLUDEPATH += C:\\Qt\\OpenSSL\\OpenSSL-1.1.1\\static\\x64\\Release\\include" "CONFIG+=add_cflags" "DEFINES+=NO_ATTRIBUTE" "SIMD=f16c" C:/qt-everywhere-src-5.15.1/qtbase/config.tests/x86_simd
  285. + cd /d C:\qt-everywhere-src-5.15.1\config.tests\x86_simd && set MAKEFLAGS=& nmake clean && set MAKEFLAGS=& nmake
  286. > Microsoft (R) Program Maintenance Utility Version 14.16.27045.0
  287. > Copyright (C) Microsoft Corporation. All rights reserved.
  288. > del main.obj
  289. > Microsoft (R) Program Maintenance Utility Version 14.16.27045.0
  290. > Copyright (C) Microsoft Corporation. All rights reserved.
  291. > cl -c -nologo -Zc:wchar_t -FS -Zc:rvalueCast -Zc:inline -Zc:strictStrings -Zc:throwingNew -Zc:referenceBinding -Zc:__cplusplus -arch:AVX -O2 -MT -W0 -EHsc -DUNICODE -D_UNICODE -DWIN32 -D_ENABLE_EXTENDED_ALIGNED_STORAGE -DWIN64 -DNO_ATTRIBUTE -DQT_COMPILER_SUPPORTS_F16C -DNDEBUG -IC:\qt-everywhere-src-5.15.1\qtbase\config.tests\x86_simd -I. -IC:\Qt\OpenSSL\OpenSSL-1.1.1\static\x64\Release\include -IC:\qt-everywhere-src-5.15.1\qtbase\mkspecs\win32-msvc -Fo @C:\Users\MyUser\AppData\Local\Temp\nmE786.tmp
  292. > main.cpp
  293. > link /NOLOGO /DYNAMICBASE /NXCOMPAT /OPT:REF /INCREMENTAL:NO /SUBSYSTEM:CONSOLE "/MANIFESTDEPENDENCY:type='win32' name='Microsoft.Windows.Common-Controls' version='6.0.0.0' publicKeyToken='6595b64144ccf1df' language='*' processorArchitecture='*'" /MANIFEST:embed /OUT:x86_simd.exe @C:\Users\MyUser\AppData\Local\Temp\nmE7C6.tmp
  294. test config.qtbase.tests.f16c succeeded
  295. executing config test gc_binaries
  296. + cd /d C:\qt-everywhere-src-5.15.1\config.tests\gc_binaries && C:\qt-everywhere-src-5.15.1\qtbase\bin\qmake.exe "CONFIG -= qt debug_and_release app_bundle lib_bundle" "CONFIG += static warn_off console single_arch" "QMAKE_LIBDIR += C:\\Qt\\OpenSSL\\OpenSSL-1.1.1\\static\\x64\\Release\\lib" "INCLUDEPATH += C:\\Qt\\OpenSSL\\OpenSSL-1.1.1\\static\\x64\\Release\\include" C:/qt-everywhere-src-5.15.1/config.tests/gc_binaries
  297. > Project ERROR: Nope
  298. test config.qtbase.tests.gc_binaries FAILED
  299. looking for library host_dbus
  300. Trying source 0 (type pkgConfig) of library host_dbus ...
  301. pkg-config use disabled globally.
  302. => source produced no result.
  303. Trying source 1 (type inline) of library host_dbus ...
  304. => source accepted.
  305. test config.qtbase.libraries.host_dbus succeeded
  306. executing config test incredibuild_xge
  307. Searching for file BuildConsole.exe.
  308. Not found.
  309. test config.qtbase.tests.incredibuild_xge FAILED
  310. executing config test intelcet
  311. + cd /d C:\qt-everywhere-src-5.15.1\config.tests\intelcet && C:\qt-everywhere-src-5.15.1\qtbase\bin\qmake.exe "CONFIG -= qt debug_and_release app_bundle lib_bundle" "CONFIG += static warn_off console single_arch" "QMAKE_LIBDIR += C:\\Qt\\OpenSSL\\OpenSSL-1.1.1\\static\\x64\\Release\\lib" "INCLUDEPATH += C:\\Qt\\OpenSSL\\OpenSSL-1.1.1\\static\\x64\\Release\\include" C:/qt-everywhere-src-5.15.1/config.tests/intelcet
  312. + cd /d C:\qt-everywhere-src-5.15.1\config.tests\intelcet && set MAKEFLAGS=& nmake
  313. > Microsoft (R) Program Maintenance Utility Version 14.16.27045.0
  314. > Copyright (C) Microsoft Corporation. All rights reserved.
  315. > cl -c -nologo -Zc:wchar_t -FS -Zc:rvalueCast -Zc:inline -Zc:strictStrings -Zc:throwingNew -Zc:referenceBinding -Zc:__cplusplus -O2 -MT -W0 -EHsc -DUNICODE -D_UNICODE -DWIN32 -D_ENABLE_EXTENDED_ALIGNED_STORAGE -DWIN64 -DNDEBUG -I. -IC:\Qt\OpenSSL\OpenSSL-1.1.1\static\x64\Release\include -IC:\qt-everywhere-src-5.15.1\qtbase\mkspecs\win32-msvc -Fo @C:\Users\MyUser\AppData\Local\Temp\nmE861.tmp
  316. > main.cpp
  317. > .\main.cpp(7): fatal error C1189: #error: Intel CET not available
  318. > NMAKE : fatal error U1077: '"C:\Program Files (x86)\Microsoft Visual Studio\2017\Professional\VC\Tools\MSVC\14.16.27023\bin\HostX64\x64\cl.EXE"' : return code '0x2'
  319. > Stop.
  320. test config.qtbase.tests.intelcet FAILED
  321. looking for library libudev
  322. Trying source 0 (type pkgConfig) of library libudev ...
  323. pkg-config use disabled globally.
  324. => source produced no result.
  325. Trying source 1 (type inline) of library libudev ...
  326. libudev.h not found in [] and global paths.
  327. => source produced no result.
  328. test config.qtbase.libraries.libudev FAILED
  329. executing config test posix_fallocate
  330. + cd /d C:\qt-everywhere-src-5.15.1\config.tests\posix_fallocate && C:\qt-everywhere-src-5.15.1\qtbase\bin\qmake.exe "CONFIG -= qt debug_and_release app_bundle lib_bundle" "CONFIG += static warn_off console single_arch" "QMAKE_LIBDIR += C:\\Qt\\OpenSSL\\OpenSSL-1.1.1\\static\\x64\\Release\\lib" "INCLUDEPATH += C:\\Qt\\OpenSSL\\OpenSSL-1.1.1\\static\\x64\\Release\\include" C:/qt-everywhere-src-5.15.1/config.tests/posix_fallocate
  331. + cd /d C:\qt-everywhere-src-5.15.1\config.tests\posix_fallocate && set MAKEFLAGS=& nmake
  332. > Microsoft (R) Program Maintenance Utility Version 14.16.27045.0
  333. > Copyright (C) Microsoft Corporation. All rights reserved.
  334. > cl -c -nologo -Zc:wchar_t -FS -Zc:rvalueCast -Zc:inline -Zc:strictStrings -Zc:throwingNew -Zc:referenceBinding -Zc:__cplusplus -O2 -MT -W0 -EHsc -DUNICODE -D_UNICODE -DWIN32 -D_ENABLE_EXTENDED_ALIGNED_STORAGE -DWIN64 -DNDEBUG -I. -IC:\Qt\OpenSSL\OpenSSL-1.1.1\static\x64\Release\include -IC:\qt-everywhere-src-5.15.1\qtbase\mkspecs\win32-msvc -Fo @C:\Users\MyUser\AppData\Local\Temp\nmE8BF.tmp
  335. > main.cpp
  336. > .\main.cpp(3): fatal error C1083: Cannot open include file: 'unistd.h': No such file or directory
  337. > NMAKE : fatal error U1077: '"C:\Program Files (x86)\Microsoft Visual Studio\2017\Professional\VC\Tools\MSVC\14.16.27023\bin\HostX64\x64\cl.EXE"' : return code '0x2'
  338. > Stop.
  339. test config.qtbase.tests.posix_fallocate FAILED
  340. executing config test precompile_header
  341. + cd /d C:\qt-everywhere-src-5.15.1\config.tests\precompile_header && C:\qt-everywhere-src-5.15.1\qtbase\bin\qmake.exe "CONFIG -= qt debug_and_release app_bundle lib_bundle" "CONFIG += static warn_off console single_arch" "QMAKE_LIBDIR += C:\\Qt\\OpenSSL\\OpenSSL-1.1.1\\static\\x64\\Release\\lib" "INCLUDEPATH += C:\\Qt\\OpenSSL\\OpenSSL-1.1.1\\static\\x64\\Release\\include" C:/qt-everywhere-src-5.15.1/config.tests/precompile_header
  342. + cd /d C:\qt-everywhere-src-5.15.1\config.tests\precompile_header && set MAKEFLAGS=& nmake
  343. > Microsoft (R) Program Maintenance Utility Version 14.16.27045.0
  344. > Copyright (C) Microsoft Corporation. All rights reserved.
  345. > cl -c -Yc -Fp.pch\precompile_header_pch.pch -Fo.pch\precompile_header_pch.obj -nologo -Zc:wchar_t -FS -Zc:rvalueCast -Zc:inline -Zc:strictStrings -Zc:throwingNew -Zc:referenceBinding -Zc:__cplusplus -O2 -MT -W0 -EHsc -DUNICODE -D_UNICODE -DWIN32 -D_ENABLE_EXTENDED_ALIGNED_STORAGE -DWIN64 -DNDEBUG -I. -IC:\Qt\OpenSSL\OpenSSL-1.1.1\static\x64\Release\include -IC:\qt-everywhere-src-5.15.1\qtbase\mkspecs\win32-msvc -TP header.h
  346. > header.h
  347. > cl -c -FIheader.h -Yuheader.h -Fp.pch\precompile_header_pch.pch -nologo -Zc:wchar_t -FS -Zc:rvalueCast -Zc:inline -Zc:strictStrings -Zc:throwingNew -Zc:referenceBinding -Zc:__cplusplus -O2 -MT -W0 -EHsc -DUNICODE -D_UNICODE -DWIN32 -D_ENABLE_EXTENDED_ALIGNED_STORAGE -DWIN64 -DNDEBUG -I. -IC:\Qt\OpenSSL\OpenSSL-1.1.1\static\x64\Release\include -IC:\qt-everywhere-src-5.15.1\qtbase\mkspecs\win32-msvc -Fo @C:\Users\MyUser\AppData\Local\Temp\nmE94B.tmp
  348. > main.cpp
  349. > link /NOLOGO /DYNAMICBASE /NXCOMPAT /OPT:REF /INCREMENTAL:NO /SUBSYSTEM:CONSOLE "/MANIFESTDEPENDENCY:type='win32' name='Microsoft.Windows.Common-Controls' version='6.0.0.0' publicKeyToken='6595b64144ccf1df' language='*' processorArchitecture='*'" /MANIFEST:embed /OUT:precompile_header.exe @C:\Users\MyUser\AppData\Local\Temp\nmE95C.tmp
  350. test config.qtbase.tests.precompile_header succeeded
  351. executing config test rdrnd
  352. + cd /d C:\qt-everywhere-src-5.15.1\config.tests\x86_simd && C:\qt-everywhere-src-5.15.1\qtbase\bin\qmake.exe "CONFIG -= qt debug_and_release app_bundle lib_bundle" "CONFIG += static warn_off console single_arch" "QMAKE_LIBDIR += C:\\Qt\\OpenSSL\\OpenSSL-1.1.1\\static\\x64\\Release\\lib" "INCLUDEPATH += C:\\Qt\\OpenSSL\\OpenSSL-1.1.1\\static\\x64\\Release\\include" "CONFIG+=add_cflags" "DEFINES+=NO_ATTRIBUTE" "SIMD=rdrnd" C:/qt-everywhere-src-5.15.1/qtbase/config.tests/x86_simd
  353. + cd /d C:\qt-everywhere-src-5.15.1\config.tests\x86_simd && set MAKEFLAGS=& nmake clean && set MAKEFLAGS=& nmake
  354. > Microsoft (R) Program Maintenance Utility Version 14.16.27045.0
  355. > Copyright (C) Microsoft Corporation. All rights reserved.
  356. > del main.obj
  357. > Microsoft (R) Program Maintenance Utility Version 14.16.27045.0
  358. > Copyright (C) Microsoft Corporation. All rights reserved.
  359. > cl -c -nologo -Zc:wchar_t -FS -Zc:rvalueCast -Zc:inline -Zc:strictStrings -Zc:throwingNew -Zc:referenceBinding -Zc:__cplusplus -O2 -MT -W0 -EHsc -DUNICODE -D_UNICODE -DWIN32 -D_ENABLE_EXTENDED_ALIGNED_STORAGE -DWIN64 -DNO_ATTRIBUTE -DQT_COMPILER_SUPPORTS_RDRND -DNDEBUG -IC:\qt-everywhere-src-5.15.1\qtbase\config.tests\x86_simd -I. -IC:\Qt\OpenSSL\OpenSSL-1.1.1\static\x64\Release\include -IC:\qt-everywhere-src-5.15.1\qtbase\mkspecs\win32-msvc -Fo @C:\Users\MyUser\AppData\Local\Temp\nmE9F7.tmp
  360. > main.cpp
  361. > link /NOLOGO /DYNAMICBASE /NXCOMPAT /OPT:REF /INCREMENTAL:NO /SUBSYSTEM:CONSOLE "/MANIFESTDEPENDENCY:type='win32' name='Microsoft.Windows.Common-Controls' version='6.0.0.0' publicKeyToken='6595b64144ccf1df' language='*' processorArchitecture='*'" /MANIFEST:embed /OUT:x86_simd.exe @C:\Users\MyUser\AppData\Local\Temp\nmEA37.tmp
  362. test config.qtbase.tests.rdrnd succeeded
  363. executing config test rdseed
  364. + cd /d C:\qt-everywhere-src-5.15.1\config.tests\x86_simd && C:\qt-everywhere-src-5.15.1\qtbase\bin\qmake.exe "CONFIG -= qt debug_and_release app_bundle lib_bundle" "CONFIG += static warn_off console single_arch" "QMAKE_LIBDIR += C:\\Qt\\OpenSSL\\OpenSSL-1.1.1\\static\\x64\\Release\\lib" "INCLUDEPATH += C:\\Qt\\OpenSSL\\OpenSSL-1.1.1\\static\\x64\\Release\\include" "CONFIG+=add_cflags" "DEFINES+=NO_ATTRIBUTE" "SIMD=rdseed" C:/qt-everywhere-src-5.15.1/qtbase/config.tests/x86_simd
  365. + cd /d C:\qt-everywhere-src-5.15.1\config.tests\x86_simd && set MAKEFLAGS=& nmake clean && set MAKEFLAGS=& nmake
  366. > Microsoft (R) Program Maintenance Utility Version 14.16.27045.0
  367. > Copyright (C) Microsoft Corporation. All rights reserved.
  368. > del main.obj
  369. > Microsoft (R) Program Maintenance Utility Version 14.16.27045.0
  370. > Copyright (C) Microsoft Corporation. All rights reserved.
  371. > cl -c -nologo -Zc:wchar_t -FS -Zc:rvalueCast -Zc:inline -Zc:strictStrings -Zc:throwingNew -Zc:referenceBinding -Zc:__cplusplus -O2 -MT -W0 -EHsc -DUNICODE -D_UNICODE -DWIN32 -D_ENABLE_EXTENDED_ALIGNED_STORAGE -DWIN64 -DNO_ATTRIBUTE -DQT_COMPILER_SUPPORTS_RDSEED -DNDEBUG -IC:\qt-everywhere-src-5.15.1\qtbase\config.tests\x86_simd -I. -IC:\Qt\OpenSSL\OpenSSL-1.1.1\static\x64\Release\include -IC:\qt-everywhere-src-5.15.1\qtbase\mkspecs\win32-msvc -Fo @C:\Users\MyUser\AppData\Local\Temp\nmEAC2.tmp
  372. > main.cpp
  373. > link /NOLOGO /DYNAMICBASE /NXCOMPAT /OPT:REF /INCREMENTAL:NO /SUBSYSTEM:CONSOLE "/MANIFESTDEPENDENCY:type='win32' name='Microsoft.Windows.Common-Controls' version='6.0.0.0' publicKeyToken='6595b64144ccf1df' language='*' processorArchitecture='*'" /MANIFEST:embed /OUT:x86_simd.exe @C:\Users\MyUser\AppData\Local\Temp\nmEB02.tmp
  374. test config.qtbase.tests.rdseed succeeded
  375. executing config test shani
  376. + cd /d C:\qt-everywhere-src-5.15.1\config.tests\x86_simd && C:\qt-everywhere-src-5.15.1\qtbase\bin\qmake.exe "CONFIG -= qt debug_and_release app_bundle lib_bundle" "CONFIG += static warn_off console single_arch" "QMAKE_LIBDIR += C:\\Qt\\OpenSSL\\OpenSSL-1.1.1\\static\\x64\\Release\\lib" "INCLUDEPATH += C:\\Qt\\OpenSSL\\OpenSSL-1.1.1\\static\\x64\\Release\\include" "CONFIG+=add_cflags" "DEFINES+=NO_ATTRIBUTE" "SIMD=shani" C:/qt-everywhere-src-5.15.1/qtbase/config.tests/x86_simd
  377. + cd /d C:\qt-everywhere-src-5.15.1\config.tests\x86_simd && set MAKEFLAGS=& nmake clean && set MAKEFLAGS=& nmake
  378. > Microsoft (R) Program Maintenance Utility Version 14.16.27045.0
  379. > Copyright (C) Microsoft Corporation. All rights reserved.
  380. > del main.obj
  381. > Microsoft (R) Program Maintenance Utility Version 14.16.27045.0
  382. > Copyright (C) Microsoft Corporation. All rights reserved.
  383. > cl -c -nologo -Zc:wchar_t -FS -Zc:rvalueCast -Zc:inline -Zc:strictStrings -Zc:throwingNew -Zc:referenceBinding -Zc:__cplusplus -O2 -MT -W0 -EHsc -DUNICODE -D_UNICODE -DWIN32 -D_ENABLE_EXTENDED_ALIGNED_STORAGE -DWIN64 -DNO_ATTRIBUTE -DQT_COMPILER_SUPPORTS_SHANI -DNDEBUG -IC:\qt-everywhere-src-5.15.1\qtbase\config.tests\x86_simd -I. -IC:\Qt\OpenSSL\OpenSSL-1.1.1\static\x64\Release\include -IC:\qt-everywhere-src-5.15.1\qtbase\mkspecs\win32-msvc -Fo @C:\Users\MyUser\AppData\Local\Temp\nmEBBC.tmp
  384. > main.cpp
  385. > link /NOLOGO /DYNAMICBASE /NXCOMPAT /OPT:REF /INCREMENTAL:NO /SUBSYSTEM:CONSOLE "/MANIFESTDEPENDENCY:type='win32' name='Microsoft.Windows.Common-Controls' version='6.0.0.0' publicKeyToken='6595b64144ccf1df' language='*' processorArchitecture='*'" /MANIFEST:embed /OUT:x86_simd.exe @C:\Users\MyUser\AppData\Local\Temp\nmEBFC.tmp
  386. test config.qtbase.tests.shani succeeded
  387. executing config test signaling_nan
  388. + cd /d C:\qt-everywhere-src-5.15.1\config.tests\signaling_nan && C:\qt-everywhere-src-5.15.1\qtbase\bin\qmake.exe "CONFIG -= qt debug_and_release app_bundle lib_bundle" "CONFIG += static warn_off console single_arch" "QMAKE_LIBDIR += C:\\Qt\\OpenSSL\\OpenSSL-1.1.1\\static\\x64\\Release\\lib" "INCLUDEPATH += C:\\Qt\\OpenSSL\\OpenSSL-1.1.1\\static\\x64\\Release\\include" C:/qt-everywhere-src-5.15.1/config.tests/signaling_nan
  389. + cd /d C:\qt-everywhere-src-5.15.1\config.tests\signaling_nan && set MAKEFLAGS=& nmake
  390. > Microsoft (R) Program Maintenance Utility Version 14.16.27045.0
  391. > Copyright (C) Microsoft Corporation. All rights reserved.
  392. > cl -c -nologo -Zc:wchar_t -FS -Zc:rvalueCast -Zc:inline -Zc:strictStrings -Zc:throwingNew -Zc:referenceBinding -Zc:__cplusplus -O2 -MT -W0 -EHsc -DUNICODE -D_UNICODE -DWIN32 -D_ENABLE_EXTENDED_ALIGNED_STORAGE -DWIN64 -DNDEBUG -I. -IC:\Qt\OpenSSL\OpenSSL-1.1.1\static\x64\Release\include -IC:\qt-everywhere-src-5.15.1\qtbase\mkspecs\win32-msvc -Fo @C:\Users\MyUser\AppData\Local\Temp\nmEC78.tmp
  393. > main.cpp
  394. > link /NOLOGO /DYNAMICBASE /NXCOMPAT /OPT:REF /INCREMENTAL:NO /SUBSYSTEM:CONSOLE "/MANIFESTDEPENDENCY:type='win32' name='Microsoft.Windows.Common-Controls' version='6.0.0.0' publicKeyToken='6595b64144ccf1df' language='*' processorArchitecture='*'" /MANIFEST:embed /OUT:signaling_nan.exe @C:\Users\MyUser\AppData\Local\Temp\nmECC7.tmp
  395. test config.qtbase.tests.signaling_nan succeeded
  396. executing config test stl
  397. + cd /d C:\qt-everywhere-src-5.15.1\config.tests\stl && C:\qt-everywhere-src-5.15.1\qtbase\bin\qmake.exe "CONFIG -= qt debug_and_release app_bundle lib_bundle" "CONFIG += static warn_off console single_arch" "QMAKE_LIBDIR += C:\\Qt\\OpenSSL\\OpenSSL-1.1.1\\static\\x64\\Release\\lib" "INCLUDEPATH += C:\\Qt\\OpenSSL\\OpenSSL-1.1.1\\static\\x64\\Release\\include" C:/qt-everywhere-src-5.15.1/qtbase/config.tests/stl
  398. + cd /d C:\qt-everywhere-src-5.15.1\config.tests\stl && set MAKEFLAGS=& nmake
  399. > Microsoft (R) Program Maintenance Utility Version 14.16.27045.0
  400. > Copyright (C) Microsoft Corporation. All rights reserved.
  401. > cl -c -nologo -Zc:wchar_t -FS -Zc:rvalueCast -Zc:inline -Zc:strictStrings -Zc:throwingNew -Zc:referenceBinding -Zc:__cplusplus -O2 -MT -W0 -EHsc -DUNICODE -D_UNICODE -DWIN32 -D_ENABLE_EXTENDED_ALIGNED_STORAGE -DWIN64 -DNDEBUG -IC:\qt-everywhere-src-5.15.1\qtbase\config.tests\stl -I. -IC:\Qt\OpenSSL\OpenSSL-1.1.1\static\x64\Release\include -IC:\qt-everywhere-src-5.15.1\qtbase\mkspecs\win32-msvc -Fo @C:\Users\MyUser\AppData\Local\Temp\nmED43.tmp
  402. > stltest.cpp
  403. > link /NOLOGO /DYNAMICBASE /NXCOMPAT /OPT:REF /INCREMENTAL:NO /SUBSYSTEM:CONSOLE "/MANIFESTDEPENDENCY:type='win32' name='Microsoft.Windows.Common-Controls' version='6.0.0.0' publicKeyToken='6595b64144ccf1df' language='*' processorArchitecture='*'" /MANIFEST:embed /OUT:stl.exe @C:\Users\MyUser\AppData\Local\Temp\nmEE9C.tmp
  404. test config.qtbase.tests.stl succeeded
  405. looking for library zlib
  406. Trying source 0 (type inline) of library zlib ...
  407. zlib.h not found in [] and global paths.
  408. => source produced no result.
  409. Trying source 1 (type inline) of library zlib ...
  410. zlib.h not found in [] and global paths.
  411. => source produced no result.
  412. Trying source 2 (type inline) of library zlib ...
  413. => source failed condition '!config.msvc'.
  414. Trying source 3 (type inline) of library zlib ...
  415. => source failed condition 'config.wasm'.
  416. test config.qtbase.libraries.zlib FAILED
  417. executing config test x86SimdAlways
  418. + cd /d C:\qt-everywhere-src-5.15.1\config.tests\x86_simd && C:\qt-everywhere-src-5.15.1\qtbase\bin\qmake.exe "CONFIG -= qt debug_and_release app_bundle lib_bundle" "CONFIG += static warn_off console single_arch" "QMAKE_LIBDIR += C:\\Qt\\OpenSSL\\OpenSSL-1.1.1\\static\\x64\\Release\\lib" "INCLUDEPATH += C:\\Qt\\OpenSSL\\OpenSSL-1.1.1\\static\\x64\\Release\\include" "SIMD=aesni avx avx2 avx512bw avx512cd avx512dq avx512er avx512f avx512ifma avx512pf avx512vbmi avx512vl f16c rdrnd rdseed shani sse2 sse3 sse4_1 sse4_2 ssse3" C:/qt-everywhere-src-5.15.1/qtbase/config.tests/x86_simd
  419. + cd /d C:\qt-everywhere-src-5.15.1\config.tests\x86_simd && set MAKEFLAGS=& nmake clean && set MAKEFLAGS=& nmake
  420. > Microsoft (R) Program Maintenance Utility Version 14.16.27045.0
  421. > Copyright (C) Microsoft Corporation. All rights reserved.
  422. > del main.obj
  423. > Microsoft (R) Program Maintenance Utility Version 14.16.27045.0
  424. > Copyright (C) Microsoft Corporation. All rights reserved.
  425. > cl -c -nologo -Zc:wchar_t -FS -Zc:rvalueCast -Zc:inline -Zc:strictStrings -Zc:throwingNew -Zc:referenceBinding -Zc:__cplusplus -O2 -MT -W0 -EHsc -DUNICODE -D_UNICODE -DWIN32 -D_ENABLE_EXTENDED_ALIGNED_STORAGE -DWIN64 -DQT_COMPILER_SUPPORTS_AESNI -DQT_COMPILER_SUPPORTS_AVX -DQT_COMPILER_SUPPORTS_AVX2 -DQT_COMPILER_SUPPORTS_AVX512BW -DQT_COMPILER_SUPPORTS_AVX512CD -DQT_COMPILER_SUPPORTS_AVX512DQ -DQT_COMPILER_SUPPORTS_AVX512ER -DQT_COMPILER_SUPPORTS_AVX512F -DQT_COMPILER_SUPPORTS_AVX512IFMA -DQT_COMPILER_SUPPORTS_AVX512PF -DQT_COMPILER_SUPPORTS_AVX512VBMI -DQT_COMPILER_SUPPORTS_AVX512VL -DQT_COMPILER_SUPPORTS_F16C -DQT_COMPILER_SUPPORTS_RDRND -DQT_COMPILER_SUPPORTS_RDSEED -DQT_COMPILER_SUPPORTS_SHANI -DQT_COMPILER_SUPPORTS_SSE2 -DQT_COMPILER_SUPPORTS_SSE3 -DQT_COMPILER_SUPPORTS_SSE4_1 -DQT_COMPILER_SUPPORTS_SSE4_2 -DQT_COMPILER_SUPPORTS_SSSE3 -DNDEBUG -IC:\qt-everywhere-src-5.15.1\qtbase\config.tests\x86_simd -I. -IC:\Qt\OpenSSL\OpenSSL-1.1.1\static\x64\Release\include -IC:\qt-everywhere-src-5.15.1\qtbase\mkspecs\win32-msvc -Fo @C:\Users\MyUser\AppData\Local\Temp\nmEF37.tmp
  426. > main.cpp
  427. > link /NOLOGO /DYNAMICBASE /NXCOMPAT /OPT:REF /INCREMENTAL:NO /SUBSYSTEM:CONSOLE "/MANIFESTDEPENDENCY:type='win32' name='Microsoft.Windows.Common-Controls' version='6.0.0.0' publicKeyToken='6595b64144ccf1df' language='*' processorArchitecture='*'" /MANIFEST:embed /OUT:x86_simd.exe @C:\Users\MyUser\AppData\Local\Temp\nmEF77.tmp
  428. test config.qtbase.tests.x86SimdAlways succeeded
  429. looking for library zstd
  430. Trying source 0 (type pkgConfig) of library zstd ...
  431. pkg-config use disabled globally.
  432. => source produced no result.
  433. Trying source 1 (type inline) of library zstd ...
  434. + cd /d C:\qt-everywhere-src-5.15.1\config.tests\zstd && C:\qt-everywhere-src-5.15.1\qtbase\bin\qmake.exe "CONFIG -= qt debug_and_release app_bundle lib_bundle" "CONFIG += static warn_off console single_arch" "QMAKE_LIBDIR += C:\\Qt\\OpenSSL\\OpenSSL-1.1.1\\static\\x64\\Release\\lib" "INCLUDEPATH += C:\\Qt\\OpenSSL\\OpenSSL-1.1.1\\static\\x64\\Release\\include" "QMAKE_USE += zstd" "QMAKE_LIBS_ZSTD = -lzstd" C:/qt-everywhere-src-5.15.1/config.tests/zstd
  435. + cd /d C:\qt-everywhere-src-5.15.1\config.tests\zstd && set MAKEFLAGS=& nmake
  436. > Microsoft (R) Program Maintenance Utility Version 14.16.27045.0
  437. > Copyright (C) Microsoft Corporation. All rights reserved.
  438. > cl -c -nologo -Zc:wchar_t -FS -Zc:rvalueCast -Zc:inline -Zc:strictStrings -Zc:throwingNew -Zc:referenceBinding -Zc:__cplusplus -O2 -MT -W0 -EHsc -DUNICODE -D_UNICODE -DWIN32 -D_ENABLE_EXTENDED_ALIGNED_STORAGE -DWIN64 -DNDEBUG -I. -IC:\Qt\OpenSSL\OpenSSL-1.1.1\static\x64\Release\include -IC:\qt-everywhere-src-5.15.1\qtbase\mkspecs\win32-msvc -Fo @C:\Users\MyUser\AppData\Local\Temp\nmEFF3.tmp
  439. > main.cpp
  440. > .\main.cpp(2): fatal error C1083: Cannot open include file: 'zstd.h': No such file or directory
  441. > NMAKE : fatal error U1077: '"C:\Program Files (x86)\Microsoft Visual Studio\2017\Professional\VC\Tools\MSVC\14.16.27023\bin\HostX64\x64\cl.EXE"' : return code '0x2'
  442. > Stop.
  443. => source failed verification.
  444. test config.qtbase.libraries.zstd FAILED
  445. executing config test cxx11_future
  446. + cd /d C:\qt-everywhere-src-5.15.1\config.tests\cxx11_future && C:\qt-everywhere-src-5.15.1\qtbase\bin\qmake.exe "CONFIG -= qt debug_and_release app_bundle lib_bundle" "CONFIG += static warn_off console single_arch" "QMAKE_LIBDIR += C:\\Qt\\OpenSSL\\OpenSSL-1.1.1\\static\\x64\\Release\\lib" "INCLUDEPATH += C:\\Qt\\OpenSSL\\OpenSSL-1.1.1\\static\\x64\\Release\\include" C:/qt-everywhere-src-5.15.1/config.tests/cxx11_future
  447. + cd /d C:\qt-everywhere-src-5.15.1\config.tests\cxx11_future && set MAKEFLAGS=& nmake
  448. > Microsoft (R) Program Maintenance Utility Version 14.16.27045.0
  449. > Copyright (C) Microsoft Corporation. All rights reserved.
  450. > cl -c -nologo -Zc:wchar_t -FS -Zc:rvalueCast -Zc:inline -Zc:strictStrings -Zc:throwingNew -Zc:referenceBinding -Zc:__cplusplus -O2 -MT -W0 -EHsc -DUNICODE -D_UNICODE -DWIN32 -D_ENABLE_EXTENDED_ALIGNED_STORAGE -DWIN64 -DNDEBUG -I. -IC:\Qt\OpenSSL\OpenSSL-1.1.1\static\x64\Release\include -IC:\qt-everywhere-src-5.15.1\qtbase\mkspecs\win32-msvc -Fo @C:\Users\MyUser\AppData\Local\Temp\nmF070.tmp
  451. > main.cpp
  452. > link /NOLOGO /DYNAMICBASE /NXCOMPAT /OPT:REF /INCREMENTAL:NO /SUBSYSTEM:CONSOLE "/MANIFESTDEPENDENCY:type='win32' name='Microsoft.Windows.Common-Controls' version='6.0.0.0' publicKeyToken='6595b64144ccf1df' language='*' processorArchitecture='*'" /MANIFEST:embed /OUT:cxx11_future.exe @C:\Users\MyUser\AppData\Local\Temp\nmF2E2.tmp
  453. test config.qtbase_corelib.tests.cxx11_future succeeded
  454. executing config test eventfd
  455. + cd /d C:\qt-everywhere-src-5.15.1\config.tests\eventfd && C:\qt-everywhere-src-5.15.1\qtbase\bin\qmake.exe "CONFIG -= qt debug_and_release app_bundle lib_bundle" "CONFIG += static warn_off console single_arch" "QMAKE_LIBDIR += C:\\Qt\\OpenSSL\\OpenSSL-1.1.1\\static\\x64\\Release\\lib" "INCLUDEPATH += C:\\Qt\\OpenSSL\\OpenSSL-1.1.1\\static\\x64\\Release\\include" C:/qt-everywhere-src-5.15.1/config.tests/eventfd
  456. + cd /d C:\qt-everywhere-src-5.15.1\config.tests\eventfd && set MAKEFLAGS=& nmake
  457. > Microsoft (R) Program Maintenance Utility Version 14.16.27045.0
  458. > Copyright (C) Microsoft Corporation. All rights reserved.
  459. > cl -c -nologo -Zc:wchar_t -FS -Zc:rvalueCast -Zc:inline -Zc:strictStrings -Zc:throwingNew -Zc:referenceBinding -Zc:__cplusplus -O2 -MT -W0 -EHsc -DUNICODE -D_UNICODE -DWIN32 -D_ENABLE_EXTENDED_ALIGNED_STORAGE -DWIN64 -DNDEBUG -I. -IC:\Qt\OpenSSL\OpenSSL-1.1.1\static\x64\Release\include -IC:\qt-everywhere-src-5.15.1\qtbase\mkspecs\win32-msvc -Fo @C:\Users\MyUser\AppData\Local\Temp\nmF39C.tmp
  460. > main.cpp
  461. > .\main.cpp(2): fatal error C1083: Cannot open include file: 'sys/eventfd.h': No such file or directory
  462. > NMAKE : fatal error U1077: '"C:\Program Files (x86)\Microsoft Visual Studio\2017\Professional\VC\Tools\MSVC\14.16.27023\bin\HostX64\x64\cl.EXE"' : return code '0x2'
  463. > Stop.
  464. test config.qtbase_corelib.tests.eventfd FAILED
  465. executing config test inotify
  466. + cd /d C:\qt-everywhere-src-5.15.1\config.tests\inotify && C:\qt-everywhere-src-5.15.1\qtbase\bin\qmake.exe "CONFIG -= qt debug_and_release app_bundle lib_bundle" "CONFIG += static warn_off console single_arch" "QMAKE_LIBDIR += C:\\Qt\\OpenSSL\\OpenSSL-1.1.1\\static\\x64\\Release\\lib" "INCLUDEPATH += C:\\Qt\\OpenSSL\\OpenSSL-1.1.1\\static\\x64\\Release\\include" C:/qt-everywhere-src-5.15.1/config.tests/inotify
  467. + cd /d C:\qt-everywhere-src-5.15.1\config.tests\inotify && set MAKEFLAGS=& nmake
  468. > Microsoft (R) Program Maintenance Utility Version 14.16.27045.0
  469. > Copyright (C) Microsoft Corporation. All rights reserved.
  470. > cl -c -nologo -Zc:wchar_t -FS -Zc:rvalueCast -Zc:inline -Zc:strictStrings -Zc:throwingNew -Zc:referenceBinding -Zc:__cplusplus -O2 -MT -W0 -EHsc -DUNICODE -D_UNICODE -DWIN32 -D_ENABLE_EXTENDED_ALIGNED_STORAGE -DWIN64 -DNDEBUG -I. -IC:\Qt\OpenSSL\OpenSSL-1.1.1\static\x64\Release\include -IC:\qt-everywhere-src-5.15.1\qtbase\mkspecs\win32-msvc -Fo @C:\Users\MyUser\AppData\Local\Temp\nmF409.tmp
  471. > main.cpp
  472. > .\main.cpp(2): fatal error C1083: Cannot open include file: 'sys/inotify.h': No such file or directory
  473. > NMAKE : fatal error U1077: '"C:\Program Files (x86)\Microsoft Visual Studio\2017\Professional\VC\Tools\MSVC\14.16.27023\bin\HostX64\x64\cl.EXE"' : return code '0x2'
  474. > Stop.
  475. test config.qtbase_corelib.tests.inotify FAILED
  476. looking for library pcre2
  477. Trying source 0 (type pkgConfig) of library pcre2 ...
  478. pkg-config use disabled globally.
  479. => source produced no result.
  480. Trying source 1 (type inline) of library pcre2 ...
  481. pcre2.h not found in [] and global paths.
  482. => source produced no result.
  483. test config.qtbase_corelib.libraries.pcre2 FAILED
  484. looking for library slog2
  485. Trying source 0 (type inline) of library slog2 ...
  486. sys/slog2.h not found in [] and global paths.
  487. => source produced no result.
  488. test config.qtbase_corelib.libraries.slog2 FAILED
  489. looking for library libatomic
  490. Trying source 0 (type inline) of library libatomic ...
  491. + cd /d C:\qt-everywhere-src-5.15.1\config.tests\libatomic && C:\qt-everywhere-src-5.15.1\qtbase\bin\qmake.exe "CONFIG -= qt debug_and_release app_bundle lib_bundle" "CONFIG += static warn_off console single_arch" "QMAKE_LIBDIR += C:\\Qt\\OpenSSL\\OpenSSL-1.1.1\\static\\x64\\Release\\lib" "INCLUDEPATH += C:\\Qt\\OpenSSL\\OpenSSL-1.1.1\\static\\x64\\Release\\include" "QMAKE_USE += libatomic" "QMAKE_LIBS_LIBATOMIC = " C:/qt-everywhere-src-5.15.1/config.tests/libatomic
  492. + cd /d C:\qt-everywhere-src-5.15.1\config.tests\libatomic && set MAKEFLAGS=& nmake
  493. > Microsoft (R) Program Maintenance Utility Version 14.16.27045.0
  494. > Copyright (C) Microsoft Corporation. All rights reserved.
  495. > cl -c -nologo -Zc:wchar_t -FS -Zc:rvalueCast -Zc:inline -Zc:strictStrings -Zc:throwingNew -Zc:referenceBinding -Zc:__cplusplus -O2 -MT -W0 -EHsc -DUNICODE -D_UNICODE -DWIN32 -D_ENABLE_EXTENDED_ALIGNED_STORAGE -DWIN64 -DNDEBUG -I. -IC:\Qt\OpenSSL\OpenSSL-1.1.1\static\x64\Release\include -IC:\qt-everywhere-src-5.15.1\qtbase\mkspecs\win32-msvc -Fo @C:\Users\MyUser\AppData\Local\Temp\nmF467.tmp
  496. > main.cpp
  497. > link /NOLOGO /DYNAMICBASE /NXCOMPAT /OPT:REF /INCREMENTAL:NO /SUBSYSTEM:CONSOLE "/MANIFESTDEPENDENCY:type='win32' name='Microsoft.Windows.Common-Controls' version='6.0.0.0' publicKeyToken='6595b64144ccf1df' language='*' processorArchitecture='*'" /MANIFEST:embed /OUT:libatomic.exe @C:\Users\MyUser\AppData\Local\Temp\nmF543.tmp
  498. => source accepted.
  499. test config.qtbase_corelib.libraries.libatomic succeeded
  500. looking for library doubleconversion
  501. Trying source 0 (type inline) of library doubleconversion ...
  502. double-conversion/double-conversion.h not found in [] and global paths.
  503. => source produced no result.
  504. test config.qtbase_corelib.libraries.doubleconversion FAILED
  505. executing config test cloexec
  506. + cd /d C:\qt-everywhere-src-5.15.1\config.tests\cloexec && C:\qt-everywhere-src-5.15.1\qtbase\bin\qmake.exe "CONFIG -= qt debug_and_release app_bundle lib_bundle" "CONFIG += static warn_off console single_arch" "QMAKE_LIBDIR += C:\\Qt\\OpenSSL\\OpenSSL-1.1.1\\static\\x64\\Release\\lib" "INCLUDEPATH += C:\\Qt\\OpenSSL\\OpenSSL-1.1.1\\static\\x64\\Release\\include" C:/qt-everywhere-src-5.15.1/config.tests/cloexec
  507. + cd /d C:\qt-everywhere-src-5.15.1\config.tests\cloexec && set MAKEFLAGS=& nmake
  508. > Microsoft (R) Program Maintenance Utility Version 14.16.27045.0
  509. > Copyright (C) Microsoft Corporation. All rights reserved.
  510. > cl -c -nologo -Zc:wchar_t -FS -Zc:rvalueCast -Zc:inline -Zc:strictStrings -Zc:throwingNew -Zc:referenceBinding -Zc:__cplusplus -O2 -MT -W0 -EHsc -DUNICODE -D_UNICODE -DWIN32 -D_ENABLE_EXTENDED_ALIGNED_STORAGE -DWIN64 -DNDEBUG -I. -IC:\Qt\OpenSSL\OpenSSL-1.1.1\static\x64\Release\include -IC:\qt-everywhere-src-5.15.1\qtbase\mkspecs\win32-msvc -Fo @C:\Users\MyUser\AppData\Local\Temp\nmF5CF.tmp
  511. > main.cpp
  512. > .\main.cpp(4): fatal error C1083: Cannot open include file: 'sys/socket.h': No such file or directory
  513. > NMAKE : fatal error U1077: '"C:\Program Files (x86)\Microsoft Visual Studio\2017\Professional\VC\Tools\MSVC\14.16.27023\bin\HostX64\x64\cl.EXE"' : return code '0x2'
  514. > Stop.
  515. test config.qtbase_corelib.tests.cloexec FAILED
  516. looking for library advapi32
  517. Trying source 0 (type inline) of library advapi32 ...
  518. => source accepted.
  519. test config.qtbase_corelib.libraries.advapi32 succeeded
  520. looking for library gdi32
  521. Trying source 0 (type inline) of library gdi32 ...
  522. => source accepted.
  523. test config.qtbase_corelib.libraries.gdi32 succeeded
  524. looking for library kernel32
  525. Trying source 0 (type inline) of library kernel32 ...
  526. => source accepted.
  527. test config.qtbase_corelib.libraries.kernel32 succeeded
  528. looking for library netapi32
  529. Trying source 0 (type inline) of library netapi32 ...
  530. => source accepted.
  531. test config.qtbase_corelib.libraries.netapi32 succeeded
  532. looking for library ole32
  533. Trying source 0 (type inline) of library ole32 ...
  534. => source accepted.
  535. test config.qtbase_corelib.libraries.ole32 succeeded
  536. looking for library shell32
  537. Trying source 0 (type inline) of library shell32 ...
  538. => source accepted.
  539. test config.qtbase_corelib.libraries.shell32 succeeded
  540. looking for library uuid
  541. Trying source 0 (type inline) of library uuid ...
  542. => source accepted.
  543. test config.qtbase_corelib.libraries.uuid succeeded
  544. looking for library user32
  545. Trying source 0 (type inline) of library user32 ...
  546. => source accepted.
  547. test config.qtbase_corelib.libraries.user32 succeeded
  548. looking for library winmm
  549. Trying source 0 (type inline) of library winmm ...
  550. => source accepted.
  551. test config.qtbase_corelib.libraries.winmm succeeded
  552. looking for library ws2_32
  553. Trying source 0 (type inline) of library ws2_32 ...
  554. => source accepted.
  555. test config.qtbase_corelib.libraries.ws2_32 succeeded
  556. executing config test cxx11_random
  557. + cd /d C:\qt-everywhere-src-5.15.1\config.tests\cxx11_random && C:\qt-everywhere-src-5.15.1\qtbase\bin\qmake.exe "CONFIG -= qt debug_and_release app_bundle lib_bundle" "CONFIG += static warn_off console single_arch" "QMAKE_LIBDIR += C:\\Qt\\OpenSSL\\OpenSSL-1.1.1\\static\\x64\\Release\\lib" "INCLUDEPATH += C:\\Qt\\OpenSSL\\OpenSSL-1.1.1\\static\\x64\\Release\\include" C:/qt-everywhere-src-5.15.1/config.tests/cxx11_random
  558. + cd /d C:\qt-everywhere-src-5.15.1\config.tests\cxx11_random && set MAKEFLAGS=& nmake
  559. > Microsoft (R) Program Maintenance Utility Version 14.16.27045.0
  560. > Copyright (C) Microsoft Corporation. All rights reserved.
  561. > cl -c -nologo -Zc:wchar_t -FS -Zc:rvalueCast -Zc:inline -Zc:strictStrings -Zc:throwingNew -Zc:referenceBinding -Zc:__cplusplus -O2 -MT -W0 -EHsc -DUNICODE -D_UNICODE -DWIN32 -D_ENABLE_EXTENDED_ALIGNED_STORAGE -DWIN64 -DNDEBUG -I. -IC:\Qt\OpenSSL\OpenSSL-1.1.1\static\x64\Release\include -IC:\qt-everywhere-src-5.15.1\qtbase\mkspecs\win32-msvc -Fo @C:\Users\MyUser\AppData\Local\Temp\nmF62C.tmp
  562. > main.cpp
  563. > link /NOLOGO /DYNAMICBASE /NXCOMPAT /OPT:REF /INCREMENTAL:NO /SUBSYSTEM:CONSOLE "/MANIFESTDEPENDENCY:type='win32' name='Microsoft.Windows.Common-Controls' version='6.0.0.0' publicKeyToken='6595b64144ccf1df' language='*' processorArchitecture='*'" /MANIFEST:embed /OUT:cxx11_random.exe @C:\Users\MyUser\AppData\Local\Temp\nmF708.tmp
  564. test config.qtbase_corelib.tests.cxx11_random succeeded
  565. executing config test atomicfptr
  566. + cd /d C:\qt-everywhere-src-5.15.1\config.tests\atomicfptr && C:\qt-everywhere-src-5.15.1\qtbase\bin\qmake.exe "CONFIG -= qt debug_and_release app_bundle lib_bundle" "CONFIG += static warn_off console single_arch" "QMAKE_LIBDIR += C:\\Qt\\OpenSSL\\OpenSSL-1.1.1\\static\\x64\\Release\\lib" "INCLUDEPATH += C:\\Qt\\OpenSSL\\OpenSSL-1.1.1\\static\\x64\\Release\\include" C:/qt-everywhere-src-5.15.1/config.tests/atomicfptr
  567. + cd /d C:\qt-everywhere-src-5.15.1\config.tests\atomicfptr && set MAKEFLAGS=& nmake
  568. > Microsoft (R) Program Maintenance Utility Version 14.16.27045.0
  569. > Copyright (C) Microsoft Corporation. All rights reserved.
  570. > cl -c -nologo -Zc:wchar_t -FS -Zc:rvalueCast -Zc:inline -Zc:strictStrings -Zc:throwingNew -Zc:referenceBinding -Zc:__cplusplus -O2 -MT -W0 -EHsc -DUNICODE -D_UNICODE -DWIN32 -D_ENABLE_EXTENDED_ALIGNED_STORAGE -DWIN64 -DNDEBUG -I. -IC:\Qt\OpenSSL\OpenSSL-1.1.1\static\x64\Release\include -IC:\qt-everywhere-src-5.15.1\qtbase\mkspecs\win32-msvc -Fo @C:\Users\MyUser\AppData\Local\Temp\nmF784.tmp
  571. > main.cpp
  572. > link /NOLOGO /DYNAMICBASE /NXCOMPAT /OPT:REF /INCREMENTAL:NO /SUBSYSTEM:CONSOLE "/MANIFESTDEPENDENCY:type='win32' name='Microsoft.Windows.Common-Controls' version='6.0.0.0' publicKeyToken='6595b64144ccf1df' language='*' processorArchitecture='*'" /MANIFEST:embed /OUT:atomicfptr.exe @C:\Users\MyUser\AppData\Local\Temp\nmF850.tmp
  573. test config.qtbase_corelib.tests.atomicfptr succeeded
  574. looking for library openssl
  575. Trying source 0 (type openssl) of library openssl ...
  576. $OPENSSL_LIBS is not set.
  577. => source produced no result.
  578. Trying source 1 (type inline) of library openssl ...
  579. + cd /d C:\qt-everywhere-src-5.15.1\config.tests\openssl && C:\qt-everywhere-src-5.15.1\qtbase\bin\qmake.exe "CONFIG -= qt debug_and_release app_bundle lib_bundle" "CONFIG += static warn_off console single_arch" "QMAKE_LIBDIR += C:\\Qt\\OpenSSL\\OpenSSL-1.1.1\\static\\x64\\Release\\lib" "INCLUDEPATH += C:\\Qt\\OpenSSL\\OpenSSL-1.1.1\\static\\x64\\Release\\include" "QMAKE_USE += openssl" "QMAKE_LIBS_OPENSSL = -lssleay32 -llibeay32 -lUser32 -lWs2_32 -lAdvapi32 -lGdi32" C:/qt-everywhere-src-5.15.1/config.tests/openssl
  580. + cd /d C:\qt-everywhere-src-5.15.1\config.tests\openssl && set MAKEFLAGS=& nmake
  581. > Microsoft (R) Program Maintenance Utility Version 14.16.27045.0
  582. > Copyright (C) Microsoft Corporation. All rights reserved.
  583. > cl -c -nologo -Zc:wchar_t -FS -Zc:rvalueCast -Zc:inline -Zc:strictStrings -Zc:throwingNew -Zc:referenceBinding -Zc:__cplusplus -O2 -MT -W0 -EHsc -DUNICODE -D_UNICODE -DWIN32 -D_ENABLE_EXTENDED_ALIGNED_STORAGE -DWIN64 -DNDEBUG -I. -IC:\Qt\OpenSSL\OpenSSL-1.1.1\static\x64\Release\include -IC:\qt-everywhere-src-5.15.1\qtbase\mkspecs\win32-msvc -Fo @C:\Users\MyUser\AppData\Local\Temp\nmF8EB.tmp
  584. > main.cpp
  585. > link /NOLOGO /DYNAMICBASE /NXCOMPAT /OPT:REF /INCREMENTAL:NO /SUBSYSTEM:CONSOLE "/MANIFESTDEPENDENCY:type='win32' name='Microsoft.Windows.Common-Controls' version='6.0.0.0' publicKeyToken='6595b64144ccf1df' language='*' processorArchitecture='*'" /MANIFEST:embed /OUT:openssl.exe @C:\Users\MyUser\AppData\Local\Temp\nmF95A.tmp
  586. > LINK : fatal error LNK1181: cannot open input file 'ssleay32.lib'
  587. > NMAKE : fatal error U1077: '"C:\Program Files (x86)\Microsoft Visual Studio\2017\Professional\VC\Tools\MSVC\14.16.27023\bin\HostX64\x64\link.EXE"' : return code '0x49d'
  588. > Stop.
  589. => source failed verification.
  590. Trying source 2 (type inline) of library openssl ...
  591. + cd /d C:\qt-everywhere-src-5.15.1\config.tests\openssl && C:\qt-everywhere-src-5.15.1\qtbase\bin\qmake.exe "CONFIG -= qt debug_and_release app_bundle lib_bundle" "CONFIG += static warn_off console single_arch" "QMAKE_LIBDIR += C:\\Qt\\OpenSSL\\OpenSSL-1.1.1\\static\\x64\\Release\\lib" "INCLUDEPATH += C:\\Qt\\OpenSSL\\OpenSSL-1.1.1\\static\\x64\\Release\\include" "QMAKE_USE += openssl" "QMAKE_LIBS_OPENSSL = -llibssl -llibcrypto -lUser32 -lWs2_32 -lAdvapi32 -lCrypt32" C:/qt-everywhere-src-5.15.1/config.tests/openssl
  592. + cd /d C:\qt-everywhere-src-5.15.1\config.tests\openssl && set MAKEFLAGS=& nmake clean && set MAKEFLAGS=& nmake
  593. > Microsoft (R) Program Maintenance Utility Version 14.16.27045.0
  594. > Copyright (C) Microsoft Corporation. All rights reserved.
  595. > del main.obj
  596. > Microsoft (R) Program Maintenance Utility Version 14.16.27045.0
  597. > Copyright (C) Microsoft Corporation. All rights reserved.
  598. > cl -c -nologo -Zc:wchar_t -FS -Zc:rvalueCast -Zc:inline -Zc:strictStrings -Zc:throwingNew -Zc:referenceBinding -Zc:__cplusplus -O2 -MT -W0 -EHsc -DUNICODE -D_UNICODE -DWIN32 -D_ENABLE_EXTENDED_ALIGNED_STORAGE -DWIN64 -DNDEBUG -I. -IC:\Qt\OpenSSL\OpenSSL-1.1.1\static\x64\Release\include -IC:\qt-everywhere-src-5.15.1\qtbase\mkspecs\win32-msvc -Fo @C:\Users\MyUser\AppData\Local\Temp\nmF9C6.tmp
  599. > main.cpp
  600. > link /NOLOGO /DYNAMICBASE /NXCOMPAT /OPT:REF /INCREMENTAL:NO /SUBSYSTEM:CONSOLE "/MANIFESTDEPENDENCY:type='win32' name='Microsoft.Windows.Common-Controls' version='6.0.0.0' publicKeyToken='6595b64144ccf1df' language='*' processorArchitecture='*'" /MANIFEST:embed /OUT:openssl.exe @C:\Users\MyUser\AppData\Local\Temp\nmFA35.tmp
  601. => source accepted.
  602. test config.qtbase_network.libraries.openssl succeeded
  603. executing config test dtls
  604. + cd /d C:\qt-everywhere-src-5.15.1\config.tests\dtls && C:\qt-everywhere-src-5.15.1\qtbase\bin\qmake.exe "CONFIG -= qt debug_and_release app_bundle lib_bundle" "CONFIG += static warn_off console single_arch" "QMAKE_LIBDIR += C:\\Qt\\OpenSSL\\OpenSSL-1.1.1\\static\\x64\\Release\\lib" "INCLUDEPATH += C:\\Qt\\OpenSSL\\OpenSSL-1.1.1\\static\\x64\\Release\\include" "QMAKE_USE += openssl" "QMAKE_LIBS_OPENSSL = -llibssl -llibcrypto -lUser32 -lWs2_32 -lAdvapi32 -lCrypt32" C:/qt-everywhere-src-5.15.1/config.tests/dtls
  605. + cd /d C:\qt-everywhere-src-5.15.1\config.tests\dtls && set MAKEFLAGS=& nmake
  606. > Microsoft (R) Program Maintenance Utility Version 14.16.27045.0
  607. > Copyright (C) Microsoft Corporation. All rights reserved.
  608. > cl -c -nologo -Zc:wchar_t -FS -Zc:rvalueCast -Zc:inline -Zc:strictStrings -Zc:throwingNew -Zc:referenceBinding -Zc:__cplusplus -O2 -MT -W0 -EHsc -DUNICODE -D_UNICODE -DWIN32 -D_ENABLE_EXTENDED_ALIGNED_STORAGE -DWIN64 -DNDEBUG -I. -IC:\Qt\OpenSSL\OpenSSL-1.1.1\static\x64\Release\include -IC:\qt-everywhere-src-5.15.1\qtbase\mkspecs\win32-msvc -Fo @C:\Users\MyUser\AppData\Local\Temp\nmFB1E.tmp
  609. > main.cpp
  610. > link /NOLOGO /DYNAMICBASE /NXCOMPAT /OPT:REF /INCREMENTAL:NO /SUBSYSTEM:CONSOLE "/MANIFESTDEPENDENCY:type='win32' name='Microsoft.Windows.Common-Controls' version='6.0.0.0' publicKeyToken='6595b64144ccf1df' language='*' processorArchitecture='*'" /MANIFEST:embed /OUT:dtls.exe @C:\Users\MyUser\AppData\Local\Temp\nmFB8C.tmp
  611. test config.qtbase_network.tests.dtls succeeded
  612. Trying source 0 (type makeSpec) of library network ...
  613. => source accepted.
  614. executing config test getifaddrs
  615. + cd /d C:\qt-everywhere-src-5.15.1\config.tests\getifaddrs && C:\qt-everywhere-src-5.15.1\qtbase\bin\qmake.exe "CONFIG -= qt debug_and_release app_bundle lib_bundle" "CONFIG += static warn_off console single_arch" "QMAKE_LIBDIR += C:\\Qt\\OpenSSL\\OpenSSL-1.1.1\\static\\x64\\Release\\lib" "INCLUDEPATH += C:\\Qt\\OpenSSL\\OpenSSL-1.1.1\\static\\x64\\Release\\include" "QMAKE_USE += network" "QMAKE_LIBS_NETWORK = ws2_32.lib" C:/qt-everywhere-src-5.15.1/config.tests/getifaddrs
  616. + cd /d C:\qt-everywhere-src-5.15.1\config.tests\getifaddrs && set MAKEFLAGS=& nmake
  617. > Microsoft (R) Program Maintenance Utility Version 14.16.27045.0
  618. > Copyright (C) Microsoft Corporation. All rights reserved.
  619. > cl -c -nologo -Zc:wchar_t -FS -Zc:rvalueCast -Zc:inline -Zc:strictStrings -Zc:throwingNew -Zc:referenceBinding -Zc:__cplusplus -O2 -MT -W0 -EHsc -DUNICODE -D_UNICODE -DWIN32 -D_ENABLE_EXTENDED_ALIGNED_STORAGE -DWIN64 -DNDEBUG -I. -IC:\Qt\OpenSSL\OpenSSL-1.1.1\static\x64\Release\include -IC:\qt-everywhere-src-5.15.1\qtbase\mkspecs\win32-msvc -Fo @C:\Users\MyUser\AppData\Local\Temp\nmFC18.tmp
  620. > main.cpp
  621. > .\main.cpp(3): fatal error C1083: Cannot open include file: 'sys/socket.h': No such file or directory
  622. > NMAKE : fatal error U1077: '"C:\Program Files (x86)\Microsoft Visual Studio\2017\Professional\VC\Tools\MSVC\14.16.27023\bin\HostX64\x64\cl.EXE"' : return code '0x2'
  623. > Stop.
  624. test config.qtbase_network.tests.getifaddrs FAILED
  625. executing config test ipv6ifname
  626. + cd /d C:\qt-everywhere-src-5.15.1\config.tests\ipv6ifname && C:\qt-everywhere-src-5.15.1\qtbase\bin\qmake.exe "CONFIG -= qt debug_and_release app_bundle lib_bundle" "CONFIG += static warn_off console single_arch" "QMAKE_LIBDIR += C:\\Qt\\OpenSSL\\OpenSSL-1.1.1\\static\\x64\\Release\\lib" "INCLUDEPATH += C:\\Qt\\OpenSSL\\OpenSSL-1.1.1\\static\\x64\\Release\\include" "QMAKE_USE += network" "QMAKE_LIBS_NETWORK = ws2_32.lib" C:/qt-everywhere-src-5.15.1/config.tests/ipv6ifname
  627. + cd /d C:\qt-everywhere-src-5.15.1\config.tests\ipv6ifname && set MAKEFLAGS=& nmake
  628. > Microsoft (R) Program Maintenance Utility Version 14.16.27045.0
  629. > Copyright (C) Microsoft Corporation. All rights reserved.
  630. > cl -c -nologo -Zc:wchar_t -FS -Zc:rvalueCast -Zc:inline -Zc:strictStrings -Zc:throwingNew -Zc:referenceBinding -Zc:__cplusplus -O2 -MT -W0 -EHsc -DUNICODE -D_UNICODE -DWIN32 -D_ENABLE_EXTENDED_ALIGNED_STORAGE -DWIN64 -DNDEBUG -I. -IC:\Qt\OpenSSL\OpenSSL-1.1.1\static\x64\Release\include -IC:\qt-everywhere-src-5.15.1\qtbase\mkspecs\win32-msvc -Fo @C:\Users\MyUser\AppData\Local\Temp\nmFC66.tmp
  631. > main.cpp
  632. > .\main.cpp(3): fatal error C1083: Cannot open include file: 'sys/socket.h': No such file or directory
  633. > NMAKE : fatal error U1077: '"C:\Program Files (x86)\Microsoft Visual Studio\2017\Professional\VC\Tools\MSVC\14.16.27023\bin\HostX64\x64\cl.EXE"' : return code '0x2'
  634. > Stop.
  635. test config.qtbase_network.tests.ipv6ifname FAILED
  636. executing config test netlistmgr
  637. + cd /d C:\qt-everywhere-src-5.15.1\config.tests\netlistmgr && C:\qt-everywhere-src-5.15.1\qtbase\bin\qmake.exe "CONFIG -= qt debug_and_release app_bundle lib_bundle" "CONFIG += static warn_off console single_arch" "QMAKE_LIBDIR += C:\\Qt\\OpenSSL\\OpenSSL-1.1.1\\static\\x64\\Release\\lib" "INCLUDEPATH += C:\\Qt\\OpenSSL\\OpenSSL-1.1.1\\static\\x64\\Release\\include" C:/qt-everywhere-src-5.15.1/config.tests/netlistmgr
  638. + cd /d C:\qt-everywhere-src-5.15.1\config.tests\netlistmgr && set MAKEFLAGS=& nmake
  639. > Microsoft (R) Program Maintenance Utility Version 14.16.27045.0
  640. > Copyright (C) Microsoft Corporation. All rights reserved.
  641. > cl -c -nologo -Zc:wchar_t -FS -Zc:rvalueCast -Zc:inline -Zc:strictStrings -Zc:throwingNew -Zc:referenceBinding -Zc:__cplusplus -O2 -MT -W0 -EHsc -DUNICODE -D_UNICODE -DWIN32 -D_ENABLE_EXTENDED_ALIGNED_STORAGE -DWIN64 -DNDEBUG -I. -IC:\Qt\OpenSSL\OpenSSL-1.1.1\static\x64\Release\include -IC:\qt-everywhere-src-5.15.1\qtbase\mkspecs\win32-msvc -Fo @C:\Users\MyUser\AppData\Local\Temp\nmFCC4.tmp
  642. > main.cpp
  643. > link /NOLOGO /DYNAMICBASE /NXCOMPAT /OPT:REF /INCREMENTAL:NO /SUBSYSTEM:CONSOLE "/MANIFESTDEPENDENCY:type='win32' name='Microsoft.Windows.Common-Controls' version='6.0.0.0' publicKeyToken='6595b64144ccf1df' language='*' processorArchitecture='*'" /MANIFEST:embed /OUT:netlistmgr.exe @C:\Users\MyUser\AppData\Local\Temp\nmFDFD.tmp
  644. test config.qtbase_network.tests.netlistmgr succeeded
  645. executing config test ocsp
  646. + cd /d C:\qt-everywhere-src-5.15.1\config.tests\ocsp && C:\qt-everywhere-src-5.15.1\qtbase\bin\qmake.exe "CONFIG -= qt debug_and_release app_bundle lib_bundle" "CONFIG += static warn_off console single_arch" "QMAKE_LIBDIR += C:\\Qt\\OpenSSL\\OpenSSL-1.1.1\\static\\x64\\Release\\lib" "INCLUDEPATH += C:\\Qt\\OpenSSL\\OpenSSL-1.1.1\\static\\x64\\Release\\include" "QMAKE_USE += openssl" "QMAKE_LIBS_OPENSSL = -llibssl -llibcrypto -lUser32 -lWs2_32 -lAdvapi32 -lCrypt32" C:/qt-everywhere-src-5.15.1/config.tests/ocsp
  647. + cd /d C:\qt-everywhere-src-5.15.1\config.tests\ocsp && set MAKEFLAGS=& nmake
  648. > Microsoft (R) Program Maintenance Utility Version 14.16.27045.0
  649. > Copyright (C) Microsoft Corporation. All rights reserved.
  650. > cl -c -nologo -Zc:wchar_t -FS -Zc:rvalueCast -Zc:inline -Zc:strictStrings -Zc:throwingNew -Zc:referenceBinding -Zc:__cplusplus -O2 -MT -W0 -EHsc -DUNICODE -D_UNICODE -DWIN32 -D_ENABLE_EXTENDED_ALIGNED_STORAGE -DWIN64 -DNDEBUG -I. -IC:\Qt\OpenSSL\OpenSSL-1.1.1\static\x64\Release\include -IC:\qt-everywhere-src-5.15.1\qtbase\mkspecs\win32-msvc -Fo @C:\Users\MyUser\AppData\Local\Temp\nmFE99.tmp
  651. > main.cpp
  652. > link /NOLOGO /DYNAMICBASE /NXCOMPAT /OPT:REF /INCREMENTAL:NO /SUBSYSTEM:CONSOLE "/MANIFESTDEPENDENCY:type='win32' name='Microsoft.Windows.Common-Controls' version='6.0.0.0' publicKeyToken='6595b64144ccf1df' language='*' processorArchitecture='*'" /MANIFEST:embed /OUT:ocsp.exe @C:\Users\MyUser\AppData\Local\Temp\nmFF17.tmp
  653. test config.qtbase_network.tests.ocsp succeeded
  654. looking for library xcb
  655. Trying source 0 (type pkgConfig) of library xcb ...
  656. pkg-config use disabled globally.
  657. => source produced no result.
  658. Trying source 1 (type inline) of library xcb ...
  659. xcb/xcb.h not found in [] and global paths.
  660. => source produced no result.
  661. test config.qtbase_gui.libraries.xcb FAILED
  662. looking for library dxguid
  663. Trying source 0 (type inline) of library dxguid ...
  664. => source accepted.
  665. test config.qtbase_gui.libraries.dxguid succeeded
  666. executing config test fxc
  667. test config.qtbase_gui.tests.fxc gave result C:/Program Files (x86)/Windows Kits/10/bin/10.0.18362.0/x64/fxc.exe
  668. looking for library d3d9
  669. Trying source 0 (type inline) of library d3d9 ...
  670. => source accepted.
  671. test config.qtbase_gui.libraries.d3d9 succeeded
  672. executing config test angle_d3d11_qdtd
  673. + cd /d C:\qt-everywhere-src-5.15.1\config.tests\angle_d3d11_qdtd && C:\qt-everywhere-src-5.15.1\qtbase\bin\qmake.exe "CONFIG -= qt debug_and_release app_bundle lib_bundle" "CONFIG += static warn_off console single_arch" "QMAKE_LIBDIR += C:\\Qt\\OpenSSL\\OpenSSL-1.1.1\\static\\x64\\Release\\lib" "INCLUDEPATH += C:\\Qt\\OpenSSL\\OpenSSL-1.1.1\\static\\x64\\Release\\include" C:/qt-everywhere-src-5.15.1/config.tests/angle_d3d11_qdtd
  674. + cd /d C:\qt-everywhere-src-5.15.1\config.tests\angle_d3d11_qdtd && set MAKEFLAGS=& nmake
  675. > Microsoft (R) Program Maintenance Utility Version 14.16.27045.0
  676. > Copyright (C) Microsoft Corporation. All rights reserved.
  677. > cl -c -nologo -Zc:wchar_t -FS -Zc:rvalueCast -Zc:inline -Zc:strictStrings -Zc:throwingNew -Zc:referenceBinding -Zc:__cplusplus -O2 -MT -W0 -EHsc -DUNICODE -D_UNICODE -DWIN32 -D_ENABLE_EXTENDED_ALIGNED_STORAGE -DWIN64 -DNDEBUG -I. -IC:\Qt\OpenSSL\OpenSSL-1.1.1\static\x64\Release\include -IC:\qt-everywhere-src-5.15.1\qtbase\mkspecs\win32-msvc -Fo @C:\Users\MyUser\AppData\Local\Temp\nmFFB2.tmp
  678. > main.cpp
  679. > link /NOLOGO /DYNAMICBASE /NXCOMPAT /OPT:REF /INCREMENTAL:NO /SUBSYSTEM:CONSOLE "/MANIFESTDEPENDENCY:type='win32' name='Microsoft.Windows.Common-Controls' version='6.0.0.0' publicKeyToken='6595b64144ccf1df' language='*' processorArchitecture='*'" /MANIFEST:embed /OUT:angle_d3d11_qdtd.exe @C:\Users\MyUser\AppData\Local\Temp\nmFB.tmp
  680. test config.qtbase_gui.tests.angle_d3d11_qdtd succeeded
  681. looking for library dxgi
  682. Trying source 0 (type inline) of library dxgi ...
  683. => source accepted.
  684. test config.qtbase_gui.libraries.dxgi succeeded
  685. looking for library d3d11
  686. Trying source 0 (type inline) of library d3d11 ...
  687. => source accepted.
  688. test config.qtbase_gui.libraries.d3d11 succeeded
  689. looking for library d2d1
  690. Trying source 0 (type inline) of library d2d1 ...
  691. => source accepted.
  692. test config.qtbase_gui.libraries.d2d1 succeeded
  693. looking for library d2d1_1
  694. Trying source 0 (type inline) of library d2d1_1 ...
  695. + cd /d C:\qt-everywhere-src-5.15.1\config.tests\d2d1_1 && C:\qt-everywhere-src-5.15.1\qtbase\bin\qmake.exe "CONFIG -= qt debug_and_release app_bundle lib_bundle" "CONFIG += static warn_off console single_arch" "QMAKE_LIBDIR += C:\\Qt\\OpenSSL\\OpenSSL-1.1.1\\static\\x64\\Release\\lib" "INCLUDEPATH += C:\\Qt\\OpenSSL\\OpenSSL-1.1.1\\static\\x64\\Release\\include" "QMAKE_USE += d2d1_1" "QMAKE_LIBS_D2D1_1 = -ld2d1" C:/qt-everywhere-src-5.15.1/config.tests/d2d1_1
  696. + cd /d C:\qt-everywhere-src-5.15.1\config.tests\d2d1_1 && set MAKEFLAGS=& nmake
  697. > Microsoft (R) Program Maintenance Utility Version 14.16.27045.0
  698. > Copyright (C) Microsoft Corporation. All rights reserved.
  699. > cl -c -nologo -Zc:wchar_t -FS -Zc:rvalueCast -Zc:inline -Zc:strictStrings -Zc:throwingNew -Zc:referenceBinding -Zc:__cplusplus -O2 -MT -W0 -EHsc -DUNICODE -D_UNICODE -DWIN32 -D_ENABLE_EXTENDED_ALIGNED_STORAGE -DWIN64 -DNDEBUG -I. -IC:\Qt\OpenSSL\OpenSSL-1.1.1\static\x64\Release\include -IC:\qt-everywhere-src-5.15.1\qtbase\mkspecs\win32-msvc -Fo @C:\Users\MyUser\AppData\Local\Temp\nm187.tmp
  700. > main.cpp
  701. > link /NOLOGO /DYNAMICBASE /NXCOMPAT /OPT:REF /INCREMENTAL:NO /SUBSYSTEM:CONSOLE "/MANIFESTDEPENDENCY:type='win32' name='Microsoft.Windows.Common-Controls' version='6.0.0.0' publicKeyToken='6595b64144ccf1df' language='*' processorArchitecture='*'" /MANIFEST:embed /OUT:d2d1_1.exe @C:\Users\MyUser\AppData\Local\Temp\nm2D0.tmp
  702. => source accepted.
  703. test config.qtbase_gui.libraries.d2d1_1 succeeded
  704. looking for library dxgi1_2
  705. Trying source 0 (type inline) of library dxgi1_2 ...
  706. + cd /d C:\qt-everywhere-src-5.15.1\config.tests\dxgi1_2 && C:\qt-everywhere-src-5.15.1\qtbase\bin\qmake.exe "CONFIG -= qt debug_and_release app_bundle lib_bundle" "CONFIG += static warn_off console single_arch" "QMAKE_LIBDIR += C:\\Qt\\OpenSSL\\OpenSSL-1.1.1\\static\\x64\\Release\\lib" "INCLUDEPATH += C:\\Qt\\OpenSSL\\OpenSSL-1.1.1\\static\\x64\\Release\\include" "QMAKE_USE += dxgi1_2" "QMAKE_LIBS_DXGI1_2 = -ldxgi" C:/qt-everywhere-src-5.15.1/config.tests/dxgi1_2
  707. + cd /d C:\qt-everywhere-src-5.15.1\config.tests\dxgi1_2 && set MAKEFLAGS=& nmake
  708. > Microsoft (R) Program Maintenance Utility Version 14.16.27045.0
  709. > Copyright (C) Microsoft Corporation. All rights reserved.
  710. > cl -c -nologo -Zc:wchar_t -FS -Zc:rvalueCast -Zc:inline -Zc:strictStrings -Zc:throwingNew -Zc:referenceBinding -Zc:__cplusplus -O2 -MT -W0 -EHsc -DUNICODE -D_UNICODE -DWIN32 -D_ENABLE_EXTENDED_ALIGNED_STORAGE -DWIN64 -DNDEBUG -I. -IC:\Qt\OpenSSL\OpenSSL-1.1.1\static\x64\Release\include -IC:\qt-everywhere-src-5.15.1\qtbase\mkspecs\win32-msvc -Fo @C:\Users\MyUser\AppData\Local\Temp\nm35B.tmp
  711. > main.cpp
  712. > link /NOLOGO /DYNAMICBASE /NXCOMPAT /OPT:REF /INCREMENTAL:NO /SUBSYSTEM:CONSOLE "/MANIFESTDEPENDENCY:type='win32' name='Microsoft.Windows.Common-Controls' version='6.0.0.0' publicKeyToken='6595b64144ccf1df' language='*' processorArchitecture='*'" /MANIFEST:embed /OUT:dxgi1_2.exe @C:\Users\MyUser\AppData\Local\Temp\nm485.tmp
  713. => source accepted.
  714. test config.qtbase_gui.libraries.dxgi1_2 succeeded
  715. looking for library d3d11_1
  716. Trying source 0 (type inline) of library d3d11_1 ...
  717. => source accepted.
  718. test config.qtbase_gui.libraries.d3d11_1 succeeded
  719. looking for library dwrite
  720. Trying source 0 (type inline) of library dwrite ...
  721. + cd /d C:\qt-everywhere-src-5.15.1\config.tests\dwrite && C:\qt-everywhere-src-5.15.1\qtbase\bin\qmake.exe "CONFIG -= qt debug_and_release app_bundle lib_bundle" "CONFIG += static warn_off console single_arch" "QMAKE_LIBDIR += C:\\Qt\\OpenSSL\\OpenSSL-1.1.1\\static\\x64\\Release\\lib" "INCLUDEPATH += C:\\Qt\\OpenSSL\\OpenSSL-1.1.1\\static\\x64\\Release\\include" "QMAKE_USE += dwrite" "QMAKE_LIBS_DWRITE = -ldwrite" C:/qt-everywhere-src-5.15.1/config.tests/dwrite
  722. + cd /d C:\qt-everywhere-src-5.15.1\config.tests\dwrite && set MAKEFLAGS=& nmake
  723. > Microsoft (R) Program Maintenance Utility Version 14.16.27045.0
  724. > Copyright (C) Microsoft Corporation. All rights reserved.
  725. > cl -c -nologo -Zc:wchar_t -FS -Zc:rvalueCast -Zc:inline -Zc:strictStrings -Zc:throwingNew -Zc:referenceBinding -Zc:__cplusplus -O2 -MT -W0 -EHsc -DUNICODE -D_UNICODE -DWIN32 -D_ENABLE_EXTENDED_ALIGNED_STORAGE -DWIN64 -DNDEBUG -I. -IC:\Qt\OpenSSL\OpenSSL-1.1.1\static\x64\Release\include -IC:\qt-everywhere-src-5.15.1\qtbase\mkspecs\win32-msvc -Fo @C:\Users\MyUser\AppData\Local\Temp\nm511.tmp
  726. > main.cpp
  727. > link /NOLOGO /DYNAMICBASE /NXCOMPAT /OPT:REF /INCREMENTAL:NO /SUBSYSTEM:CONSOLE "/MANIFESTDEPENDENCY:type='win32' name='Microsoft.Windows.Common-Controls' version='6.0.0.0' publicKeyToken='6595b64144ccf1df' language='*' processorArchitecture='*'" /MANIFEST:embed /OUT:dwrite.exe @C:\Users\MyUser\AppData\Local\Temp\nm62B.tmp
  728. => source accepted.
  729. test config.qtbase_gui.libraries.dwrite succeeded
  730. looking for library dwrite_1
  731. Trying source 0 (type inline) of library dwrite_1 ...
  732. => source accepted.
  733. test config.qtbase_gui.libraries.dwrite_1 succeeded
  734. looking for library dwrite_2
  735. Trying source 0 (type inline) of library dwrite_2 ...
  736. + cd /d C:\qt-everywhere-src-5.15.1\config.tests\dwrite_2 && C:\qt-everywhere-src-5.15.1\qtbase\bin\qmake.exe "CONFIG -= qt debug_and_release app_bundle lib_bundle" "CONFIG += static warn_off console single_arch" "QMAKE_LIBDIR += C:\\Qt\\OpenSSL\\OpenSSL-1.1.1\\static\\x64\\Release\\lib" "INCLUDEPATH += C:\\Qt\\OpenSSL\\OpenSSL-1.1.1\\static\\x64\\Release\\include" "QMAKE_USE += dwrite_2" "QMAKE_LIBS_DWRITE_2 = -ldwrite" C:/qt-everywhere-src-5.15.1/config.tests/dwrite_2
  737. + cd /d C:\qt-everywhere-src-5.15.1\config.tests\dwrite_2 && set MAKEFLAGS=& nmake
  738. > Microsoft (R) Program Maintenance Utility Version 14.16.27045.0
  739. > Copyright (C) Microsoft Corporation. All rights reserved.
  740. > cl -c -nologo -Zc:wchar_t -FS -Zc:rvalueCast -Zc:inline -Zc:strictStrings -Zc:throwingNew -Zc:referenceBinding -Zc:__cplusplus -O2 -MT -W0 -EHsc -DUNICODE -D_UNICODE -DWIN32 -D_ENABLE_EXTENDED_ALIGNED_STORAGE -DWIN64 -DNDEBUG -I. -IC:\Qt\OpenSSL\OpenSSL-1.1.1\static\x64\Release\include -IC:\qt-everywhere-src-5.15.1\qtbase\mkspecs\win32-msvc -Fo @C:\Users\MyUser\AppData\Local\Temp\nm6B7.tmp
  741. > main.cpp
  742. > link /NOLOGO /DYNAMICBASE /NXCOMPAT /OPT:REF /INCREMENTAL:NO /SUBSYSTEM:CONSOLE "/MANIFESTDEPENDENCY:type='win32' name='Microsoft.Windows.Common-Controls' version='6.0.0.0' publicKeyToken='6595b64144ccf1df' language='*' processorArchitecture='*'" /MANIFEST:embed /OUT:dwrite_2.exe @C:\Users\MyUser\AppData\Local\Temp\nm7D1.tmp
  743. => source accepted.
  744. test config.qtbase_gui.libraries.dwrite_2 succeeded
  745. looking for library drm
  746. Trying source 0 (type pkgConfig) of library drm ...
  747. pkg-config use disabled globally.
  748. => source produced no result.
  749. Trying source 1 (type inline) of library drm ...
  750. xf86drmMode.h not found in [] and global paths.
  751. xf86drm.h not found in [] and global paths.
  752. => source produced no result.
  753. Trying source 2 (type inline) of library drm ...
  754. => source failed condition 'config.integrity'.
  755. test config.qtbase_gui.libraries.drm FAILED
  756. looking for library egl
  757. Trying source 0 (type pkgConfig) of library egl ...
  758. pkg-config use disabled globally.
  759. => source produced no result.
  760. Trying source 1 (type makeSpec) of library egl ...
  761. EGL/egl.h not found in [] and global paths.
  762. => source produced no result.
  763. test config.qtbase_gui.libraries.egl FAILED
  764. executing config test evdev
  765. + cd /d C:\qt-everywhere-src-5.15.1\config.tests\evdev && C:\qt-everywhere-src-5.15.1\qtbase\bin\qmake.exe "CONFIG -= qt debug_and_release app_bundle lib_bundle" "CONFIG += static warn_off console single_arch" "QMAKE_LIBDIR += C:\\Qt\\OpenSSL\\OpenSSL-1.1.1\\static\\x64\\Release\\lib" "INCLUDEPATH += C:\\Qt\\OpenSSL\\OpenSSL-1.1.1\\static\\x64\\Release\\include" C:/qt-everywhere-src-5.15.1/config.tests/evdev
  766. + cd /d C:\qt-everywhere-src-5.15.1\config.tests\evdev && set MAKEFLAGS=& nmake
  767. > Microsoft (R) Program Maintenance Utility Version 14.16.27045.0
  768. > Copyright (C) Microsoft Corporation. All rights reserved.
  769. > cl -c -nologo -Zc:wchar_t -FS -Zc:rvalueCast -Zc:inline -Zc:strictStrings -Zc:throwingNew -Zc:referenceBinding -Zc:__cplusplus -O2 -MT -W0 -EHsc -DUNICODE -D_UNICODE -DWIN32 -D_ENABLE_EXTENDED_ALIGNED_STORAGE -DWIN64 -DNDEBUG -I. -IC:\Qt\OpenSSL\OpenSSL-1.1.1\static\x64\Release\include -IC:\qt-everywhere-src-5.15.1\qtbase\mkspecs\win32-msvc -Fo @C:\Users\MyUser\AppData\Local\Temp\nm85D.tmp
  770. > main.cpp
  771. > .\main.cpp(5): fatal error C1083: Cannot open include file: 'linux/input.h': No such file or directory
  772. > NMAKE : fatal error U1077: '"C:\Program Files (x86)\Microsoft Visual Studio\2017\Professional\VC\Tools\MSVC\14.16.27023\bin\HostX64\x64\cl.EXE"' : return code '0x2'
  773. > Stop.
  774. test config.qtbase_gui.tests.evdev FAILED
  775. looking for library gbm
  776. Trying source 0 (type pkgConfig) of library gbm ...
  777. pkg-config use disabled globally.
  778. => source produced no result.
  779. test config.qtbase_gui.libraries.gbm FAILED
  780. executing config test linuxfb
  781. + cd /d C:\qt-everywhere-src-5.15.1\config.tests\linuxfb && C:\qt-everywhere-src-5.15.1\qtbase\bin\qmake.exe "CONFIG -= qt debug_and_release app_bundle lib_bundle" "CONFIG += static warn_off console single_arch" "QMAKE_LIBDIR += C:\\Qt\\OpenSSL\\OpenSSL-1.1.1\\static\\x64\\Release\\lib" "INCLUDEPATH += C:\\Qt\\OpenSSL\\OpenSSL-1.1.1\\static\\x64\\Release\\include" C:/qt-everywhere-src-5.15.1/config.tests/linuxfb
  782. + cd /d C:\qt-everywhere-src-5.15.1\config.tests\linuxfb && set MAKEFLAGS=& nmake
  783. > Microsoft (R) Program Maintenance Utility Version 14.16.27045.0
  784. > Copyright (C) Microsoft Corporation. All rights reserved.
  785. > cl -c -nologo -Zc:wchar_t -FS -Zc:rvalueCast -Zc:inline -Zc:strictStrings -Zc:throwingNew -Zc:referenceBinding -Zc:__cplusplus -O2 -MT -W0 -EHsc -DUNICODE -D_UNICODE -DWIN32 -D_ENABLE_EXTENDED_ALIGNED_STORAGE -DWIN64 -DNDEBUG -I. -IC:\Qt\OpenSSL\OpenSSL-1.1.1\static\x64\Release\include -IC:\qt-everywhere-src-5.15.1\qtbase\mkspecs\win32-msvc -Fo @C:\Users\MyUser\AppData\Local\Temp\nm8BA.tmp
  786. > main.cpp
  787. > .\main.cpp(2): fatal error C1083: Cannot open include file: 'linux/fb.h': No such file or directory
  788. > NMAKE : fatal error U1077: '"C:\Program Files (x86)\Microsoft Visual Studio\2017\Professional\VC\Tools\MSVC\14.16.27023\bin\HostX64\x64\cl.EXE"' : return code '0x2'
  789. > Stop.
  790. test config.qtbase_gui.tests.linuxfb FAILED
  791. looking for library mtdev
  792. Trying source 0 (type pkgConfig) of library mtdev ...
  793. pkg-config use disabled globally.
  794. => source produced no result.
  795. test config.qtbase_gui.libraries.mtdev FAILED
  796. looking for library openvg
  797. Trying source 0 (type pkgConfig) of library openvg ...
  798. pkg-config use disabled globally.
  799. => source produced no result.
  800. Trying source 1 (type makeSpec) of library openvg ...
  801. VG/openvg.h not found in [] and global paths.
  802. => source produced no result.
  803. test config.qtbase_gui.libraries.openvg FAILED
  804. executing config test qpa_default_platform
  805. test config.qtbase_gui.tests.qpa_default_platform gave result windows
  806. looking for library libjpeg
  807. Trying source 0 (type pkgConfig) of library libjpeg ...
  808. pkg-config use disabled globally.
  809. => source produced no result.
  810. Trying source 1 (type inline) of library libjpeg ...
  811. jpeglib.h not found in [] and global paths.
  812. => source produced no result.
  813. Trying source 2 (type inline) of library libjpeg ...
  814. jpeglib.h not found in [] and global paths.
  815. => source produced no result.
  816. test config.qtbase_gui.libraries.libjpeg FAILED
  817. looking for library libmd4c
  818. Trying source 0 (type pkgConfig) of library libmd4c ...
  819. pkg-config use disabled globally.
  820. => source produced no result.
  821. Trying source 1 (type inline) of library libmd4c ...
  822. md4c.h not found in [] and global paths.
  823. => source produced no result.
  824. test config.qtbase_gui.libraries.libmd4c FAILED
  825. looking for library tslib
  826. Trying source 0 (type inline) of library tslib ...
  827. tslib.h not found in [] and global paths.
  828. => source produced no result.
  829. test config.qtbase_gui.libraries.tslib FAILED
  830. looking for library vulkan
  831. Trying source 0 (type pkgConfig) of library vulkan ...
  832. pkg-config use disabled globally.
  833. => source produced no result.
  834. Trying source 1 (type makeSpec) of library vulkan ...
  835. Include path /include is invalid.
  836. vulkan/vulkan.h not found in [/include] and global paths.
  837. => source produced no result.
  838. test config.qtbase_gui.libraries.vulkan FAILED
  839. looking for library xlib
  840. Trying source 0 (type makeSpec) of library xlib ...
  841. X11/Xlib.h not found in [] and global paths.
  842. => source produced no result.
  843. test config.qtbase_gui.libraries.xlib FAILED
  844. looking for library xkbcommon
  845. Trying source 0 (type pkgConfig) of library xkbcommon ...
  846. pkg-config use disabled globally.
  847. => source produced no result.
  848. Trying source 1 (type inline) of library xkbcommon ...
  849. xkbcommon/xkbcommon.h not found in [] and global paths.
  850. => source produced no result.
  851. test config.qtbase_gui.libraries.xkbcommon FAILED
  852. executing config test uxtheme
  853. Searching for file uxtheme.h.
  854. Found at C:\Program Files (x86)\Windows Kits\10\include\10.0.18362.0\um/uxtheme.h.
  855. test config.qtbase_widgets.tests.uxtheme succeeded
  856. looking for library cups
  857. Trying source 0 (type inline) of library cups ...
  858. cups/cups.h not found in [] and global paths.
  859. => source produced no result.
  860. test config.qtbase_printsupport.libraries.cups FAILED
  861. looking for library db2
  862. Trying source 0 (type inline) of library db2 ...
  863. sqlcli.h not found in [] and global paths.
  864. sqlcli1.h not found in [] and global paths.
  865. => source produced no result.
  866. Trying source 1 (type inline) of library db2 ...
  867. => source failed condition '!config.win32'.
  868. test config.qtbase_sqldrivers.libraries.db2 FAILED
  869. looking for library ibase
  870. Trying source 0 (type inline) of library ibase ...
  871. ibase.h not found in [] and global paths.
  872. => source produced no result.
  873. Trying source 1 (type inline) of library ibase ...
  874. => source failed condition '!config.win32'.
  875. test config.qtbase_sqldrivers.libraries.ibase FAILED
  876. looking for library mysql
  877. Trying source 0 (type mysqlConfig) of library mysql ...
  878. mysql_config not found.
  879. => source produced no result.
  880. Trying source 1 (type mysqlConfig) of library mysql ...
  881. mysql_config not found.
  882. => source produced no result.
  883. Trying source 2 (type mysqlConfig) of library mysql ...
  884. mysql_config not found.
  885. => source produced no result.
  886. Trying source 3 (type mysqlConfig) of library mysql ...
  887. mysql_config not found.
  888. => source produced no result.
  889. Trying source 4 (type inline) of library mysql ...
  890. => source failed condition '!config.win32'.
  891. Trying source 5 (type inline) of library mysql ...
  892. mysql.h not found in [] and global paths.
  893. => source produced no result.
  894. Trying source 6 (type inline) of library mysql ...
  895. mysql.h not found in [] and global paths.
  896. => source produced no result.
  897. Trying source 7 (type inline) of library mysql ...
  898. => source failed condition '!config.win32'.
  899. Trying source 8 (type inline) of library mysql ...
  900. => source failed condition '!config.win32'.
  901. test config.qtbase_sqldrivers.libraries.mysql FAILED
  902. looking for library oci
  903. Trying source 0 (type inline) of library oci ...
  904. oci.h not found in [] and global paths.
  905. => source produced no result.
  906. Trying source 1 (type inline) of library oci ...
  907. => source failed condition '!config.win32'.
  908. test config.qtbase_sqldrivers.libraries.oci FAILED
  909. looking for library odbc
  910. Trying source 0 (type inline) of library odbc ...
  911. + cd /d C:\qt-everywhere-src-5.15.1\config.tests\odbc && C:\qt-everywhere-src-5.15.1\qtbase\bin\qmake.exe "CONFIG -= qt debug_and_release app_bundle lib_bundle" "CONFIG += static warn_off console single_arch" "QMAKE_LIBDIR += C:\\Qt\\OpenSSL\\OpenSSL-1.1.1\\static\\x64\\Release\\lib" "INCLUDEPATH += C:\\Qt\\OpenSSL\\OpenSSL-1.1.1\\static\\x64\\Release\\include" "QMAKE_USE += odbc" "QMAKE_LIBS_ODBC = -lodbc32" C:/qt-everywhere-src-5.15.1/config.tests/odbc
  912. + cd /d C:\qt-everywhere-src-5.15.1\config.tests\odbc && set MAKEFLAGS=& nmake
  913. > Microsoft (R) Program Maintenance Utility Version 14.16.27045.0
  914. > Copyright (C) Microsoft Corporation. All rights reserved.
  915. > cl -c -nologo -Zc:wchar_t -FS -Zc:rvalueCast -Zc:inline -Zc:strictStrings -Zc:throwingNew -Zc:referenceBinding -Zc:__cplusplus -O2 -MT -W0 -EHsc -DUNICODE -D_UNICODE -DWIN32 -D_ENABLE_EXTENDED_ALIGNED_STORAGE -DWIN64 -DNDEBUG -I. -IC:\Qt\OpenSSL\OpenSSL-1.1.1\static\x64\Release\include -IC:\qt-everywhere-src-5.15.1\qtbase\mkspecs\win32-msvc -Fo @C:\Users\MyUser\AppData\Local\Temp\nm966.tmp
  916. > main.cpp
  917. > link /NOLOGO /DYNAMICBASE /NXCOMPAT /OPT:REF /INCREMENTAL:NO /SUBSYSTEM:CONSOLE "/MANIFESTDEPENDENCY:type='win32' name='Microsoft.Windows.Common-Controls' version='6.0.0.0' publicKeyToken='6595b64144ccf1df' language='*' processorArchitecture='*'" /MANIFEST:embed /OUT:odbc.exe @C:\Users\MyUser\AppData\Local\Temp\nmA90.tmp
  918. => source accepted.
  919. test config.qtbase_sqldrivers.libraries.odbc succeeded
  920. looking for library psql
  921. Trying source 0 (type pkgConfig) of library psql ...
  922. pkg-config use disabled globally.
  923. => source produced no result.
  924. Trying source 1 (type psqlConfig) of library psql ...
  925. pg_config not found.
  926. => source produced no result.
  927. Trying source 2 (type psqlEnv) of library psql ...
  928. libpq-fe.h not found in [] and global paths.
  929. => source produced no result.
  930. Trying source 3 (type psqlEnv) of library psql ...
  931. => source failed condition '!config.win32'.
  932. test config.qtbase_sqldrivers.libraries.psql FAILED
  933. looking for library sqlite2
  934. Trying source 0 (type inline) of library sqlite2 ...
  935. sqlite.h not found in [] and global paths.
  936. => source produced no result.
  937. test config.qtbase_sqldrivers.libraries.sqlite2 FAILED
  938. looking for library tds
  939. Trying source 0 (type sybaseEnv) of library tds ...
  940. + cd /d C:\qt-everywhere-src-5.15.1\config.tests\tds && C:\qt-everywhere-src-5.15.1\qtbase\bin\qmake.exe "CONFIG -= qt debug_and_release app_bundle lib_bundle" "CONFIG += static warn_off console single_arch" "QMAKE_LIBDIR += C:\\Qt\\OpenSSL\\OpenSSL-1.1.1\\static\\x64\\Release\\lib" "INCLUDEPATH += C:\\Qt\\OpenSSL\\OpenSSL-1.1.1\\static\\x64\\Release\\include" "QMAKE_USE += tds" "QMAKE_LIBS_TDS = -lNTWDBLIB" C:/qt-everywhere-src-5.15.1/config.tests/tds
  941. + cd /d C:\qt-everywhere-src-5.15.1\config.tests\tds && set MAKEFLAGS=& nmake
  942. > Microsoft (R) Program Maintenance Utility Version 14.16.27045.0
  943. > Copyright (C) Microsoft Corporation. All rights reserved.
  944. > cl -c -nologo -Zc:wchar_t -FS -Zc:rvalueCast -Zc:inline -Zc:strictStrings -Zc:throwingNew -Zc:referenceBinding -Zc:__cplusplus -O2 -MT -W0 -EHsc -DUNICODE -D_UNICODE -DWIN32 -D_ENABLE_EXTENDED_ALIGNED_STORAGE -DWIN64 -DNDEBUG -I. -IC:\Qt\OpenSSL\OpenSSL-1.1.1\static\x64\Release\include -IC:\qt-everywhere-src-5.15.1\qtbase\mkspecs\win32-msvc -Fo @C:\Users\MyUser\AppData\Local\Temp\nmB2B.tmp
  945. > main.cpp
  946. > .\main.cpp(2): fatal error C1083: Cannot open include file: 'sybfront.h': No such file or directory
  947. > NMAKE : fatal error U1077: '"C:\Program Files (x86)\Microsoft Visual Studio\2017\Professional\VC\Tools\MSVC\14.16.27023\bin\HostX64\x64\cl.EXE"' : return code '0x2'
  948. > Stop.
  949. => source failed verification.
  950. Trying source 1 (type sybaseEnv) of library tds ...
  951. => source failed condition '!config.win32'.
  952. test config.qtbase_sqldrivers.libraries.tds FAILED
  953. executing config test ntddmodm
  954. + cd /d C:\qt-everywhere-src-5.15.1\config.tests\ntddmodm && C:\qt-everywhere-src-5.15.1\qtbase\bin\qmake.exe "CONFIG -= qt debug_and_release app_bundle lib_bundle" "CONFIG += static warn_off console single_arch" "QMAKE_LIBDIR += C:\\Qt\\OpenSSL\\OpenSSL-1.1.1\\static\\x64\\Release\\lib" "INCLUDEPATH += C:\\Qt\\OpenSSL\\OpenSSL-1.1.1\\static\\x64\\Release\\include" C:/qt-everywhere-src-5.15.1/config.tests/ntddmodm
  955. + cd /d C:\qt-everywhere-src-5.15.1\config.tests\ntddmodm && set MAKEFLAGS=& nmake
  956. > Microsoft (R) Program Maintenance Utility Version 14.16.27045.0
  957. > Copyright (C) Microsoft Corporation. All rights reserved.
  958. > cl -c -nologo -Zc:wchar_t -FS -Zc:rvalueCast -Zc:inline -Zc:strictStrings -Zc:throwingNew -Zc:referenceBinding -Zc:__cplusplus -O2 -MT -W0 -EHsc -DUNICODE -D_UNICODE -DWIN32 -D_ENABLE_EXTENDED_ALIGNED_STORAGE -DWIN64 -DNDEBUG -I. -IC:\Qt\OpenSSL\OpenSSL-1.1.1\static\x64\Release\include -IC:\qt-everywhere-src-5.15.1\qtbase\mkspecs\win32-msvc -Fo @C:\Users\MyUser\AppData\Local\Temp\nmB99.tmp
  959. > main.cpp
  960. > link /NOLOGO /DYNAMICBASE /NXCOMPAT /OPT:REF /INCREMENTAL:NO /SUBSYSTEM:CONSOLE "/MANIFESTDEPENDENCY:type='win32' name='Microsoft.Windows.Common-Controls' version='6.0.0.0' publicKeyToken='6595b64144ccf1df' language='*' processorArchitecture='*'" /MANIFEST:embed /OUT:ntddmodm.exe @C:\Users\MyUser\AppData\Local\Temp\nmCB3.tmp
  961. test config.qtserialport_serialport.tests.ntddmodm succeeded
  962. Trying source 0 (type pkgConfig) of library jasper ...
  963. pkg-config use disabled globally.
  964. => source produced no result.
  965. Trying source 1 (type inline) of library jasper ...
  966. jasper/jasper.h not found in [] and global paths.
  967. => source produced no result.
  968. Trying source 0 (type pkgConfig) of library mng ...
  969. pkg-config use disabled globally.
  970. => source produced no result.
  971. Trying source 1 (type inline) of library mng ...
  972. libmng.h not found in [] and global paths.
  973. => source produced no result.
  974. Trying source 0 (type pkgConfig) of library tiff ...
  975. pkg-config use disabled globally.
  976. => source produced no result.
  977. Trying source 1 (type inline) of library tiff ...
  978. tiffio.h not found in [] and global paths.
  979. => source produced no result.
  980. Trying source 0 (type pkgConfig) of library webp ...
  981. pkg-config use disabled globally.
  982. => source produced no result.
  983. Trying source 1 (type inline) of library webp ...
  984. webp/decode.h not found in [] and global paths.
  985. webp/encode.h not found in [] and global paths.
  986. webp/demux.h not found in [] and global paths.
  987. webp/mux.h not found in [] and global paths.
  988. => source produced no result.
  989. executing config test pointer_64bit
  990. + cd /d C:\qt-everywhere-src-5.15.1\config.tests\pointer_64bit && C:\qt-everywhere-src-5.15.1\qtbase\bin\qmake.exe "CONFIG -= qt debug_and_release app_bundle lib_bundle" "CONFIG += static warn_off console single_arch" "QMAKE_LIBDIR += C:\\Qt\\OpenSSL\\OpenSSL-1.1.1\\static\\x64\\Release\\lib" "INCLUDEPATH += C:\\Qt\\OpenSSL\\OpenSSL-1.1.1\\static\\x64\\Release\\include" C:/qt-everywhere-src-5.15.1/config.tests/pointer_64bit
  991. + cd /d C:\qt-everywhere-src-5.15.1\config.tests\pointer_64bit && set MAKEFLAGS=& nmake
  992. > Microsoft (R) Program Maintenance Utility Version 14.16.27045.0
  993. > Copyright (C) Microsoft Corporation. All rights reserved.
  994. > cl -c -nologo -Zc:wchar_t -FS -Zc:rvalueCast -Zc:inline -Zc:strictStrings -Zc:throwingNew -Zc:referenceBinding -Zc:__cplusplus -O2 -MT -W0 -EHsc -DUNICODE -D_UNICODE -DWIN32 -D_ENABLE_EXTENDED_ALIGNED_STORAGE -DWIN64 -DNDEBUG -I. -IC:\Qt\OpenSSL\OpenSSL-1.1.1\static\x64\Release\include -IC:\qt-everywhere-src-5.15.1\qtbase\mkspecs\win32-msvc -Fo @C:\Users\MyUser\AppData\Local\Temp\nmD4E.tmp
  995. > main.cpp
  996. > link /NOLOGO /DYNAMICBASE /NXCOMPAT /OPT:REF /INCREMENTAL:NO /SUBSYSTEM:CONSOLE "/MANIFESTDEPENDENCY:type='win32' name='Microsoft.Windows.Common-Controls' version='6.0.0.0' publicKeyToken='6595b64144ccf1df' language='*' processorArchitecture='*'" /MANIFEST:embed /OUT:pointer_64bit.exe @C:\Users\MyUser\AppData\Local\Temp\nmD6E.tmp
  997. test config.qtdeclarative_qml.tests.pointer_64bit succeeded
  998. executing config test qml-python
  999. test config.qtdeclarative_qml.tests.qml-python gave result C:\Users\MyUser\AppData\Local\Programs\Python\Python38\\python.exe
  1000. looking for library quick3d-assimp
  1001. Trying source 0 (type pkgConfig) of library quick3d-assimp ...
  1002. pkg-config use disabled globally.
  1003. => source produced no result.
  1004. Trying source 1 (type inline) of library quick3d-assimp ...
  1005. + cd /d C:\qt-everywhere-src-5.15.1\config.tests\assimp && C:\qt-everywhere-src-5.15.1\qtbase\bin\qmake.exe "CONFIG -= qt debug_and_release app_bundle lib_bundle" "CONFIG += static warn_off console single_arch" "QMAKE_LIBDIR += C:\\Qt\\OpenSSL\\OpenSSL-1.1.1\\static\\x64\\Release\\lib" "INCLUDEPATH += C:\\Qt\\OpenSSL\\OpenSSL-1.1.1\\static\\x64\\Release\\include" "QMAKE_USE += quick3d-assimp" "QMAKE_LIBS_QUICK3D_ASSIMP = -lassimp" C:/qt-everywhere-src-5.15.1/qtquick3d/config.tests/assimp
  1006. + cd /d C:\qt-everywhere-src-5.15.1\config.tests\assimp && set MAKEFLAGS=& nmake
  1007. > Microsoft (R) Program Maintenance Utility Version 14.16.27045.0
  1008. > Copyright (C) Microsoft Corporation. All rights reserved.
  1009. > cl -c -nologo -Zc:wchar_t -FS -Zc:rvalueCast -Zc:inline -Zc:strictStrings -Zc:throwingNew -Zc:referenceBinding -Zc:__cplusplus -O2 -MT -W0 -EHsc -DUNICODE -D_UNICODE -DWIN32 -D_ENABLE_EXTENDED_ALIGNED_STORAGE -DWIN64 -DNDEBUG -IC:\qt-everywhere-src-5.15.1\qtquick3d\config.tests\assimp -I. -IC:\Qt\OpenSSL\OpenSSL-1.1.1\static\x64\Release\include -IC:\qt-everywhere-src-5.15.1\qtbase\mkspecs\win32-msvc -Fo @C:\Users\MyUser\AppData\Local\Temp\nmE0A.tmp
  1010. > main.cpp
  1011. > C:\qt-everywhere-src-5.15.1\qtquick3d\config.tests\assimp\main.cpp(29): fatal error C1083: Cannot open include file: 'assimp/cimport.h': No such file or directory
  1012. > NMAKE : fatal error U1077: '"C:\Program Files (x86)\Microsoft Visual Studio\2017\Professional\VC\Tools\MSVC\14.16.27023\bin\HostX64\x64\cl.EXE"' : return code '0x2'
  1013. > Stop.
  1014. => source failed verification.
  1015. test config.qtquick3d_assetimporters.libraries.quick3d-assimp FAILED
  1016. looking for library sdl2
  1017. Trying source 0 (type pkgConfig) of library sdl2 ...
  1018. pkg-config use disabled globally.
  1019. => source produced no result.
  1020. Trying source 1 (type inline) of library sdl2 ...
  1021. => source failed condition 'config.darwin'.
  1022. Trying source 2 (type inline) of library sdl2 ...
  1023. + cd /d C:\qt-everywhere-src-5.15.1\config.tests\sdl && C:\qt-everywhere-src-5.15.1\qtbase\bin\qmake.exe "CONFIG -= qt debug_and_release app_bundle lib_bundle" "CONFIG += static warn_off console single_arch" "QMAKE_LIBDIR += C:\\Qt\\OpenSSL\\OpenSSL-1.1.1\\static\\x64\\Release\\lib" "INCLUDEPATH += C:\\Qt\\OpenSSL\\OpenSSL-1.1.1\\static\\x64\\Release\\include" "QMAKE_USE += sdl2" "QMAKE_LIBS_SDL2 = -lSDL2 -lSDL2main" C:/qt-everywhere-src-5.15.1/qtgamepad/config.tests/sdl
  1024. + cd /d C:\qt-everywhere-src-5.15.1\config.tests\sdl && set MAKEFLAGS=& nmake
  1025. > Microsoft (R) Program Maintenance Utility Version 14.16.27045.0
  1026. > Copyright (C) Microsoft Corporation. All rights reserved.
  1027. > cl -c -nologo -Zc:wchar_t -FS -Zc:rvalueCast -Zc:inline -Zc:strictStrings -Zc:throwingNew -Zc:referenceBinding -Zc:__cplusplus -O2 -MT -W0 -EHsc -DUNICODE -D_UNICODE -DWIN32 -D_ENABLE_EXTENDED_ALIGNED_STORAGE -DWIN64 -DNDEBUG -IC:\qt-everywhere-src-5.15.1\qtgamepad\config.tests\sdl -I. -IC:\Qt\OpenSSL\OpenSSL-1.1.1\static\x64\Release\include -IC:\qt-everywhere-src-5.15.1\qtbase\mkspecs\win32-msvc -Fo @C:\Users\MyUser\AppData\Local\Temp\nmE67.tmp
  1028. > main.cpp
  1029. > C:\qt-everywhere-src-5.15.1\qtgamepad\config.tests\sdl\main.cpp(37): fatal error C1083: Cannot open include file: 'SDL.h': No such file or directory
  1030. > NMAKE : fatal error U1077: '"C:\Program Files (x86)\Microsoft Visual Studio\2017\Professional\VC\Tools\MSVC\14.16.27023\bin\HostX64\x64\cl.EXE"' : return code '0x2'
  1031. > Stop.
  1032. => source failed verification.
  1033. Trying source 3 (type inline) of library sdl2 ...
  1034. => source failed condition 'config.unix && !config.darwin'.
  1035. test config.qtgamepad_gamepad.libraries.sdl2 FAILED
  1036. looking for library assimp
  1037. Trying source 0 (type pkgConfig) of library assimp ...
  1038. pkg-config use disabled globally.
  1039. => source produced no result.
  1040. Trying source 1 (type inline) of library assimp ...
  1041. + cd /d C:\qt-everywhere-src-5.15.1\config.tests\assimp && C:\qt-everywhere-src-5.15.1\qtbase\bin\qmake.exe "CONFIG -= qt debug_and_release app_bundle lib_bundle" "CONFIG += static warn_off console single_arch" "QMAKE_LIBDIR += C:\\Qt\\OpenSSL\\OpenSSL-1.1.1\\static\\x64\\Release\\lib" "INCLUDEPATH += C:\\Qt\\OpenSSL\\OpenSSL-1.1.1\\static\\x64\\Release\\include" "QMAKE_USE += assimp" "QMAKE_LIBS_ASSIMP = -lassimp" C:/qt-everywhere-src-5.15.1/qt3d/config.tests/assimp
  1042. + cd /d C:\qt-everywhere-src-5.15.1\config.tests\assimp && set MAKEFLAGS=& nmake clean && set MAKEFLAGS=& nmake
  1043. > Microsoft (R) Program Maintenance Utility Version 14.16.27045.0
  1044. > Copyright (C) Microsoft Corporation. All rights reserved.
  1045. > del main.obj
  1046. > Could Not Find C:\qt-everywhere-src-5.15.1\config.tests\assimp\main.obj
  1047. > Microsoft (R) Program Maintenance Utility Version 14.16.27045.0
  1048. > Copyright (C) Microsoft Corporation. All rights reserved.
  1049. > cl -c -nologo -Zc:wchar_t -FS -Zc:rvalueCast -Zc:inline -Zc:strictStrings -Zc:throwingNew -Zc:referenceBinding -Zc:__cplusplus -O2 -MT -W0 -EHsc -DUNICODE -D_UNICODE -DWIN32 -D_ENABLE_EXTENDED_ALIGNED_STORAGE -DWIN64 -DNDEBUG -IC:\qt-everywhere-src-5.15.1\qt3d\config.tests\assimp -I. -IC:\Qt\OpenSSL\OpenSSL-1.1.1\static\x64\Release\include -IC:\qt-everywhere-src-5.15.1\qtbase\mkspecs\win32-msvc -Fo @C:\Users\MyUser\AppData\Local\Temp\nmEE4.tmp
  1050. > main.cpp
  1051. > C:\qt-everywhere-src-5.15.1\qt3d\config.tests\assimp\main.cpp(29): fatal error C1083: Cannot open include file: 'assimp/cimport.h': No such file or directory
  1052. > NMAKE : fatal error U1077: '"C:\Program Files (x86)\Microsoft Visual Studio\2017\Professional\VC\Tools\MSVC\14.16.27023\bin\HostX64\x64\cl.EXE"' : return code '0x2'
  1053. > Stop.
  1054. => source failed verification.
  1055. test config.qt3d_core.libraries.assimp FAILED
  1056. looking for library fbx
  1057. Trying source 0 (type fbx) of library fbx ...
  1058. + cd /d C:\qt-everywhere-src-5.15.1\config.tests\fbx && C:\qt-everywhere-src-5.15.1\qtbase\bin\qmake.exe "CONFIG -= qt debug_and_release app_bundle lib_bundle" "CONFIG += static warn_off console single_arch" "QMAKE_LIBDIR += C:\\Qt\\OpenSSL\\OpenSSL-1.1.1\\static\\x64\\Release\\lib" "INCLUDEPATH += C:\\Qt\\OpenSSL\\OpenSSL-1.1.1\\static\\x64\\Release\\include" "QMAKE_USE += fbx" "QMAKE_LIBS_FBX = -lfbxsdk" C:/qt-everywhere-src-5.15.1/qt3d/config.tests/fbx
  1059. + cd /d C:\qt-everywhere-src-5.15.1\config.tests\fbx && set MAKEFLAGS=& nmake
  1060. > Microsoft (R) Program Maintenance Utility Version 14.16.27045.0
  1061. > Copyright (C) Microsoft Corporation. All rights reserved.
  1062. > cl -c -nologo -Zc:wchar_t -FS -Zc:rvalueCast -Zc:inline -Zc:strictStrings -Zc:throwingNew -Zc:referenceBinding -Zc:__cplusplus -O2 -MT -W0 -EHsc -DUNICODE -D_UNICODE -DWIN32 -D_ENABLE_EXTENDED_ALIGNED_STORAGE -DWIN64 -DNDEBUG -IC:\qt-everywhere-src-5.15.1\qt3d\config.tests\fbx -I. -IC:\Qt\OpenSSL\OpenSSL-1.1.1\static\x64\Release\include -IC:\qt-everywhere-src-5.15.1\qtbase\mkspecs\win32-msvc -Fo @C:\Users\MyUser\AppData\Local\Temp\nmF42.tmp
  1063. > main.cpp
  1064. > C:\qt-everywhere-src-5.15.1\qt3d\config.tests\fbx\main.cpp(29): fatal error C1083: Cannot open include file: 'fbxsdk.h': No such file or directory
  1065. > NMAKE : fatal error U1077: '"C:\Program Files (x86)\Microsoft Visual Studio\2017\Professional\VC\Tools\MSVC\14.16.27023\bin\HostX64\x64\cl.EXE"' : return code '0x2'
  1066. > Stop.
  1067. => source failed verification.
  1068. test config.qt3d_geometryloaders.libraries.fbx FAILED
  1069. looking for library wayland-egl
  1070. Trying source 0 (type pkgConfig) of library wayland-egl ...
  1071. pkg-config use disabled globally.
  1072. => source produced no result.
  1073. Trying source 1 (type inline) of library wayland-egl ...
  1074. wayland-egl.h not found in [] and global paths.
  1075. => source produced no result.
  1076. Trying source 2 (type inline) of library wayland-egl ...
  1077. wayland-egl.h not found in [] and global paths.
  1078. => source produced no result.
  1079. test config.qtwayland_client.libraries.wayland-egl FAILED
  1080. looking for library bluez
  1081. Trying source 0 (type pkgConfig) of library bluez ...
  1082. pkg-config use disabled globally.
  1083. => source produced no result.
  1084. Trying source 1 (type inline) of library bluez ...
  1085. + cd /d C:\qt-everywhere-src-5.15.1\config.tests\bluez && C:\qt-everywhere-src-5.15.1\qtbase\bin\qmake.exe "CONFIG -= qt debug_and_release app_bundle lib_bundle" "CONFIG += static warn_off console single_arch" "QMAKE_LIBDIR += C:\\Qt\\OpenSSL\\OpenSSL-1.1.1\\static\\x64\\Release\\lib" "INCLUDEPATH += C:\\Qt\\OpenSSL\\OpenSSL-1.1.1\\static\\x64\\Release\\include" "QMAKE_USE += bluez" "QMAKE_LIBS_BLUEZ = -lbluetooth" C:/qt-everywhere-src-5.15.1/qtconnectivity/config.tests/bluez
  1086. + cd /d C:\qt-everywhere-src-5.15.1\config.tests\bluez && set MAKEFLAGS=& nmake
  1087. > Microsoft (R) Program Maintenance Utility Version 14.16.27045.0
  1088. > Copyright (C) Microsoft Corporation. All rights reserved.
  1089. > cl -c -nologo -Zc:wchar_t -FS -Zc:rvalueCast -Zc:inline -Zc:strictStrings -Zc:throwingNew -Zc:referenceBinding -Zc:__cplusplus -fpermissive -O2 -MT -W0 -EHsc -DUNICODE -D_UNICODE -DWIN32 -D_ENABLE_EXTENDED_ALIGNED_STORAGE -DWIN64 -DNDEBUG -IC:\qt-everywhere-src-5.15.1\qtconnectivity\config.tests\bluez -I. -IC:\Qt\OpenSSL\OpenSSL-1.1.1\static\x64\Release\include -IC:\qt-everywhere-src-5.15.1\qtbase\mkspecs\win32-msvc -Fo @C:\Users\MyUser\AppData\Local\Temp\nmFB0.tmp
  1090. > cl : Command line warning D9002 : ignoring unknown option '-fpermissive'
  1091. > main.cpp
  1092. > C:\qt-everywhere-src-5.15.1\qtconnectivity\config.tests\bluez\main.cpp(29): fatal error C1083: Cannot open include file: 'bluetooth/bluetooth.h': No such file or directory
  1093. > NMAKE : fatal error U1077: '"C:\Program Files (x86)\Microsoft Visual Studio\2017\Professional\VC\Tools\MSVC\14.16.27023\bin\HostX64\x64\cl.EXE"' : return code '0x2'
  1094. > Stop.
  1095. => source failed verification.
  1096. test config.qtconnectivity_bluetooth.libraries.bluez FAILED
  1097. executing config test winrt_bt
  1098. + cd /d C:\qt-everywhere-src-5.15.1\config.tests\winrt_bt && C:\qt-everywhere-src-5.15.1\qtbase\bin\qmake.exe "CONFIG -= qt debug_and_release app_bundle lib_bundle" "CONFIG += static warn_off console single_arch" "QMAKE_LIBDIR += C:\\Qt\\OpenSSL\\OpenSSL-1.1.1\\static\\x64\\Release\\lib" "INCLUDEPATH += C:\\Qt\\OpenSSL\\OpenSSL-1.1.1\\static\\x64\\Release\\include" C:/qt-everywhere-src-5.15.1/qtconnectivity/config.tests/winrt_bt
  1099. + cd /d C:\qt-everywhere-src-5.15.1\config.tests\winrt_bt && set MAKEFLAGS=& nmake
  1100. > Microsoft (R) Program Maintenance Utility Version 14.16.27045.0
  1101. > Copyright (C) Microsoft Corporation. All rights reserved.
  1102. > cl -c -nologo -Zc:wchar_t -FS -Zc:rvalueCast -Zc:inline -Zc:strictStrings -Zc:throwingNew -Zc:referenceBinding -Zc:__cplusplus -O2 -MT -W0 -EHsc -DUNICODE -D_UNICODE -DWIN32 -D_ENABLE_EXTENDED_ALIGNED_STORAGE -DWIN64 -DNDEBUG -IC:\qt-everywhere-src-5.15.1\qtconnectivity\config.tests\winrt_bt -I. -IC:\Qt\OpenSSL\OpenSSL-1.1.1\static\x64\Release\include -IC:\qt-everywhere-src-5.15.1\qtbase\mkspecs\win32-msvc -Fo @C:\Users\MyUser\AppData\Local\Temp\nm100D.tmp
  1103. > main.cpp
  1104. > link /NOLOGO /DYNAMICBASE /NXCOMPAT /OPT:REF /INCREMENTAL:NO /SUBSYSTEM:CONSOLE "/MANIFESTDEPENDENCY:type='win32' name='Microsoft.Windows.Common-Controls' version='6.0.0.0' publicKeyToken='6595b64144ccf1df' language='*' processorArchitecture='*'" /MANIFEST:embed /OUT:winrt.exe @C:\Users\MyUser\AppData\Local\Temp\nm1742.tmp
  1105. test config.qtconnectivity_bluetooth.tests.winrt_bt succeeded
  1106. executing config test winrt_btle_no_pairing
  1107. + cd /d C:\qt-everywhere-src-5.15.1\config.tests\winrt_btle_no_pairing && C:\qt-everywhere-src-5.15.1\qtbase\bin\qmake.exe "CONFIG -= qt debug_and_release app_bundle lib_bundle" "CONFIG += static warn_off console single_arch" "QMAKE_LIBDIR += C:\\Qt\\OpenSSL\\OpenSSL-1.1.1\\static\\x64\\Release\\lib" "INCLUDEPATH += C:\\Qt\\OpenSSL\\OpenSSL-1.1.1\\static\\x64\\Release\\include" C:/qt-everywhere-src-5.15.1/qtconnectivity/config.tests/winrt_btle_no_pairing
  1108. + cd /d C:\qt-everywhere-src-5.15.1\config.tests\winrt_btle_no_pairing && set MAKEFLAGS=& nmake
  1109. > Microsoft (R) Program Maintenance Utility Version 14.16.27045.0
  1110. > Copyright (C) Microsoft Corporation. All rights reserved.
  1111. > cl -c -nologo -Zc:wchar_t -FS -Zc:rvalueCast -Zc:inline -Zc:strictStrings -Zc:throwingNew -Zc:referenceBinding -Zc:__cplusplus -O2 -MT -W0 -EHsc -DUNICODE -D_UNICODE -DWIN32 -D_ENABLE_EXTENDED_ALIGNED_STORAGE -DWIN64 -DNDEBUG -IC:\qt-everywhere-src-5.15.1\qtconnectivity\config.tests\winrt_btle_no_pairing -I. -IC:\Qt\OpenSSL\OpenSSL-1.1.1\static\x64\Release\include -IC:\qt-everywhere-src-5.15.1\qtbase\mkspecs\win32-msvc -Fo @C:\Users\MyUser\AppData\Local\Temp\nm17DD.tmp
  1112. > main.cpp
  1113. > link /NOLOGO /DYNAMICBASE /NXCOMPAT /OPT:REF /INCREMENTAL:NO /SUBSYSTEM:CONSOLE "/MANIFESTDEPENDENCY:type='win32' name='Microsoft.Windows.Common-Controls' version='6.0.0.0' publicKeyToken='6595b64144ccf1df' language='*' processorArchitecture='*'" /MANIFEST:embed /OUT:winrt.exe @C:\Users\MyUser\AppData\Local\Temp\nm1F02.tmp
  1114. test config.qtconnectivity_bluetooth.tests.winrt_btle_no_pairing succeeded
  1115. looking for library sensorfw
  1116. Trying source 0 (type pkgConfig) of library sensorfw ...
  1117. pkg-config use disabled globally.
  1118. => source produced no result.
  1119. test config.qtsensors_sensors.libraries.sensorfw FAILED
  1120. looking for library gypsy
  1121. Trying source 0 (type pkgConfig) of library gypsy ...
  1122. pkg-config use disabled globally.
  1123. => source produced no result.
  1124. test config.qtlocation_positioning.libraries.gypsy FAILED
  1125. executing config test winrt_geolocation
  1126. + cd /d C:\qt-everywhere-src-5.15.1\config.tests\winrt && C:\qt-everywhere-src-5.15.1\qtbase\bin\qmake.exe "CONFIG -= qt debug_and_release app_bundle lib_bundle" "CONFIG += static warn_off console single_arch" "QMAKE_LIBDIR += C:\\Qt\\OpenSSL\\OpenSSL-1.1.1\\static\\x64\\Release\\lib" "INCLUDEPATH += C:\\Qt\\OpenSSL\\OpenSSL-1.1.1\\static\\x64\\Release\\include" C:/qt-everywhere-src-5.15.1/qtlocation/config.tests/winrt
  1127. + cd /d C:\qt-everywhere-src-5.15.1\config.tests\winrt && set MAKEFLAGS=& nmake
  1128. > Microsoft (R) Program Maintenance Utility Version 14.16.27045.0
  1129. > Copyright (C) Microsoft Corporation. All rights reserved.
  1130. > cl -c -nologo -Zc:wchar_t -FS -Zc:rvalueCast -Zc:inline -Zc:strictStrings -Zc:throwingNew -Zc:referenceBinding -Zc:__cplusplus -O2 -MT -W0 -EHsc -DUNICODE -D_UNICODE -DWIN32 -D_ENABLE_EXTENDED_ALIGNED_STORAGE -DWIN64 -DNDEBUG -IC:\qt-everywhere-src-5.15.1\qtlocation\config.tests\winrt -I. -IC:\Qt\OpenSSL\OpenSSL-1.1.1\static\x64\Release\include -IC:\qt-everywhere-src-5.15.1\qtbase\mkspecs\win32-msvc -Fo @C:\Users\MyUser\AppData\Local\Temp\nm1F9E.tmp
  1131. > main.cpp
  1132. > link /NOLOGO /DYNAMICBASE /NXCOMPAT /OPT:REF /INCREMENTAL:NO /SUBSYSTEM:CONSOLE "/MANIFESTDEPENDENCY:type='win32' name='Microsoft.Windows.Common-Controls' version='6.0.0.0' publicKeyToken='6595b64144ccf1df' language='*' processorArchitecture='*'" /MANIFEST:embed /OUT:winrt.exe @C:\Users\MyUser\AppData\Local\Temp\nm2721.tmp
  1133. test config.qtlocation_positioning.tests.winrt_geolocation succeeded
  1134. looking for library directshow
  1135. Trying source 0 (type inline) of library directshow ...
  1136. + cd /d C:\qt-everywhere-src-5.15.1\config.tests\directshow && C:\qt-everywhere-src-5.15.1\qtbase\bin\qmake.exe "CONFIG -= qt debug_and_release app_bundle lib_bundle" "CONFIG += static warn_off console single_arch" "QMAKE_LIBDIR += C:\\Qt\\OpenSSL\\OpenSSL-1.1.1\\static\\x64\\Release\\lib" "INCLUDEPATH += C:\\Qt\\OpenSSL\\OpenSSL-1.1.1\\static\\x64\\Release\\include" "QMAKE_USE += directshow" "QMAKE_LIBS_DIRECTSHOW = -lstrmiids -ldmoguids -luuid -lmsdmo -lole32 -loleaut32" C:/qt-everywhere-src-5.15.1/qtmultimedia/config.tests/directshow
  1137. + cd /d C:\qt-everywhere-src-5.15.1\config.tests\directshow && set MAKEFLAGS=& nmake
  1138. > Microsoft (R) Program Maintenance Utility Version 14.16.27045.0
  1139. > Copyright (C) Microsoft Corporation. All rights reserved.
  1140. > cl -c -nologo -Zc:wchar_t -FS -Zc:rvalueCast -Zc:inline -Zc:strictStrings -Zc:throwingNew -Zc:referenceBinding -Zc:__cplusplus -O2 -MT -W0 -EHsc -DUNICODE -D_UNICODE -DWIN32 -D_ENABLE_EXTENDED_ALIGNED_STORAGE -DWIN64 -DNDEBUG -IC:\qt-everywhere-src-5.15.1\qtmultimedia\config.tests\directshow -I. -IC:\Qt\OpenSSL\OpenSSL-1.1.1\static\x64\Release\include -IC:\qt-everywhere-src-5.15.1\qtbase\mkspecs\win32-msvc -Fo @C:\Users\MyUser\AppData\Local\Temp\nm27AC.tmp
  1141. > main.cpp
  1142. > link /NOLOGO /DYNAMICBASE /NXCOMPAT /OPT:REF /INCREMENTAL:NO /SUBSYSTEM:CONSOLE "/MANIFESTDEPENDENCY:type='win32' name='Microsoft.Windows.Common-Controls' version='6.0.0.0' publicKeyToken='6595b64144ccf1df' language='*' processorArchitecture='*'" /MANIFEST:embed /OUT:directshow.exe @C:\Users\MyUser\AppData\Local\Temp\nm2915.tmp
  1143. => source accepted.
  1144. test config.qtmultimedia_multimedia.libraries.directshow succeeded
  1145. executing config test evr
  1146. + cd /d C:\qt-everywhere-src-5.15.1\config.tests\evr && C:\qt-everywhere-src-5.15.1\qtbase\bin\qmake.exe "CONFIG -= qt debug_and_release app_bundle lib_bundle" "CONFIG += static warn_off console single_arch" "QMAKE_LIBDIR += C:\\Qt\\OpenSSL\\OpenSSL-1.1.1\\static\\x64\\Release\\lib" "INCLUDEPATH += C:\\Qt\\OpenSSL\\OpenSSL-1.1.1\\static\\x64\\Release\\include" C:/qt-everywhere-src-5.15.1/qtmultimedia/config.tests/evr
  1147. + cd /d C:\qt-everywhere-src-5.15.1\config.tests\evr && set MAKEFLAGS=& nmake
  1148. > Microsoft (R) Program Maintenance Utility Version 14.16.27045.0
  1149. > Copyright (C) Microsoft Corporation. All rights reserved.
  1150. > cl -c -nologo -Zc:wchar_t -FS -Zc:rvalueCast -Zc:inline -Zc:strictStrings -Zc:throwingNew -Zc:referenceBinding -Zc:__cplusplus -O2 -MT -W0 -EHsc -DUNICODE -D_UNICODE -DWIN32 -D_ENABLE_EXTENDED_ALIGNED_STORAGE -DWIN64 -DNDEBUG -IC:\qt-everywhere-src-5.15.1\qtmultimedia\config.tests\evr -I. -IC:\Qt\OpenSSL\OpenSSL-1.1.1\static\x64\Release\include -IC:\qt-everywhere-src-5.15.1\qtbase\mkspecs\win32-msvc -Fo @C:\Users\MyUser\AppData\Local\Temp\nm29A0.tmp
  1151. > main.cpp
  1152. > link /NOLOGO /DYNAMICBASE /NXCOMPAT /OPT:REF /INCREMENTAL:NO /SUBSYSTEM:CONSOLE "/MANIFESTDEPENDENCY:type='win32' name='Microsoft.Windows.Common-Controls' version='6.0.0.0' publicKeyToken='6595b64144ccf1df' language='*' processorArchitecture='*'" /MANIFEST:embed /OUT:evr.exe @C:\Users\MyUser\AppData\Local\Temp\nm2B18.tmp
  1153. test config.qtmultimedia_multimedia.tests.evr succeeded
  1154. looking for library gstreamer_1_0
  1155. Trying source 0 (type pkgConfig) of library gstreamer_1_0 ...
  1156. pkg-config use disabled globally.
  1157. => source produced no result.
  1158. Trying source 1 (type inline) of library gstreamer_1_0 ...
  1159. + cd /d C:\qt-everywhere-src-5.15.1\config.tests\gstreamer && C:\qt-everywhere-src-5.15.1\qtbase\bin\qmake.exe "CONFIG -= qt debug_and_release app_bundle lib_bundle" "CONFIG += static warn_off console single_arch" "QMAKE_LIBDIR += C:\\Qt\\OpenSSL\\OpenSSL-1.1.1\\static\\x64\\Release\\lib" "INCLUDEPATH += C:\\Qt\\OpenSSL\\OpenSSL-1.1.1\\static\\x64\\Release\\include" "QMAKE_USE += gstreamer_1_0" "QMAKE_LIBS_GSTREAMER_1_0 = -lgstreamer-1.0 -lgstbase-1.0 -lgstaudio-1.0 -lgstvideo-1.0 -lgstpbutils-1.0 -lglib-2.0 -lgobject-2.0" C:/qt-everywhere-src-5.15.1/qtmultimedia/config.tests/gstreamer
  1160. + cd /d C:\qt-everywhere-src-5.15.1\config.tests\gstreamer && set MAKEFLAGS=& nmake
  1161. > Microsoft (R) Program Maintenance Utility Version 14.16.27045.0
  1162. > Copyright (C) Microsoft Corporation. All rights reserved.
  1163. > cl -c -nologo -Zc:wchar_t -FS -Zc:rvalueCast -Zc:inline -Zc:strictStrings -Zc:throwingNew -Zc:referenceBinding -Zc:__cplusplus -O2 -MT -W0 -EHsc -DUNICODE -D_UNICODE -DWIN32 -D_ENABLE_EXTENDED_ALIGNED_STORAGE -DWIN64 -DNDEBUG -IC:\qt-everywhere-src-5.15.1\qtmultimedia\config.tests\gstreamer -I. -IC:\Qt\OpenSSL\OpenSSL-1.1.1\static\x64\Release\include -IC:\qt-everywhere-src-5.15.1\qtbase\mkspecs\win32-msvc -Fo @C:\Users\MyUser\AppData\Local\Temp\nm2BA4.tmp
  1164. > main.cpp
  1165. > C:\qt-everywhere-src-5.15.1\qtmultimedia\config.tests\gstreamer\main.cpp(31): fatal error C1083: Cannot open include file: 'gst/gst.h': No such file or directory
  1166. > NMAKE : fatal error U1077: '"C:\Program Files (x86)\Microsoft Visual Studio\2017\Professional\VC\Tools\MSVC\14.16.27023\bin\HostX64\x64\cl.EXE"' : return code '0x2'
  1167. > Stop.
  1168. => source failed verification.
  1169. Trying source 2 (type inline) of library gstreamer_1_0 ...
  1170. => source failed condition 'config.android && input.gstreamer != '''.
  1171. test config.qtmultimedia_multimedia.libraries.gstreamer_1_0 FAILED
  1172. looking for library gstreamer_0_10
  1173. Trying source 0 (type pkgConfig) of library gstreamer_0_10 ...
  1174. pkg-config use disabled globally.
  1175. => source produced no result.
  1176. test config.qtmultimedia_multimedia.libraries.gstreamer_0_10 FAILED
  1177. looking for library openal
  1178. Trying source 0 (type pkgConfig) of library openal ...
  1179. pkg-config use disabled globally.
  1180. => source produced no result.
  1181. Trying source 1 (type inline) of library openal ...
  1182. + cd /d C:\qt-everywhere-src-5.15.1\config.tests\openal && C:\qt-everywhere-src-5.15.1\qtbase\bin\qmake.exe "CONFIG -= qt debug_and_release app_bundle lib_bundle" "CONFIG += static warn_off console single_arch" "QMAKE_LIBDIR += C:\\Qt\\OpenSSL\\OpenSSL-1.1.1\\static\\x64\\Release\\lib" "INCLUDEPATH += C:\\Qt\\OpenSSL\\OpenSSL-1.1.1\\static\\x64\\Release\\include" "QMAKE_USE += openal" "QMAKE_LIBS_OPENAL = -lOpenAL32" C:/qt-everywhere-src-5.15.1/qtmultimedia/config.tests/openal
  1183. + cd /d C:\qt-everywhere-src-5.15.1\config.tests\openal && set MAKEFLAGS=& nmake
  1184. > Microsoft (R) Program Maintenance Utility Version 14.16.27045.0
  1185. > Copyright (C) Microsoft Corporation. All rights reserved.
  1186. > cl -c -nologo -Zc:wchar_t -FS -Zc:rvalueCast -Zc:inline -Zc:strictStrings -Zc:throwingNew -Zc:referenceBinding -Zc:__cplusplus -O2 -MT -W0 -EHsc -DUNICODE -D_UNICODE -DWIN32 -D_ENABLE_EXTENDED_ALIGNED_STORAGE -DWIN64 -DNDEBUG -IC:\qt-everywhere-src-5.15.1\qtmultimedia\config.tests\openal -I. -IC:\Qt\OpenSSL\OpenSSL-1.1.1\static\x64\Release\include -IC:\qt-everywhere-src-5.15.1\qtbase\mkspecs\win32-msvc -Fo @C:\Users\MyUser\AppData\Local\Temp\nm2C02.tmp
  1187. > main.cpp
  1188. > C:\qt-everywhere-src-5.15.1\qtmultimedia\config.tests\openal\main.cpp(32): fatal error C1083: Cannot open include file: 'AL/al.h': No such file or directory
  1189. > NMAKE : fatal error U1077: '"C:\Program Files (x86)\Microsoft Visual Studio\2017\Professional\VC\Tools\MSVC\14.16.27023\bin\HostX64\x64\cl.EXE"' : return code '0x2'
  1190. > Stop.
  1191. => source failed verification.
  1192. Trying source 2 (type inline) of library openal ...
  1193. => source failed condition 'config.darwin'.
  1194. Trying source 3 (type inline) of library openal ...
  1195. => source failed condition 'config.unix && !config.darwin'.
  1196. test config.qtmultimedia_multimedia.libraries.openal FAILED
  1197. looking for library libresourceqt5
  1198. Trying source 0 (type pkgConfig) of library libresourceqt5 ...
  1199. pkg-config use disabled globally.
  1200. => source produced no result.
  1201. test config.qtmultimedia_multimedia.libraries.libresourceqt5 FAILED
  1202. executing config test wasapi
  1203. + cd /d C:\qt-everywhere-src-5.15.1\config.tests\wasapi && C:\qt-everywhere-src-5.15.1\qtbase\bin\qmake.exe "CONFIG -= qt debug_and_release app_bundle lib_bundle" "CONFIG += static warn_off console single_arch" "QMAKE_LIBDIR += C:\\Qt\\OpenSSL\\OpenSSL-1.1.1\\static\\x64\\Release\\lib" "INCLUDEPATH += C:\\Qt\\OpenSSL\\OpenSSL-1.1.1\\static\\x64\\Release\\include" C:/qt-everywhere-src-5.15.1/qtmultimedia/config.tests/wasapi
  1204. + cd /d C:\qt-everywhere-src-5.15.1\config.tests\wasapi && set MAKEFLAGS=& nmake
  1205. > Microsoft (R) Program Maintenance Utility Version 14.16.27045.0
  1206. > Copyright (C) Microsoft Corporation. All rights reserved.
  1207. > cl -c -nologo -Zc:wchar_t -FS -Zc:rvalueCast -Zc:inline -Zc:strictStrings -Zc:throwingNew -Zc:referenceBinding -Zc:__cplusplus -O2 -MT -W0 -EHsc -DUNICODE -D_UNICODE -DWIN32 -D_ENABLE_EXTENDED_ALIGNED_STORAGE -DWIN64 -DNDEBUG -IC:\qt-everywhere-src-5.15.1\qtmultimedia\config.tests\wasapi -I. -IC:\Qt\OpenSSL\OpenSSL-1.1.1\static\x64\Release\include -IC:\qt-everywhere-src-5.15.1\qtbase\mkspecs\win32-msvc -Fo @C:\Users\MyUser\AppData\Local\Temp\nm2C5F.tmp
  1208. > main.cpp
  1209. > link /NOLOGO /DYNAMICBASE /NXCOMPAT /OPT:REF /INCREMENTAL:NO /SUBSYSTEM:CONSOLE "/MANIFESTDEPENDENCY:type='win32' name='Microsoft.Windows.Common-Controls' version='6.0.0.0' publicKeyToken='6595b64144ccf1df' language='*' processorArchitecture='*'" /MANIFEST:embed /OUT:wasapi.exe @C:\Users\MyUser\AppData\Local\Temp\nm33B3.tmp
  1210. test config.qtmultimedia_multimedia.tests.wasapi succeeded
  1211. looking for library wmf
  1212. Trying source 0 (type inline) of library wmf ...
  1213. + cd /d C:\qt-everywhere-src-5.15.1\config.tests\wmf && C:\qt-everywhere-src-5.15.1\qtbase\bin\qmake.exe "CONFIG -= qt debug_and_release app_bundle lib_bundle" "CONFIG += static warn_off console single_arch" "QMAKE_LIBDIR += C:\\Qt\\OpenSSL\\OpenSSL-1.1.1\\static\\x64\\Release\\lib" "INCLUDEPATH += C:\\Qt\\OpenSSL\\OpenSSL-1.1.1\\static\\x64\\Release\\include" "QMAKE_USE += wmf" "QMAKE_LIBS_WMF = -lstrmiids -ldmoguids -luuid -lmsdmo -lole32 -loleaut32 -lMf -lMfuuid -lMfplat -lPropsys" C:/qt-everywhere-src-5.15.1/qtmultimedia/config.tests/wmf
  1214. + cd /d C:\qt-everywhere-src-5.15.1\config.tests\wmf && set MAKEFLAGS=& nmake
  1215. > Microsoft (R) Program Maintenance Utility Version 14.16.27045.0
  1216. > Copyright (C) Microsoft Corporation. All rights reserved.
  1217. > cl -c -nologo -Zc:wchar_t -FS -Zc:rvalueCast -Zc:inline -Zc:strictStrings -Zc:throwingNew -Zc:referenceBinding -Zc:__cplusplus -O2 -MT -W0 -EHsc -DUNICODE -D_UNICODE -DWIN32 -D_ENABLE_EXTENDED_ALIGNED_STORAGE -DWIN64 -DNDEBUG -IC:\qt-everywhere-src-5.15.1\qtmultimedia\config.tests\wmf -I. -IC:\Qt\OpenSSL\OpenSSL-1.1.1\static\x64\Release\include -IC:\qt-everywhere-src-5.15.1\qtbase\mkspecs\win32-msvc -Fo @C:\Users\MyUser\AppData\Local\Temp\nm345E.tmp
  1218. > main.cpp
  1219. > link /NOLOGO /DYNAMICBASE /NXCOMPAT /OPT:REF /INCREMENTAL:NO /SUBSYSTEM:CONSOLE "/MANIFESTDEPENDENCY:type='win32' name='Microsoft.Windows.Common-Controls' version='6.0.0.0' publicKeyToken='6595b64144ccf1df' language='*' processorArchitecture='*'" /MANIFEST:embed /OUT:wmf.exe @C:\Users\MyUser\AppData\Local\Temp\nm35E6.tmp
  1220. => source accepted.
  1221. test config.qtmultimedia_multimedia.libraries.wmf succeeded
  1222. executing config test wmsdk
  1223. + cd /d C:\qt-everywhere-src-5.15.1\config.tests\wmsdk && C:\qt-everywhere-src-5.15.1\qtbase\bin\qmake.exe "CONFIG -= qt debug_and_release app_bundle lib_bundle" "CONFIG += static warn_off console single_arch" "QMAKE_LIBDIR += C:\\Qt\\OpenSSL\\OpenSSL-1.1.1\\static\\x64\\Release\\lib" "INCLUDEPATH += C:\\Qt\\OpenSSL\\OpenSSL-1.1.1\\static\\x64\\Release\\include" C:/qt-everywhere-src-5.15.1/qtmultimedia/config.tests/wmsdk
  1224. + cd /d C:\qt-everywhere-src-5.15.1\config.tests\wmsdk && set MAKEFLAGS=& nmake
  1225. > Microsoft (R) Program Maintenance Utility Version 14.16.27045.0
  1226. > Copyright (C) Microsoft Corporation. All rights reserved.
  1227. > cl -c -nologo -Zc:wchar_t -FS -Zc:rvalueCast -Zc:inline -Zc:strictStrings -Zc:throwingNew -Zc:referenceBinding -Zc:__cplusplus -O2 -MT -W0 -EHsc -DUNICODE -D_UNICODE -DWIN32 -D_ENABLE_EXTENDED_ALIGNED_STORAGE -DWIN64 -DNDEBUG -IC:\qt-everywhere-src-5.15.1\qtmultimedia\config.tests\wmsdk -I. -IC:\Qt\OpenSSL\OpenSSL-1.1.1\static\x64\Release\include -IC:\qt-everywhere-src-5.15.1\qtbase\mkspecs\win32-msvc -Fo @C:\Users\MyUser\AppData\Local\Temp\nm3671.tmp
  1228. > main.cpp
  1229. > link /NOLOGO /DYNAMICBASE /NXCOMPAT /OPT:REF /INCREMENTAL:NO /SUBSYSTEM:CONSOLE "/MANIFESTDEPENDENCY:type='win32' name='Microsoft.Windows.Common-Controls' version='6.0.0.0' publicKeyToken='6595b64144ccf1df' language='*' processorArchitecture='*'" /MANIFEST:embed /OUT:wmsdk.exe @C:\Users\MyUser\AppData\Local\Temp\nm37AB.tmp
  1230. test config.qtmultimedia_multimedia.tests.wmsdk succeeded
  1231. executing config test wshellitem
  1232. + cd /d C:\qt-everywhere-src-5.15.1\config.tests\wshellitem && C:\qt-everywhere-src-5.15.1\qtbase\bin\qmake.exe "CONFIG -= qt debug_and_release app_bundle lib_bundle" "CONFIG += static warn_off console single_arch" "QMAKE_LIBDIR += C:\\Qt\\OpenSSL\\OpenSSL-1.1.1\\static\\x64\\Release\\lib" "INCLUDEPATH += C:\\Qt\\OpenSSL\\OpenSSL-1.1.1\\static\\x64\\Release\\include" C:/qt-everywhere-src-5.15.1/qtmultimedia/config.tests/wshellitem
  1233. + cd /d C:\qt-everywhere-src-5.15.1\config.tests\wshellitem && set MAKEFLAGS=& nmake
  1234. > Microsoft (R) Program Maintenance Utility Version 14.16.27045.0
  1235. > Copyright (C) Microsoft Corporation. All rights reserved.
  1236. > cl -c -nologo -Zc:wchar_t -FS -Zc:rvalueCast -Zc:inline -Zc:strictStrings -Zc:throwingNew -Zc:referenceBinding -Zc:__cplusplus -O2 -MT -W0 -EHsc -DUNICODE -D_UNICODE -DWIN32 -D_ENABLE_EXTENDED_ALIGNED_STORAGE -DWIN64 -DNDEBUG -IC:\qt-everywhere-src-5.15.1\qtmultimedia\config.tests\wshellitem -I. -IC:\Qt\OpenSSL\OpenSSL-1.1.1\static\x64\Release\include -IC:\qt-everywhere-src-5.15.1\qtbase\mkspecs\win32-msvc -Fo @C:\Users\MyUser\AppData\Local\Temp\nm3827.tmp
  1237. > main.cpp
  1238. > link /NOLOGO /DYNAMICBASE /NXCOMPAT /OPT:REF /INCREMENTAL:NO /SUBSYSTEM:CONSOLE "/MANIFESTDEPENDENCY:type='win32' name='Microsoft.Windows.Common-Controls' version='6.0.0.0' publicKeyToken='6595b64144ccf1df' language='*' processorArchitecture='*'" /MANIFEST:embed /OUT:wshellitem.exe @C:\Users\MyUser\AppData\Local\Temp\nm399F.tmp
  1239. test config.qtmultimedia_multimedia.tests.wshellitem succeeded
  1240. looking for library flite
  1241. Trying source 0 (type inline) of library flite ...
  1242. + cd /d C:\qt-everywhere-src-5.15.1\config.tests\flite && C:\qt-everywhere-src-5.15.1\qtbase\bin\qmake.exe "CONFIG -= qt debug_and_release app_bundle lib_bundle" "CONFIG += static warn_off console single_arch" "QMAKE_LIBDIR += C:\\Qt\\OpenSSL\\OpenSSL-1.1.1\\static\\x64\\Release\\lib" "INCLUDEPATH += C:\\Qt\\OpenSSL\\OpenSSL-1.1.1\\static\\x64\\Release\\include" "QMAKE_USE += flite" "QMAKE_LIBS_FLITE = -lflite_cmu_us_kal16 -lflite_usenglish -lflite_cmulex -lflite" C:/qt-everywhere-src-5.15.1/config.tests/flite
  1243. + cd /d C:\qt-everywhere-src-5.15.1\config.tests\flite && set MAKEFLAGS=& nmake
  1244. > Microsoft (R) Program Maintenance Utility Version 14.16.27045.0
  1245. > Copyright (C) Microsoft Corporation. All rights reserved.
  1246. > cl -c -nologo -Zc:wchar_t -FS -Zc:rvalueCast -Zc:inline -Zc:strictStrings -Zc:throwingNew -Zc:referenceBinding -Zc:__cplusplus -O2 -MT -W0 -EHsc -DUNICODE -D_UNICODE -DWIN32 -D_ENABLE_EXTENDED_ALIGNED_STORAGE -DWIN64 -DNDEBUG -I. -IC:\Qt\OpenSSL\OpenSSL-1.1.1\static\x64\Release\include -IC:\qt-everywhere-src-5.15.1\qtbase\mkspecs\win32-msvc -Fo @C:\Users\MyUser\AppData\Local\Temp\nm3A2B.tmp
  1247. > main.cpp
  1248. > .\main.cpp(2): fatal error C1083: Cannot open include file: 'flite/flite.h': No such file or directory
  1249. > NMAKE : fatal error U1077: '"C:\Program Files (x86)\Microsoft Visual Studio\2017\Professional\VC\Tools\MSVC\14.16.27023\bin\HostX64\x64\cl.EXE"' : return code '0x2'
  1250. > Stop.
  1251. => source failed verification.
  1252. test config.qtspeech_tts.libraries.flite FAILED
  1253. executing config test libclang
  1254. test config.qttools_qdoc.tests.libclang FAILED
  1255. executing config test webengine-arch-support
  1256. test config.qtwebengine_buildtools.tests.webengine-arch-support succeeded
  1257. executing config test webengine-bison
  1258. Found bison from path: C:/qt-everywhere-src-5.15.1/gnuwin32/bin/bison.exe
  1259. test config.qtwebengine_buildtools.tests.webengine-bison succeeded
  1260. executing config test webengine-submodule
  1261. test config.qtwebengine_buildtools.tests.webengine-submodule succeeded
  1262. executing config test webengine-nowhitespace
  1263. test config.qtwebengine_buildtools.tests.webengine-nowhitespace succeeded
  1264. executing config test webengine-platform-support
  1265. test config.qtwebengine_buildtools.tests.webengine-platform-support gave result
  1266. executing config test webengine-gperf
  1267. Found gperf from path: C:/qt-everywhere-src-5.15.1/gnuwin32/bin/gperf.exe
  1268. test config.qtwebengine_buildtools.tests.webengine-gperf succeeded
  1269. executing config test webengine-flex
  1270. Found flex from path: C:/qt-everywhere-src-5.15.1/gnuwin32/bin/flex.exe
  1271. test config.qtwebengine_buildtools.tests.webengine-flex succeeded
  1272. executing config test webengine-python2
  1273. 'python2.exe' not found in PATH. Checking for 'python.exe'.
  1274. Python version 3 is not supported by Chromium.
  1275. A suitable Python 2 executable could not be located.
  1276. test config.qtwebengine_buildtools.tests.webengine-python2 gave result
  1277. executing config test webengine-jumbo-build
  1278. Setting jumbo build merge batch limit to 0.
  1279. test config.qtwebengine_buildtools.tests.webengine-jumbo-build gave result 0
  1280. looking for library webengine-dbus
  1281. Trying source 0 (type pkgConfig) of library webengine-dbus ...
  1282. pkg-config use disabled globally.
  1283. => source produced no result.
  1284. test config.qtwebengine_buildtools.libraries.webengine-dbus FAILED
  1285. looking for library webengine-fontconfig
  1286. Trying source 0 (type pkgConfig) of library webengine-fontconfig ...
  1287. pkg-config use disabled globally.
  1288. => source produced no result.
  1289. test config.qtwebengine_buildtools.libraries.webengine-fontconfig FAILED
  1290. looking for library webengine-libdrm
  1291. Trying source 0 (type pkgConfig) of library webengine-libdrm ...
  1292. pkg-config use disabled globally.
  1293. => source produced no result.
  1294. test config.qtwebengine_buildtools.libraries.webengine-libdrm FAILED
  1295. executing config test webengine-ninja
  1296. Found ninja from path: C:\Program Files (x86)\Microsoft Visual Studio\2017\Professional\Common7\IDE\CommonExtensions\Microsoft\CMake\Ninja/ninja.exe
  1297. + C:\Program Files (x86)\Microsoft Visual Studio\2017\Professional\Common7\IDE\CommonExtensions\Microsoft\CMake\Ninja/ninja.exe --version
  1298. test config.qtwebengine_buildtools.tests.webengine-ninja FAILED
  1299. looking for library webengine-xcomposite
  1300. Trying source 0 (type pkgConfig) of library webengine-xcomposite ...
  1301. pkg-config use disabled globally.
  1302. => source produced no result.
  1303. test config.qtwebengine_buildtools.libraries.webengine-xcomposite FAILED
  1304. looking for library webengine-xcursor
  1305. Trying source 0 (type pkgConfig) of library webengine-xcursor ...
  1306. pkg-config use disabled globally.
  1307. => source produced no result.
  1308. test config.qtwebengine_buildtools.libraries.webengine-xcursor FAILED
  1309. looking for library webengine-xi
  1310. Trying source 0 (type pkgConfig) of library webengine-xi ...
  1311. pkg-config use disabled globally.
  1312. => source produced no result.
  1313. test config.qtwebengine_buildtools.libraries.webengine-xi FAILED
  1314. looking for library webengine-xtst
  1315. Trying source 0 (type pkgConfig) of library webengine-xtst ...
  1316. pkg-config use disabled globally.
  1317. => source produced no result.
  1318. test config.qtwebengine_buildtools.libraries.webengine-xtst FAILED
  1319. executing config test webengine-win-compiler64
  1320. test config.qtwebengine_buildtools.tests.webengine-win-compiler64 succeeded
  1321. executing config test webengine-winversion
  1322. + cd /d C:\qt-everywhere-src-5.15.1\config.tests\webengine-winversion && C:\qt-everywhere-src-5.15.1\qtbase\bin\qmake.exe "CONFIG -= qt debug_and_release app_bundle lib_bundle" "CONFIG += static warn_off console single_arch" "QMAKE_LIBDIR += C:\\Qt\\OpenSSL\\OpenSSL-1.1.1\\static\\x64\\Release\\lib" "INCLUDEPATH += C:\\Qt\\OpenSSL\\OpenSSL-1.1.1\\static\\x64\\Release\\include" C:/qt-everywhere-src-5.15.1/config.tests/webengine-winversion
  1323. + cd /d C:\qt-everywhere-src-5.15.1\config.tests\webengine-winversion && set MAKEFLAGS=& nmake
  1324. > Microsoft (R) Program Maintenance Utility Version 14.16.27045.0
  1325. > Copyright (C) Microsoft Corporation. All rights reserved.
  1326. > cl -c -nologo -Zc:wchar_t -FS -Zc:rvalueCast -Zc:inline -Zc:strictStrings -Zc:throwingNew -Zc:referenceBinding -Zc:__cplusplus -O2 -MT -W0 -EHsc -DUNICODE -D_UNICODE -DWIN32 -D_ENABLE_EXTENDED_ALIGNED_STORAGE -DWIN64 -DNDEBUG -I. -IC:\Qt\OpenSSL\OpenSSL-1.1.1\static\x64\Release\include -IC:\qt-everywhere-src-5.15.1\qtbase\mkspecs\win32-msvc -Fo @C:\Users\MyUser\AppData\Local\Temp\nm3B34.tmp
  1327. > main.cpp
  1328. > link /NOLOGO /DYNAMICBASE /NXCOMPAT /OPT:REF /INCREMENTAL:NO /SUBSYSTEM:CONSOLE "/MANIFESTDEPENDENCY:type='win32' name='Microsoft.Windows.Common-Controls' version='6.0.0.0' publicKeyToken='6595b64144ccf1df' language='*' processorArchitecture='*'" /MANIFEST:embed /OUT:webengine-winversion.exe @C:\Users\MyUser\AppData\Local\Temp\nm3B54.tmp
  1329. test config.qtwebengine_buildtools.tests.webengine-winversion succeeded
RAW Paste Data