Guest User

3.8.0

a guest
Dec 11th, 2019
38
Never
Not a member of Pastebin yet? Sign Up, it unlocks many cool features!
  1. == CPython 3.8.0 (default, Dec 11 2019, 05:45:52) [Clang 11.0.0 (clang-1100.0.33.16)]
  2. == macOS-10.15.2-x86_64-i386-64bit little-endian
  3. == cwd: /private/var/folders/_v/9r245bv51z77v4_khb_j55y40000gn/T/test_python_14767
  4. == CPU count: 4
  5. == encodings: locale=UTF-8, FS=utf-8
  6. 0:00:00 load avg: 7.63 Run tests sequentially
  7. 0:00:00 load avg: 7.63 [ 1/423] test_grammar
  8. 0:00:00 load avg: 7.63 [ 2/423] test_opcodes
  9. 0:00:00 load avg: 7.63 [ 3/423] test_dict
  10. 0:00:00 load avg: 7.63 [ 4/423] test_builtin
  11. 0:00:01 load avg: 7.63 [ 5/423] test_exceptions
  12. 0:00:02 load avg: 7.63 [ 6/423] test_types
  13. 0:00:02 load avg: 7.63 [ 7/423] test_unittest
  14. 0:00:07 load avg: 7.90 [ 8/423] test_doctest
  15. 0:00:09 load avg: 8.30 [ 9/423] test_doctest2
  16. 0:00:09 load avg: 8.30 [ 10/423] test_support
  17. 0:00:15 load avg: 8.12 [ 11/423] test___all__
  18. 0:00:17 load avg: 8.12 [ 12/423] test___future__
  19. 0:00:17 load avg: 8.12 [ 13/423] test__locale
  20. 0:00:18 load avg: 8.12 [ 14/423] test__opcode
  21. 0:00:18 load avg: 7.63 [ 15/423] test__osx_support
  22. 0:00:19 load avg: 7.63 [ 16/423] test__xxsubinterpreters
  23. 0:00:22 load avg: 7.63 [ 17/423] test_abc
  24. 0:00:22 load avg: 7.63 [ 18/423] test_abstract_numbers
  25. 0:00:22 load avg: 7.63 [ 19/423] test_aifc
  26. 0:00:23 load avg: 7.63 [ 20/423] test_argparse
  27. 0:00:25 load avg: 7.42 [ 21/423] test_array
  28. 0:00:26 load avg: 7.42 [ 22/423] test_asdl_parser
  29. test_asdl_parser skipped -- test irrelevant for an installed Python
  30. 0:00:26 load avg: 7.42 [ 23/423] test_ast -- test_asdl_parser skipped
  31. 0:00:28 load avg: 7.06 [ 24/423] test_asyncgen
  32. 0:00:29 load avg: 7.06 [ 25/423] test_asynchat
  33. 0:00:31 load avg: 7.06 [ 26/423] test_asyncio
  34. 0:01:50 load avg: 5.22 [ 27/423] test_asyncore -- test_asyncio passed in 1 min 19 sec
  35. 0:01:53 load avg: 5.22 [ 28/423] test_atexit
  36. 0:01:53 load avg: 5.22 [ 29/423] test_audioop
  37. 0:01:54 load avg: 5.22 [ 30/423] test_audit
  38. 0:01:55 load avg: 4.96 [ 31/423] test_augassign
  39. 0:01:55 load avg: 4.96 [ 32/423] test_base64
  40. 0:01:56 load avg: 4.96 [ 33/423] test_baseexception
  41. 0:01:56 load avg: 4.96 [ 34/423] test_bdb
  42. 0:01:57 load avg: 4.96 [ 35/423] test_bigaddrspace
  43. 0:01:57 load avg: 4.96 [ 36/423] test_bigmem
  44. 0:01:57 load avg: 4.96 [ 37/423] test_binascii
  45. 0:01:58 load avg: 4.96 [ 38/423] test_binhex
  46. 0:01:58 load avg: 4.96 [ 39/423] test_binop
  47. 0:01:58 load avg: 4.96 [ 40/423] test_bisect
  48. 0:01:58 load avg: 4.96 [ 41/423] test_bool
  49. 0:01:59 load avg: 4.96 [ 42/423] test_buffer
  50. 0:02:05 load avg: 4.50 [ 43/423] test_bufio
  51. 0:02:08 load avg: 4.50 [ 44/423] test_bytes
  52. 0:02:11 load avg: 5.66 [ 45/423] test_bz2
  53. 0:02:15 load avg: 5.29 [ 46/423] test_c_locale_coercion
  54. 0:02:16 load avg: 5.29 [ 47/423] test_calendar
  55. 0:02:18 load avg: 5.29 [ 48/423] test_call
  56. 0:02:18 load avg: 5.29 [ 49/423] test_capi
  57. 0:02:31 load avg: 4.84 [ 50/423] test_cgi
  58. 0:02:31 load avg: 4.84 [ 51/423] test_cgitb
  59. 0:02:32 load avg: 4.84 [ 52/423] test_charmapcodec
  60. 0:02:32 load avg: 4.84 [ 53/423] test_class
  61. 0:02:32 load avg: 4.84 [ 54/423] test_clinic
  62. test_clinic skipped -- '/Users/<username>/.pyenv/versions/3.8.0/lib/Tools/clinic' path does not exist
  63. 0:02:33 load avg: 4.84 [ 55/423] test_cmath -- test_clinic skipped
  64. 0:02:33 load avg: 4.84 [ 56/423] test_cmd
  65. 0:02:34 load avg: 4.84 [ 57/423] test_cmd_line
  66. 0:02:36 load avg: 4.61 [ 58/423] test_cmd_line_script
  67. 0:02:40 load avg: 4.72 [ 59/423] test_code
  68. 0:02:41 load avg: 4.72 [ 60/423] test_code_module
  69. 0:02:41 load avg: 4.72 [ 61/423] test_codeccallbacks
  70. 0:02:41 load avg: 4.72 [ 62/423] test_codecencodings_cn
  71. 0:02:42 load avg: 4.72 [ 63/423] test_codecencodings_hk
  72. 0:02:43 load avg: 4.72 [ 64/423] test_codecencodings_iso2022
  73. 0:02:44 load avg: 4.72 [ 65/423] test_codecencodings_jp
  74. 0:02:45 load avg: 4.74 [ 66/423] test_codecencodings_kr
  75. 0:02:45 load avg: 4.74 [ 67/423] test_codecencodings_tw
  76. 0:02:45 load avg: 4.74 [ 68/423] test_codecmaps_cn
  77. 0:02:46 load avg: 4.74 [ 69/423] test_codecmaps_hk
  78. 0:02:46 load avg: 4.74 [ 70/423] test_codecmaps_jp
  79. 0:02:46 load avg: 4.74 [ 71/423] test_codecmaps_kr
  80. 0:02:46 load avg: 4.74 [ 72/423] test_codecmaps_tw
  81. 0:02:47 load avg: 4.74 [ 73/423] test_codecs
  82. 0:02:48 load avg: 4.74 [ 74/423] test_codeop
  83. 0:02:48 load avg: 4.74 [ 75/423] test_collections
  84. 0:02:50 load avg: 4.44 [ 76/423] test_colorsys
  85. 0:02:50 load avg: 4.44 [ 77/423] test_compare
  86. 0:02:50 load avg: 4.44 [ 78/423] test_compile
  87. 0:02:53 load avg: 4.44 [ 79/423] test_compileall
  88. 0:03:00 load avg: 4.83 [ 80/423] test_complex
  89. 0:03:01 load avg: 4.83 [ 81/423] test_concurrent_futures
  90. 0:05:23 load avg: 3.40 [ 82/423] test_configparser -- test_concurrent_futures passed in 2 min 22 sec
  91. 0:05:23 load avg: 3.40 [ 83/423] test_contains
  92. 0:05:24 load avg: 3.40 [ 84/423] test_context
  93. 0:05:26 load avg: 3.40 [ 85/423] test_contextlib
  94. 0:05:26 load avg: 3.40 [ 86/423] test_contextlib_async
  95. Task was destroyed but it is pending!
  96. task: <Task pending name='Task-3872' coro=<<async_generator_athrow without __name__>()>>
  97. Task was destroyed but it is pending!
  98. task: <Task pending name='Task-3874' coro=<<async_generator_athrow without __name__>()>>
  99. Task was destroyed but it is pending!
  100. task: <Task pending name='Task-3879' coro=<<async_generator_athrow without __name__>()>>
  101. 0:05:26 load avg: 3.37 [ 87/423] test_copy
  102. 0:05:27 load avg: 3.37 [ 88/423] test_copyreg
  103. 0:05:27 load avg: 3.37 [ 89/423] test_coroutines
  104. 0:05:28 load avg: 3.37 [ 90/423] test_cprofile
  105. 0:05:29 load avg: 3.37 [ 91/423] test_crashers
  106. 0:05:29 load avg: 3.37 [ 92/423] test_crypt
  107. 0:05:30 load avg: 3.37 [ 93/423] test_csv
  108. 0:05:30 load avg: 3.37 [ 94/423] test_ctypes
  109. 0:05:32 load avg: 3.34 [ 95/423] test_curses
  110. test_curses skipped -- Use of the 'curses' resource not enabled
  111. 0:05:32 load avg: 3.34 [ 96/423] test_dataclasses -- test_curses skipped (resource denied)
  112. 0:05:32 load avg: 3.34 [ 97/423] test_datetime
  113. 0:05:36 load avg: 3.31 [ 98/423] test_dbm
  114. 0:05:37 load avg: 3.31 [ 99/423] test_dbm_dumb
  115. 0:05:37 load avg: 3.31 [100/423] test_dbm_gnu
  116. test_dbm_gnu skipped -- No module named '_gdbm'
  117. 0:05:37 load avg: 3.31 [101/423] test_dbm_ndbm -- test_dbm_gnu skipped
  118. 0:05:37 load avg: 3.31 [102/423] test_decimal
  119. 0:05:42 load avg: 3.28 [103/423] test_decorators
  120. 0:05:42 load avg: 3.28 [104/423] test_defaultdict
  121. 0:05:43 load avg: 3.28 [105/423] test_deque
  122. 0:05:46 load avg: 3.28 [106/423] test_descr
  123. 0:05:48 load avg: 3.34 [107/423] test_descrtut
  124. 0:05:48 load avg: 3.34 [108/423] test_devpoll
  125. test_devpoll skipped -- test works only on Solaris OS family
  126. 0:05:48 load avg: 3.34 [109/423] test_dict_version -- test_devpoll skipped
  127. 0:05:49 load avg: 3.34 [110/423] test_dictcomps
  128. 0:05:49 load avg: 3.34 [111/423] test_dictviews
  129. 0:05:49 load avg: 3.34 [112/423] test_difflib
  130. 0:05:50 load avg: 3.34 [113/423] test_dis
  131. 0:05:51 load avg: 3.34 [114/423] test_distutils
  132. 0:05:54 load avg: 3.39 [115/423] test_docxmlrpc
  133. 0:05:58 load avg: 3.36 [116/423] test_dtrace
  134. 0:05:59 load avg: 3.36 [117/423] test_dummy_thread
  135. 0:05:59 load avg: 3.36 [118/423] test_dummy_threading
  136. 0:05:59 load avg: 3.36 [119/423] test_dynamic
  137. 0:06:00 load avg: 3.36 [120/423] test_dynamicclassattribute
  138. 0:06:00 load avg: 3.36 [121/423] test_eintr
  139. 0:06:06 load avg: 3.25 [122/423] test_email
  140. 0:06:12 load avg: 3.21 [123/423] test_embed
  141. 0:06:12 load avg: 3.21 [124/423] test_ensurepip
  142. 0:06:13 load avg: 3.21 [125/423] test_enum
  143. 0:06:13 load avg: 3.21 [126/423] test_enumerate
  144. 0:06:14 load avg: 3.21 [127/423] test_eof
  145. 0:06:14 load avg: 3.21 [128/423] test_epoll
  146. test_epoll skipped -- test works only on Linux 2.6
  147. 0:06:14 load avg: 3.21 [129/423] test_errno -- test_epoll skipped
  148. 0:06:15 load avg: 3.21 [130/423] test_exception_hierarchy
  149. 0:06:15 load avg: 3.21 [131/423] test_exception_variations
  150. 0:06:15 load avg: 3.21 [132/423] test_extcall
  151. 0:06:16 load avg: 3.21 [133/423] test_faulthandler
  152. 0:06:36 load avg: 2.89 [134/423] test_fcntl
  153. 0:06:36 load avg: 2.89 [135/423] test_file
  154. 0:06:37 load avg: 3.54 [136/423] test_file_eintr
  155. 0:06:39 load avg: 3.54 [137/423] test_filecmp
  156. 0:06:40 load avg: 3.54 [138/423] test_fileinput
  157. 0:06:40 load avg: 3.54 [139/423] test_fileio
  158. 0:06:41 load avg: 3.54 [140/423] test_finalization
  159. 0:06:44 load avg: 4.78 [141/423] test_float
  160. 0:06:44 load avg: 4.78 [142/423] test_flufl
  161. 0:06:45 load avg: 4.78 [143/423] test_fnmatch
  162. 0:06:45 load avg: 4.78 [144/423] test_fork1
  163. 0:06:52 load avg: 4.55 [145/423] test_format
  164. 0:06:52 load avg: 4.35 [146/423] test_fractions
  165. 0:06:52 load avg: 4.35 [147/423] test_frame
  166. 0:06:53 load avg: 4.35 [148/423] test_frozen
  167. 0:06:53 load avg: 4.35 [149/423] test_fstring
  168. 0:06:54 load avg: 4.35 [150/423] test_ftplib
  169. 0:06:57 load avg: 4.35 [151/423] test_funcattrs
  170. 0:06:57 load avg: 4.16 [152/423] test_functools
  171. 0:06:58 load avg: 4.16 [153/423] test_future
  172. 0:06:58 load avg: 4.16 [154/423] test_future3
  173. 0:06:59 load avg: 4.16 [155/423] test_future4
  174. 0:06:59 load avg: 4.16 [156/423] test_future5
  175. 0:06:59 load avg: 4.16 [157/423] test_gc
  176. 0:07:05 load avg: 4.07 [158/423] test_gdb
  177. test_gdb skipped -- Couldn't find gdb on the path
  178. 0:07:05 load avg: 4.07 [159/423] test_generator_stop -- test_gdb skipped
  179. 0:07:06 load avg: 4.07 [160/423] test_generators
  180. 0:07:06 load avg: 4.07 [161/423] test_genericclass
  181. 0:07:07 load avg: 4.07 [162/423] test_genericpath
  182. 0:07:07 load avg: 3.90 [163/423] test_genexps
  183. 0:07:07 load avg: 3.90 [164/423] test_getargs2
  184. 0:07:08 load avg: 3.90 [165/423] test_getopt
  185. 0:07:08 load avg: 3.90 [166/423] test_getpass
  186. 0:07:09 load avg: 3.90 [167/423] test_gettext
  187. 0:07:09 load avg: 3.90 [168/423] test_glob
  188. 0:07:10 load avg: 3.90 [169/423] test_global
  189. 0:07:11 load avg: 3.90 [170/423] test_grp
  190. 0:07:11 load avg: 3.90 [171/423] test_gzip
  191. 0:07:12 load avg: 3.99 [172/423] test_hash
  192. 0:07:13 load avg: 3.99 [173/423] test_hashlib
  193. 0:07:15 load avg: 3.99 [174/423] test_heapq
  194. 0:07:16 load avg: 3.99 [175/423] test_hmac
  195. 0:07:16 load avg: 3.99 [176/423] test_html
  196. 0:07:16 load avg: 3.99 [177/423] test_htmlparser
  197. 0:07:17 load avg: 3.99 [178/423] test_http_cookiejar
  198. 0:07:17 load avg: 4.39 [179/423] test_http_cookies
  199. 0:07:18 load avg: 4.39 [180/423] test_httplib
  200. 0:07:18 load avg: 4.39 [181/423] test_httpservers
  201. 0:07:23 load avg: 4.12 [182/423] test_idle
  202. test_idle skipped -- No module named '_tkinter'
  203. 0:07:23 load avg: 4.12 [183/423] test_imaplib -- test_idle skipped
  204. 0:07:26 load avg: 4.12 [184/423] test_imghdr
  205. 0:07:27 load avg: 4.12 [185/423] test_imp
  206. 0:07:28 load avg: 3.95 [186/423] test_import
  207. 0:07:28 load avg: 3.95 [187/423] test_importlib
  208. 0:07:31 load avg: 3.95 [188/423] test_index
  209. 0:07:31 load avg: 3.95 [189/423] test_inspect
  210. 0:07:32 load avg: 3.87 [190/423] test_int
  211. 0:07:33 load avg: 3.87 [191/423] test_int_literal
  212. 0:07:33 load avg: 3.87 [192/423] test_io
  213. python(14767,0x109e27dc0) malloc: can't allocate region
  214. *** mach_vm_map(size=9223372036854775808) failed (error code=3)
  215. python(14767,0x109e27dc0) malloc: *** set a breakpoint in malloc_error_break to debug
  216. python(14767,0x109e27dc0) malloc: can't allocate region
  217. *** mach_vm_map(size=9223372036854775808) failed (error code=3)
  218. python(14767,0x109e27dc0) malloc: *** set a breakpoint in malloc_error_break to debug
  219. python(14767,0x109e27dc0) malloc: can't allocate region
  220. *** mach_vm_map(size=9223372036854775808) failed (error code=3)
  221. python(14767,0x109e27dc0) malloc: *** set a breakpoint in malloc_error_break to debug
  222. 0:08:15 load avg: 3.31 [193/423] test_ioctl -- test_io passed in 42.3 sec
  223. 0:08:16 load avg: 3.31 [194/423] test_ipaddress
  224. 0:08:16 load avg: 3.31 [195/423] test_isinstance
  225. 0:08:17 load avg: 3.31 [196/423] test_iter
  226. 0:08:18 load avg: 3.45 [197/423] test_iterlen
  227. 0:08:18 load avg: 3.45 [198/423] test_itertools
  228. 0:08:23 load avg: 3.49 [199/423] test_json
  229. 0:08:25 load avg: 3.49 [200/423] test_keyword
  230. 0:08:26 load avg: 3.49 [201/423] test_keywordonlyarg
  231. 0:08:26 load avg: 3.49 [202/423] test_kqueue
  232. 0:08:27 load avg: 3.49 [203/423] test_largefile
  233. 0:08:28 load avg: 3.37 [204/423] test_lib2to3
  234. 0:08:38 load avg: 3.72 [205/423] test_linecache
  235. 0:08:39 load avg: 3.72 [206/423] test_list
  236. 0:08:40 load avg: 3.72 [207/423] test_listcomps
  237. 0:08:41 load avg: 3.72 [208/423] test_lltrace
  238. 0:08:41 load avg: 3.72 [209/423] test_locale
  239. 0:08:42 load avg: 3.72 [210/423] test_logging
  240. Exception in thread Thread-469:
  241. Traceback (most recent call last):
  242. File "/Users/<username>/.pyenv/versions/3.8.0/lib/python3.8/threading.py", line 932, in _bootstrap_inner
  243. self.run()
  244. File "/Users/<username>/.pyenv/versions/3.8.0/lib/python3.8/threading.py", line 870, in run
  245. self._target(*self._args, **self._kwargs)
  246. File "/Users/<username>/.pyenv/versions/3.8.0/lib/python3.8/test/test_logging.py", line 870, in serve_forever
  247. asyncore.loop(poll_interval, map=self._map)
  248. File "/Users/<username>/.pyenv/versions/3.8.0/lib/python3.8/asyncore.py", line 203, in loop
  249. poll_fun(timeout, map)
  250. File "/Users/<username>/.pyenv/versions/3.8.0/lib/python3.8/asyncore.py", line 144, in poll
  251. r, w, e = select.select(r, w, e, timeout)
  252. OSError: [Errno 9] Bad file descriptor
  253. 0:09:05 load avg: 3.19 [211/423] test_long
  254. 0:09:09 load avg: 3.33 [212/423] test_longexp
  255. 0:09:10 load avg: 3.33 [213/423] test_lzma
  256. 0:09:17 load avg: 3.47 [214/423] test_mailbox
  257. 0:09:19 load avg: 3.75 [215/423] test_mailcap
  258. 0:09:20 load avg: 3.75 [216/423] test_marshal
  259. 0:09:21 load avg: 3.75 [217/423] test_math
  260. 0:09:23 load avg: 4.17 [218/423] test_memoryio
  261. 0:09:24 load avg: 4.17 [219/423] test_memoryview
  262. 0:09:27 load avg: 4.17 [220/423] test_metaclass
  263. 0:09:28 load avg: 4.17 [221/423] test_mimetypes
  264. 0:09:28 load avg: 4.40 [222/423] test_minidom
  265. 0:09:29 load avg: 4.40 [223/423] test_mmap
  266. 0:09:30 load avg: 4.40 [224/423] test_module
  267. 0:09:31 load avg: 4.40 [225/423] test_modulefinder
  268. 0:09:32 load avg: 4.40 [226/423] test_msilib
  269. test_msilib skipped -- No module named 'msilib'
  270. 0:09:32 load avg: 4.40 [227/423] test_multibytecodec -- test_msilib skipped
  271. 0:09:34 load avg: 4.36 [228/423] test_multiprocessing_fork
  272. test_multiprocessing_fork skipped -- test may crash on macOS (bpo-33725)
  273. 0:09:35 load avg: 4.36 [229/423] test_multiprocessing_forkserver -- test_multiprocessing_fork skipped
  274. 0:10:53 load avg: 2.95 [230/423] test_multiprocessing_main_handling -- test_multiprocessing_forkserver passed in 1 min 18 sec
  275. 0:11:02 load avg: 2.97 [231/423] test_multiprocessing_spawn
  276. 0:12:47 load avg: 1.96 [232/423] test_named_expressions -- test_multiprocessing_spawn passed in 1 min 45 sec
  277. 0:12:47 load avg: 1.96 [233/423] test_netrc
  278. 0:12:48 load avg: 1.96 [234/423] test_nis
  279. 0:12:49 load avg: 1.96 [235/423] test_nntplib
  280. 0:12:50 load avg: 1.96 [236/423] test_normalization
  281. 0:12:50 load avg: 2.04 [237/423] test_ntpath
  282. 0:12:51 load avg: 2.04 [238/423] test_numeric_tower
  283. 0:12:51 load avg: 2.04 [239/423] test_openpty
  284. 0:12:52 load avg: 2.04 [240/423] test_operator
  285. 0:12:53 load avg: 2.04 [241/423] test_optparse
  286. 0:12:53 load avg: 2.04 [242/423] test_ordered_dict
  287. 0:12:58 load avg: 1.96 [243/423] test_os
  288. 0:13:00 load avg: 2.04 [244/423] test_ossaudiodev
  289. test_ossaudiodev skipped -- Use of the 'audio' resource not enabled
  290. 0:13:01 load avg: 2.04 [245/423] test_osx_env -- test_ossaudiodev skipped (resource denied)
  291. 0:13:01 load avg: 2.04 [246/423] test_parser
  292. 0:13:02 load avg: 2.04 [247/423] test_pathlib
  293. 0:13:04 load avg: 2.04 [248/423] test_pdb
  294. 0:13:05 load avg: 2.12 [249/423] test_peepholer
  295. 0:13:06 load avg: 2.12 [250/423] test_pickle
  296. 0:13:16 load avg: 2.03 [251/423] test_picklebuffer
  297. 0:13:16 load avg: 2.03 [252/423] test_pickletools
  298. 0:13:18 load avg: 2.03 [253/423] test_pipes
  299. 0:13:19 load avg: 2.03 [254/423] test_pkg
  300. 0:13:20 load avg: 2.03 [255/423] test_pkgimport
  301. 0:13:20 load avg: 2.03 [256/423] test_pkgutil
  302. 0:13:21 load avg: 2.03 [257/423] test_platform
  303. 0:13:22 load avg: 2.03 [258/423] test_plistlib
  304. 0:13:22 load avg: 2.03 [259/423] test_poll
  305. 0:13:34 load avg: 2.18 [260/423] test_popen
  306. 0:13:35 load avg: 2.18 [261/423] test_poplib
  307. 0:13:37 load avg: 2.09 [262/423] test_positional_only_arg
  308. 0:13:38 load avg: 2.09 [263/423] test_posix
  309. 0:13:39 load avg: 2.09 [264/423] test_posixpath
  310. 0:13:40 load avg: 2.09 [265/423] test_pow
  311. 0:13:40 load avg: 2.09 [266/423] test_pprint
  312. 0:13:41 load avg: 2.08 [267/423] test_print
  313. 0:13:42 load avg: 2.08 [268/423] test_profile
  314. 0:13:42 load avg: 2.08 [269/423] test_property
  315. 0:13:43 load avg: 2.08 [270/423] test_pstats
  316. 0:13:44 load avg: 2.08 [271/423] test_pty
  317. 0:13:44 load avg: 2.08 [272/423] test_pulldom
  318. 0:13:45 load avg: 2.08 [273/423] test_pwd
  319. 0:13:46 load avg: 2.08 [274/423] test_py_compile
  320. test test_py_compile failed -- multiple errors occurred; run in verbose mode for details
  321. 0:13:46 load avg: 2.15 [275/423/1] test_pyclbr -- test_py_compile failed
  322. 0:13:48 load avg: 2.15 [276/423/1] test_pydoc
  323. 0:13:52 load avg: 2.14 [277/423/1] test_pyexpat
  324. 0:13:52 load avg: 2.14 [278/423/1] test_queue
  325. 0:14:00 load avg: 2.21 [279/423/1] test_quopri
  326. 0:14:01 load avg: 2.27 [280/423/1] test_raise
  327. 0:14:02 load avg: 2.27 [281/423/1] test_random
  328. 0:14:03 load avg: 2.27 [282/423/1] test_range
  329. 0:14:04 load avg: 2.27 [283/423/1] test_re
  330. 0:14:05 load avg: 2.27 [284/423/1] test_readline
  331. 0:14:06 load avg: 2.33 [285/423/1] test_regrtest
  332. 0:14:20 load avg: 2.60 [286/423/1] test_repl
  333. 0:14:21 load avg: 2.60 [287/423/1] test_reprlib
  334. 0:14:21 load avg: 2.71 [288/423/1] test_resource
  335. 0:14:22 load avg: 2.71 [289/423/1] test_richcmp
  336. 0:14:23 load avg: 2.71 [290/423/1] test_rlcompleter
  337. 0:14:24 load avg: 2.71 [291/423/1] test_robotparser
  338. 0:14:24 load avg: 2.71 [292/423/1] test_runpy
  339. 0:14:27 load avg: 2.81 [293/423/1] test_sax
  340. 0:14:27 load avg: 2.81 [294/423/1] test_sched
  341. 0:14:29 load avg: 2.81 [295/423/1] test_scope
  342. 0:14:30 load avg: 2.81 [296/423/1] test_script_helper
  343. 0:14:31 load avg: 2.81 [297/423/1] test_secrets
  344. 0:14:31 load avg: 2.75 [298/423/1] test_select
  345. 0:14:43 load avg: 2.41 [299/423/1] test_selectors
  346. 0:14:58 load avg: 2.39 [300/423/1] test_set
  347. 0:15:01 load avg: 2.39 [301/423/1] test_setcomps
  348. 0:15:01 load avg: 2.39 [302/423/1] test_shelve
  349. 0:15:02 load avg: 2.44 [303/423/1] test_shlex
  350. 0:15:03 load avg: 2.44 [304/423/1] test_shutil
  351. 0:15:04 load avg: 2.44 [305/423/1] test_signal
  352. 0:15:25 load avg: 3.21 [306/423/1] test_site
  353. 0:15:26 load avg: 3.21 [307/423/1] test_slice
  354. 0:15:27 load avg: 3.43 [308/423/1] test_smtpd
  355. 0:15:28 load avg: 3.43 [309/423/1] test_smtplib
  356. 0:15:30 load avg: 3.43 [310/423/1] test_smtpnet
  357. test_smtpnet skipped -- Use of the 'network' resource not enabled
  358. 0:15:30 load avg: 3.43 [311/423/1] test_sndhdr -- test_smtpnet skipped (resource denied)
  359. 0:15:31 load avg: 3.43 [312/423/1] test_socket
  360. /Users/<username>/.pyenv/versions/3.8.0/lib/python3.8/test/test_socket.py:2437: RuntimeWarning: received malformed or improperly-truncated ancillary data
  361. result = sock.recvmsg(bufsize, *args)
  362. /Users/<username>/.pyenv/versions/3.8.0/lib/python3.8/test/test_socket.py:2528: RuntimeWarning: received malformed or improperly-truncated ancillary data
  363. result = sock.recvmsg_into([buf], *args)
  364. 0:15:55 load avg: 2.94 [313/423/1] test_socketserver
  365. test_socketserver skipped -- Use of the 'network' resource not enabled
  366. 0:15:55 load avg: 2.94 [314/423/1] test_sort -- test_socketserver skipped (resource denied)
  367. 0:15:56 load avg: 2.94 [315/423/1] test_source_encoding
  368. 0:15:57 load avg: 2.94 [316/423/1] test_spwd
  369. test_spwd skipped -- No module named 'spwd'
  370. 0:15:57 load avg: 2.95 [317/423/1] test_sqlite -- test_spwd skipped
  371. 0:15:58 load avg: 2.95 [318/423/1] test_ssl
  372. 0:16:27 load avg: 2.69 [319/423/1] test_startfile
  373. test_startfile skipped -- object <module 'os' from '/Users/<username>/.pyenv/versions/3.8.0/lib/python3.8/os.py'> has no attribute 'startfile'
  374. 0:16:28 load avg: 3.11 [320/423/1] test_stat -- test_startfile skipped
  375. 0:16:29 load avg: 3.11 [321/423/1] test_statistics
  376. 0:16:35 load avg: 3.03 [322/423/1] test_strftime
  377. 0:16:35 load avg: 3.03 [323/423/1] test_string
  378. 0:16:36 load avg: 3.03 [324/423/1] test_string_literals
  379. 0:16:37 load avg: 3.03 [325/423/1] test_stringprep
  380. 0:16:38 load avg: 3.10 [326/423/1] test_strptime
  381. 0:16:38 load avg: 3.10 [327/423/1] test_strtod
  382. 0:16:39 load avg: 3.10 [328/423/1] test_struct
  383. 0:16:40 load avg: 3.10 [329/423/1] test_structmembers
  384. 0:16:41 load avg: 3.10 [330/423/1] test_structseq
  385. 0:16:41 load avg: 3.10 [331/423/1] test_subclassinit
  386. 0:16:42 load avg: 3.10 [332/423/1] test_subprocess
  387. 0:17:15 load avg: 2.94 [333/423/1] test_sunau -- test_subprocess passed in 33.5 sec
  388. 0:17:16 load avg: 2.94 [334/423/1] test_sundry
  389. 0:17:16 load avg: 2.94 [335/423/1] test_super
  390. 0:17:17 load avg: 2.94 [336/423/1] test_symbol
  391. 0:17:18 load avg: 2.94 [337/423/1] test_symtable
  392. 0:17:18 load avg: 2.95 [338/423/1] test_syntax
  393. 0:17:19 load avg: 2.95 [339/423/1] test_sys
  394. 0:17:21 load avg: 2.95 [340/423/1] test_sys_setprofile
  395. 0:17:21 load avg: 2.95 [341/423/1] test_sys_settrace
  396. 0:17:22 load avg: 2.95 [342/423/1] test_sysconfig
  397. 0:17:23 load avg: 2.95 [343/423/1] test_syslog
  398. 0:17:23 load avg: 2.95 [344/423/1] test_tabnanny
  399. 0:17:24 load avg: 2.95 [345/423/1] test_tarfile
  400. 0:17:32 load avg: 2.95 [346/423/1] test_tcl
  401. test_tcl skipped -- No module named '_tkinter'
  402. 0:17:32 load avg: 2.95 [347/423/1] test_telnetlib -- test_tcl skipped
  403. 0:17:33 load avg: 2.95 [348/423/1] test_tempfile
  404. 0:17:35 load avg: 3.12 [349/423/1] test_textwrap
  405. 0:17:36 load avg: 3.12 [350/423/1] test_thread
  406. 0:17:37 load avg: 3.12 [351/423/1] test_threaded_import
  407. 0:17:39 load avg: 3.11 [352/423/1] test_threadedtempfile
  408. 0:17:40 load avg: 3.11 [353/423/1] test_threading
  409. 0:17:51 load avg: 2.94 [354/423/1] test_threading_local
  410. 0:17:52 load avg: 2.94 [355/423/1] test_threadsignals
  411. 0:17:56 load avg: 2.70 [356/423/1] test_time
  412. 0:17:59 load avg: 2.65 [357/423/1] test_timeit
  413. 0:17:59 load avg: 2.65 [358/423/1] test_timeout
  414. test_timeout skipped -- Use of the 'network' resource not enabled
  415. 0:18:00 load avg: 2.65 [359/423/1] test_tix -- test_timeout skipped (resource denied)
  416. test_tix skipped -- No module named '_tkinter'
  417. 0:18:00 load avg: 2.65 [360/423/1] test_tk -- test_tix skipped
  418. test_tk skipped -- No module named '_tkinter'
  419. 0:18:00 load avg: 2.65 [361/423/1] test_tokenize -- test_tk skipped
  420. 0:18:01 load avg: 2.65 [362/423/1] test_tools
  421. 0:18:02 load avg: 2.65 [363/423/1] test_trace
  422. 0:18:06 load avg: 2.51 [364/423/1] test_traceback
  423. 0:18:07 load avg: 2.51 [365/423/1] test_tracemalloc
  424. 0:18:09 load avg: 2.47 [366/423/1] test_ttk_guionly
  425. test_ttk_guionly skipped -- No module named '_tkinter'
  426. 0:18:09 load avg: 2.47 [367/423/1] test_ttk_textonly -- test_ttk_guionly skipped
  427. test_ttk_textonly skipped -- No module named '_tkinter'
  428. 0:18:10 load avg: 2.47 [368/423/1] test_tuple -- test_ttk_textonly skipped
  429. 0:18:22 load avg: 2.40 [369/423/1] test_turtle
  430. test_turtle skipped -- No module named '_tkinter'
  431. 0:18:22 load avg: 2.40 [370/423/1] test_type_comments -- test_turtle skipped
  432. 0:18:23 load avg: 2.40 [371/423/1] test_typechecks
  433. 0:18:23 load avg: 2.40 [372/423/1] test_typing
  434. 0:18:24 load avg: 2.37 [373/423/1] test_ucn
  435. 0:18:25 load avg: 2.37 [374/423/1] test_unary
  436. 0:18:26 load avg: 2.37 [375/423/1] test_unicode
  437. 0:18:27 load avg: 2.37 [376/423/1] test_unicode_file
  438. 0:18:28 load avg: 2.37 [377/423/1] test_unicode_file_functions
  439. 0:18:29 load avg: 2.26 [378/423/1] test_unicode_identifiers
  440. 0:18:30 load avg: 2.26 [379/423/1] test_unicodedata
  441. 0:18:32 load avg: 2.26 [380/423/1] test_univnewlines
  442. 0:18:33 load avg: 2.26 [381/423/1] test_unpack
  443. 0:18:34 load avg: 2.26 [382/423/1] test_unpack_ex
  444. 0:18:34 load avg: 2.16 [383/423/1] test_urllib
  445. 0:18:36 load avg: 2.16 [384/423/1] test_urllib2
  446. 0:18:37 load avg: 2.16 [385/423/1] test_urllib2_localnet
  447. 0:18:39 load avg: 2.14 [386/423/1] test_urllib2net
  448. test_urllib2net skipped -- Use of the 'network' resource not enabled
  449. 0:18:39 load avg: 2.14 [387/423/1] test_urllib_response -- test_urllib2net skipped (resource denied)
  450. 0:18:40 load avg: 2.14 [388/423/1] test_urllibnet
  451. test_urllibnet skipped -- Use of the 'network' resource not enabled
  452. 0:18:40 load avg: 2.14 [389/423/1] test_urlparse -- test_urllibnet skipped (resource denied)
  453. 0:18:42 load avg: 2.14 [390/423/1] test_userdict
  454. 0:18:43 load avg: 2.14 [391/423/1] test_userlist
  455. 0:18:44 load avg: 2.14 [392/423/1] test_userstring
  456. 0:18:45 load avg: 2.21 [393/423/1] test_utf8_mode
  457. 0:18:46 load avg: 2.21 [394/423/1] test_utf8source
  458. 0:18:47 load avg: 2.21 [395/423/1] test_uu
  459. 0:18:48 load avg: 2.21 [396/423/1] test_uuid
  460. 0:18:49 load avg: 2.21 [397/423/1] test_venv
  461. 0:18:59 load avg: 2.23 [398/423/1] test_wait3
  462. 0:19:06 load avg: 2.13 [399/423/1] test_wait4
  463. 0:19:11 load avg: 2.04 [400/423/1] test_warnings
  464. 0:19:12 load avg: 2.04 [401/423/1] test_wave
  465. 0:19:13 load avg: 2.04 [402/423/1] test_weakref
  466. 0:19:31 load avg: 2.12 [403/423/1] test_weakset
  467. 0:19:33 load avg: 2.12 [404/423/1] test_webbrowser
  468. 0:19:33 load avg: 2.12 [405/423/1] test_winconsoleio
  469. test_winconsoleio skipped -- test only relevant on win32
  470. 0:19:34 load avg: 2.12 [406/423/1] test_winreg -- test_winconsoleio skipped
  471. test_winreg skipped -- No module named 'winreg'
  472. 0:19:34 load avg: 2.12 [407/423/1] test_winsound -- test_winreg skipped
  473. test_winsound skipped -- Use of the 'audio' resource not enabled
  474. 0:19:35 load avg: 2.12 [408/423/1] test_with -- test_winsound skipped (resource denied)
  475. 0:19:35 load avg: 2.03 [409/423/1] test_wsgiref
  476. 0:19:36 load avg: 2.03 [410/423/1] test_xdrlib
  477. 0:19:37 load avg: 2.03 [411/423/1] test_xml_dom_minicompat
  478. 0:19:37 load avg: 2.03 [412/423/1] test_xml_etree
  479. 0:19:39 load avg: 2.03 [413/423/1] test_xml_etree_c
  480. 0:19:42 load avg: 1.95 [414/423/1] test_xmlrpc
  481. 0:19:46 load avg: 1.95 [415/423/1] test_xmlrpc_net
  482. test_xmlrpc_net skipped -- Use of the 'network' resource not enabled
  483. 0:19:47 load avg: 1.95 [416/423/1] test_xxtestfuzz -- test_xmlrpc_net skipped (resource denied)
  484. 0:19:48 load avg: 1.95 [417/423/1] test_yield_from
  485. 0:19:48 load avg: 1.95 [418/423/1] test_zipapp
  486. 0:19:49 load avg: 1.95 [419/423/1] test_zipfile
  487. 0:19:58 load avg: 2.28 [420/423/1] test_zipfile64
  488. test_zipfile64 skipped -- test requires loads of disk-space bytes and a long time to run
  489. 0:19:58 load avg: 2.28 [421/423/1] test_zipimport -- test_zipfile64 skipped (resource denied)
  490. 0:19:59 load avg: 2.28 [422/423/1] test_zipimport_support
  491. 0:20:00 load avg: 2.26 [423/423/1] test_zlib
  492.  
  493. == Tests result: FAILURE ==
  494.  
  495. 393 tests OK.
  496.  
  497. 1 test failed:
  498. test_py_compile
  499.  
  500. 29 tests skipped:
  501. test_asdl_parser test_clinic test_curses test_dbm_gnu test_devpoll
  502. test_epoll test_gdb test_idle test_msilib
  503. test_multiprocessing_fork test_ossaudiodev test_smtpnet
  504. test_socketserver test_spwd test_startfile test_tcl test_timeout
  505. test_tix test_tk test_ttk_guionly test_ttk_textonly test_turtle
  506. test_urllib2net test_urllibnet test_winconsoleio test_winreg
  507. test_winsound test_xmlrpc_net test_zipfile64
  508.  
  509. Total duration: 20 min 2 sec
  510. Tests result: FAILURE
RAW Paste Data