Advertisement
GilchristT

Error

Jul 4th, 2021
468
0
Never
Not a member of Pastebin yet? Sign Up, it unlocks many cool features!
text 1.78 KB | None | 0 0
  1. ERROR: xxxx-1.0-r0 do_compile: oe_runmake failed
  2. ERROR: xxxx-1.0-r0 do_compile: Execution of '/home/tommy/yocto/streamer/build/tmp/work/jetson_xavier_nx_devkit_emmc-oe4t-linux/xxxx/1.0-r0/temp/run.do_compile.1443427' failed with exit code 1:
  3.  
  4. << I added these for troubleshooting >>
  5. Linux V4L2 Device Driver - Installing ...
  6. /home/tommy/yocto/streamer/build/tmp/work-shared/jetson-xavier-nx-devkit-emmc/kernel-source
  7. /home/tommy/yocto/streamer/build/tmp/work-shared/jetson-xavier-nx-devkit-emmc/kernel-source
  8. /home/tommy/yocto/streamer/build/tmp/work/jetson_xavier_nx_devkit_emmc-oe4t-linux/xxxx/1.0-r0/src
  9.  
  10.  
  11. make -C /home/tommy/yocto/streamer/build/tmp/work-shared/jetson-xavier-nx-devkit-emmc/kernel-source M=/home/tommy/yocto/streamer/build/tmp/work/jetson_xavier_nx_devkit_emmc-oe4t-linux/yuan/1.0-r0/src modules_install
  12. make[1]: Entering directory '/home/tommy/yocto/streamer/build/tmp/work-shared/jetson-xavier-nx-devkit-emmc/kernel-source'
  13.  
  14. << I'm assuming the mkdir here is the problem, trying to create in root fs of build machine? >>
  15. make[2]: Entering directory '/home/tommy/yocto/streamer/build/tmp/work-shared/jetson-xavier-nx-devkit-emmc/kernel-build-artifacts'
  16. mkdir: cannot create directory '/lib/modules/4.9.201-l4t-r32.5+gc68230c5b46a': Permission denied
  17.  
  18.  
  19.  
  20. make[2]: *** [/home/tommy/yocto/streamer/build/tmp/work-shared/jetson-xavier-nx-devkit-emmc/kernel-source/Makefile:1668: _emodinst_] Error 1
  21. make[2]: Leaving directory '/home/tommy/yocto/streamer/build/tmp/work-shared/jetson-xavier-nx-devkit-emmc/kernel-build-artifacts'
  22. make[1]: *** [Makefile:169: sub-make] Error 2
  23. make[1]: Leaving directory '/home/tommy/yocto/streamer/build/tmp/work-shared/jetson-xavier-nx-devkit-emmc/kernel-source'
  24. make: *** [Makefile:129: install] Error 2
  25. WARNING: exit code 1 from a shell command.
Advertisement
Add Comment
Please, Sign In to add comment
Advertisement