Advertisement
Guest User

Untitled

a guest
Mar 2nd, 2021
43
0
Never
Not a member of Pastebin yet? Sign Up, it unlocks many cool features!
text 5.89 KB | None | 0 0
  1. irynah@irynah-Vostro-3560:/media/irynah/DATA/0NEW-108G/0PROJECTS/OpenMRS-projects/openmrs-contrib-qaframework$ mvn clean install
  2. [INFO] Scanning for projects...
  3. [INFO]
  4. [INFO] ------------------< org.openmrs.contrib:qaframework >-------------------
  5. [INFO] Building OpenMRS QA Framework 1.0-SNAPSHOT
  6. [INFO] --------------------------------[ jar ]---------------------------------
  7. [INFO]
  8. [INFO] --- maven-clean-plugin:2.5:clean (default-clean) @ qaframework ---
  9. [INFO] Deleting /media/irynah/DATA/0NEW-108G/0PROJECTS/OpenMRS-projects/openmrs-contrib-qaframework/target
  10. [INFO]
  11. [INFO] --- maven-java-formatter-plugin:0.4:format (default) @ qaframework ---
  12. [INFO] Using 'UTF-8' encoding to format source files.
  13. [INFO] Number of files to be formatted: 11
  14. [INFO] Successfully formatted: 0 file(s)
  15. [INFO] Fail to format : 0 file(s)
  16. [INFO] Skipped : 11 file(s)
  17. [INFO] Approximate time taken: 1s
  18. [INFO]
  19. [INFO] --- frontend-maven-plugin:1.9.1:install-node-and-npm (install node and npm) @ qaframework ---
  20. [INFO] Node v15.8.0 is already installed.
  21. [INFO]
  22. [INFO] --- maven-resources-plugin:2.6:resources (default-resources) @ qaframework ---
  23. [INFO] Using 'UTF-8' encoding to copy filtered resources.
  24. [INFO] skip non existing resourceDirectory /media/irynah/DATA/0NEW-108G/0PROJECTS/OpenMRS-projects/openmrs-contrib-qaframework/src/main/resources
  25. [INFO]
  26. [INFO] --- maven-compiler-plugin:3.1:compile (default-compile) @ qaframework ---
  27. [INFO] No sources to compile
  28. [INFO]
  29. [INFO] --- maven-resources-plugin:2.6:testResources (default-testResources) @ qaframework ---
  30. [INFO] Using 'UTF-8' encoding to copy filtered resources.
  31. [INFO] Copying 28 resources
  32. [INFO]
  33. [INFO] --- maven-compiler-plugin:3.1:testCompile (default-testCompile) @ qaframework ---
  34. [INFO] Changes detected - recompiling the module!
  35. [INFO] Compiling 11 source files to /media/irynah/DATA/0NEW-108G/0PROJECTS/OpenMRS-projects/openmrs-contrib-qaframework/target/test-classes
  36. [INFO] -------------------------------------------------------------
  37. [ERROR] COMPILATION ERROR :
  38. [INFO] -------------------------------------------------------------
  39. [ERROR] /media/irynah/DATA/0NEW-108G/0PROJECTS/OpenMRS-projects/openmrs-contrib-qaframework/src/test/java/org/openmrs/contrib/qaframework/automation/StylesGuideSteps.java:[41,41] cannot find symbol
  40. symbol: method clickOnStylesGuideAppLink()
  41. location: variable systemAdministrationPage of type org.openmrs.reference.page.SystemAdministrationPage
  42. [ERROR] /media/irynah/DATA/0NEW-108G/0PROJECTS/OpenMRS-projects/openmrs-contrib-qaframework/src/test/java/org/openmrs/contrib/qaframework/automation/AllergiesSteps.java:[45,28] cannot find symbol
  43. symbol: method addNoKnownAllergy()
  44. location: variable allergyPage of type org.openmrs.reference.page.AllergyPage
  45. [ERROR] /media/irynah/DATA/0NEW-108G/0PROJECTS/OpenMRS-projects/openmrs-contrib-qaframework/src/test/java/org/openmrs/contrib/qaframework/automation/AllergiesSteps.java:[55,28] cannot find symbol
  46. symbol: method removeNoKnownAllergy()
  47. location: variable allergyPage of type org.openmrs.reference.page.AllergyPage
  48. [ERROR] /media/irynah/DATA/0NEW-108G/0PROJECTS/OpenMRS-projects/openmrs-contrib-qaframework/src/test/java/org/openmrs/contrib/qaframework/automation/ConditionsSteps.java:[38,30] cannot find symbol
  49. symbol: method clickOnConditionsWidgetLink()
  50. location: variable dashboardPage of type org.openmrs.reference.page.ClinicianFacingPatientDashboardPage
  51. [INFO] 4 errors
  52. [INFO] -------------------------------------------------------------
  53. [INFO] ------------------------------------------------------------------------
  54. [INFO] BUILD FAILURE
  55. [INFO] ------------------------------------------------------------------------
  56. [INFO] Total time: 10.499 s
  57. [INFO] Finished at: 2021-03-02T23:08:04+03:00
  58. [INFO] ------------------------------------------------------------------------
  59. [ERROR] Failed to execute goal org.apache.maven.plugins:maven-compiler-plugin:3.1:testCompile (default-testCompile) on project qaframework: Compilation failure: Compilation failure:
  60. [ERROR] /media/irynah/DATA/0NEW-108G/0PROJECTS/OpenMRS-projects/openmrs-contrib-qaframework/src/test/java/org/openmrs/contrib/qaframework/automation/StylesGuideSteps.java:[41,41] cannot find symbol
  61. [ERROR] symbol: method clickOnStylesGuideAppLink()
  62. [ERROR] location: variable systemAdministrationPage of type org.openmrs.reference.page.SystemAdministrationPage
  63. [ERROR] /media/irynah/DATA/0NEW-108G/0PROJECTS/OpenMRS-projects/openmrs-contrib-qaframework/src/test/java/org/openmrs/contrib/qaframework/automation/AllergiesSteps.java:[45,28] cannot find symbol
  64. [ERROR] symbol: method addNoKnownAllergy()
  65. [ERROR] location: variable allergyPage of type org.openmrs.reference.page.AllergyPage
  66. [ERROR] /media/irynah/DATA/0NEW-108G/0PROJECTS/OpenMRS-projects/openmrs-contrib-qaframework/src/test/java/org/openmrs/contrib/qaframework/automation/AllergiesSteps.java:[55,28] cannot find symbol
  67. [ERROR] symbol: method removeNoKnownAllergy()
  68. [ERROR] location: variable allergyPage of type org.openmrs.reference.page.AllergyPage
  69. [ERROR] /media/irynah/DATA/0NEW-108G/0PROJECTS/OpenMRS-projects/openmrs-contrib-qaframework/src/test/java/org/openmrs/contrib/qaframework/automation/ConditionsSteps.java:[38,30] cannot find symbol
  70. [ERROR] symbol: method clickOnConditionsWidgetLink()
  71. [ERROR] location: variable dashboardPage of type org.openmrs.reference.page.ClinicianFacingPatientDashboardPage
  72. [ERROR] -> [Help 1]
  73. [ERROR]
  74. [ERROR] To see the full stack trace of the errors, re-run Maven with the -e switch.
  75. [ERROR] Re-run Maven using the -X switch to enable full debug logging.
  76. [ERROR]
  77. [ERROR] For more information about the errors and possible solutions, please read the following articles:
  78. [ERROR] [Help 1] http://cwiki.apache.org/confluence/display/MAVEN/MojoFailureException
  79. irynah@irynah-Vostro-3560:/media/irynah/DATA/0NEW-108G/0PROJECTS/OpenMRS-projects/openmrs-contrib-qaframework$
Advertisement
Add Comment
Please, Sign In to add comment
Advertisement