SHARE
TWEET

libvirt-git chroot build failure

a guest Jan 16th, 2016 45 Never
Not a member of Pastebin yet? Sign Up, it unlocks many cool features!
  1. ┌─[dan@zman0900]─[/mnt/data/aurbuilds/libvirt-git]
  2. └──╼ extra-x86_64-build -r /tmp/chroot -- -I /mnt/data/built-packages/xhtml-docs-1.1-4-any.pkg.tar.xz
  3. [sudo] password for dan:
  4. :: Synchronizing package databases...
  5.  core is up to date
  6.  extra is up to date
  7.  community is up to date
  8. :: Starting full system upgrade...
  9.  there is nothing to do
  10. ==> Building in chroot for [extra] (x86_64)...
  11. ==> Creating clean working copy [dan]...done
  12. loading packages...
  13. resolving dependencies...
  14. looking for conflicting packages...
  15.  
  16. Packages (2) libxml2-2.9.3-1  xhtml-docs-1.1-4
  17.  
  18. Total Installed Size:  10.44 MiB
  19.  
  20. :: Proceed with installation? [Y/n]
  21. (2/2) checking keys in keyring                                         [#######################################] 100%
  22. (1/2) checking package integrity                                       [#######################################] 100%
  23. (1/2) loading package files                                            [#######################################] 100%
  24. (2/2) checking for file conflicts                                      [#######################################] 100%
  25. (1/2) installing libxml2                                               [#######################################] 100%
  26. Optional dependencies for libxml2
  27.     python2: python bindings to libxml
  28. (2/2) installing xhtml-docs                                            [#######################################] 100%
  29. ==> Making package: libvirt-git VE.2015.5313.87.g7bf3c13-1 (Sat Jan 16 13:06:31 EST 2016)
  30. ==> Retrieving sources...
  31.   -> Updating libvirt git repo...
  32. Fetching origin
  33.   -> Found libvirtd.conf.d
  34.   -> Found libvirtd-guests.conf.d
  35.   -> Found libvirt.tmpfiles.d
  36. ==> Validating source files with sha512sums...
  37.     libvirt ... Skipped
  38.     libvirtd.conf.d ... Passed
  39.     libvirtd-guests.conf.d ... Passed
  40.     libvirt.tmpfiles.d ... Passed
  41. ==> Making package: libvirt-git VE.2015.5313.87.g7bf3c13-1 (Sat Jan 16 13:06:32 EST 2016)
  42. ==> Checking runtime dependencies...
  43. ==> Installing missing dependencies...
  44. resolving dependencies...
  45. looking for conflicting packages...
  46.  
  47. Packages (32) device-mapper-2.02.138-1  hwids-20150717-1  js17-17.0.0-3  kbd-2.0.3-1  kbproto-1.0.7-1  kmod-22-1
  48.               libdaemon-0.14-3  libdbus-1.10.6-1  libelf-0.165-1  libseccomp-2.2.3-1  libusb-1.0.20-1  nspr-4.11-1
  49.               perl-xml-parser-2.44-2  xcb-proto-1.11-2  xproto-7.0.28-1  avahi-0.6.32rc-3  dbus-1.10.6-1
  50.               iproute2-4.1.1-1  iptables-1.4.21-3  libnl-3.2.26-1  libpcap-1.7.4-1  libpciaccess-0.13.4-1
  51.               libx11-1.6.3-1  libxau-1.0.8-2  libxcb-1.11.1-1  libxdmcp-1.1.2-1  parted-3.2-3  perl-xml-xpath-1.13-7
  52.               polkit-0.113-4  python-3.5.1-1  systemd-228-3  yajl-2.1.0-1
  53.  
  54. Total Installed Size:  179.53 MiB
  55.  
  56. :: Proceed with installation? [Y/n]
  57. (32/32) checking keys in keyring                                       [#######################################] 100%
  58. (32/32) checking package integrity                                     [#######################################] 100%
  59. (32/32) loading package files                                          [#######################################] 100%
  60. (32/32) checking for file conflicts                                    [#######################################] 100%
  61. ( 1/32) installing iptables                                            [#######################################] 100%
  62. ( 2/32) installing libdbus                                             [#######################################] 100%
  63. ( 3/32) installing dbus                                                [#######################################] 100%
  64. Optional dependencies for dbus
  65.     libx11: dbus-launch support [pending]
  66. ( 4/32) installing kbd                                                 [#######################################] 100%
  67. ( 5/32) installing kmod                                                [#######################################] 100%
  68. ( 6/32) installing hwids                                               [#######################################] 100%
  69. ( 7/32) installing libelf                                              [#######################################] 100%
  70. ( 8/32) installing libseccomp                                          [#######################################] 100%
  71. ( 9/32) installing systemd                                             [#######################################] 100%
  72. Initializing machine ID from random generator.
  73. Creating group systemd-journal-upload with gid 999.
  74. Creating user systemd-journal-upload (systemd Journal Upload) with uid 999 and gid 999.
  75. Creating group systemd-journal-remote with gid 998.
  76. Creating user systemd-journal-remote (systemd Journal Remote) with uid 998 and gid 998.
  77. Created symlink from /etc/systemd/system/getty.target.wants/getty@tty1.service to /usr/lib/systemd/system/getty@.service.
  78. Created symlink from /etc/systemd/system/multi-user.target.wants/remote-fs.target to /usr/lib/systemd/system/remote-fs.target.
  79. :: Append 'init=/usr/lib/systemd/systemd' to your kernel command line in your
  80.    bootloader to replace sysvinit with systemd, or install systemd-sysvcompat
  81. Optional dependencies for systemd
  82.     cryptsetup: required for encrypted block devices
  83.     libmicrohttpd: remote journald capabilities
  84.     quota-tools: kernel-level quota management
  85.     systemd-sysvcompat: symlink package to provide sysvinit binaries
  86.     polkit: allow administration as unprivileged user [pending]
  87. (10/32) installing device-mapper                                       [#######################################] 100%
  88. (11/32) installing parted                                              [#######################################] 100%
  89. (12/32) installing nspr                                                [#######################################] 100%
  90. (13/32) installing js17                                                [#######################################] 100%
  91. (14/32) installing polkit                                              [#######################################] 100%
  92. (15/32) installing python                                              [#######################################] 100%
  93. Optional dependencies for python
  94.     python-setuptools
  95.     python-pip
  96.     sqlite [installed]
  97.     mpdecimal: for decimal
  98.     xz: for lzma [installed]
  99.     tk: for tkinter
  100. (16/32) installing libdaemon                                           [#######################################] 100%
  101. (17/32) installing avahi                                               [#######################################] 100%
  102. Optional dependencies for avahi
  103.     gtk3: avahi-discover-standalone, bshell, bssh, bvnc
  104.     gtk2: gtk2 bindings
  105.     qt4: qt4 bindings
  106.     pygtk: avahi-bookmarks, avahi-discover
  107.     python2-twisted: avahi-bookmarks
  108.     mono: mono bindings
  109.     python2-dbus: avahi-discover
  110.     nss-mdns: NSS support for mDNS
  111. (18/32) installing yajl                                                [#######################################] 100%
  112. (19/32) installing libpciaccess                                        [#######################################] 100%
  113. (20/32) installing xproto                                              [#######################################] 100%
  114. (21/32) installing libxau                                              [#######################################] 100%
  115. (22/32) installing libxdmcp                                            [#######################################] 100%
  116. (23/32) installing libnl                                               [#######################################] 100%
  117. (24/32) installing libusb                                              [#######################################] 100%
  118. (25/32) installing libpcap                                             [#######################################] 100%
  119. (26/32) installing xcb-proto                                           [#######################################] 100%
  120. (27/32) installing libxcb                                              [#######################################] 100%
  121. (28/32) installing iproute2                                            [#######################################] 100%
  122. Optional dependencies for iproute2
  123.     linux-atm: ATM support
  124. (29/32) installing kbproto                                             [#######################################] 100%
  125. (30/32) installing libx11                                              [#######################################] 100%
  126. (31/32) installing perl-xml-parser                                     [#######################################] 100%
  127. (32/32) installing perl-xml-xpath                                      [#######################################] 100%
  128. ==> Checking buildtime dependencies...
  129. ==> Installing missing dependencies...
  130. resolving dependencies...
  131. looking for conflicting packages...
  132.  
  133. Packages (7) libaio-0.3.110-1  perl-error-0.17024-1  thin-provisioning-tools-0.5.6-2  dnsmasq-2.75-1  git-2.7.0-1
  134.              libxslt-1.1.28-4  lvm2-2.02.138-1
  135.  
  136. Total Installed Size:  35.15 MiB
  137.  
  138. :: Proceed with installation? [Y/n]
  139. (7/7) checking keys in keyring                                         [#######################################] 100%
  140. (7/7) checking package integrity                                       [#######################################] 100%
  141. (7/7) loading package files                                            [#######################################] 100%
  142. (7/7) checking for file conflicts                                      [#######################################] 100%
  143. (1/7) installing perl-error                                            [#######################################] 100%
  144. (2/7) installing git                                                   [#######################################] 100%
  145. Optional dependencies for git
  146.     tk: gitk and git gui
  147.     perl-libwww: git svn
  148.     perl-term-readkey: git svn
  149.     perl-mime-tools: git send-email
  150.     perl-net-smtp-ssl: git send-email TLS support
  151.     perl-authen-sasl: git send-email TLS support
  152.     python2: various helper scripts
  153.     subversion: git svn
  154.     cvsps2: git cvsimport
  155.     gnome-keyring: GNOME keyring credential helper
  156. (3/7) installing libaio                                                [#######################################] 100%
  157. (4/7) installing thin-provisioning-tools                               [#######################################] 100%
  158. (5/7) installing lvm2                                                  [#######################################] 100%
  159. (6/7) installing dnsmasq                                               [#######################################] 100%
  160. (7/7) installing libxslt                                               [#######################################] 100%
  161. ==> Retrieving sources...
  162.   -> Found libvirtd.conf.d
  163.   -> Found libvirtd-guests.conf.d
  164.   -> Found libvirt.tmpfiles.d
  165. ==> Validating source files with sha512sums...
  166.     libvirt ... Skipped
  167.     libvirtd.conf.d ... Passed
  168.     libvirtd-guests.conf.d ... Passed
  169.     libvirt.tmpfiles.d ... Passed
  170. ==> Extracting sources...
  171.   -> Creating working copy of libvirt git repo...
  172. Cloning into 'libvirt'...
  173. done.
  174. ==> Starting pkgver()...
  175. ==> Updated version: libvirt-git 1.3.1.rc2.3.g8f0a157-1
  176. ==> Starting build()...
  177. running bootstrap...
  178. ./bootstrap: Bootstrapping from checked-out libvirt sources...
  179. ./bootstrap: consider installing git-merge-changelog from gnulib
  180. ./bootstrap: getting gnulib files...
  181. Submodule 'gnulib' (git://git.sv.gnu.org/gnulib.git) registered for path '.gnulib'
  182. Cloning into '.gnulib'...
  183. Submodule path '.gnulib': checked out '6cc32c63e80bc1a30c521b2f07f2b54909b59892'
  184. ./bootstrap: autopoint --force
  185. Copying file ABOUT-NLS
  186. Copying file build-aux/config.rpath
  187. Copying file m4/codeset.m4
  188. Copying file m4/gettext.m4
  189. Copying file m4/glibc2.m4
  190. Copying file m4/glibc21.m4
  191. Copying file m4/iconv.m4
  192. Copying file m4/intdiv0.m4
  193. Copying file m4/intl.m4
  194. Copying file m4/intldir.m4
  195. Copying file m4/intlmacosx.m4
  196. Copying file m4/intmax.m4
  197. Copying file m4/inttypes-pri.m4
  198. Copying file m4/inttypes_h.m4
  199. Copying file m4/lcmessage.m4
  200. Copying file m4/lib-ld.m4
  201. Copying file m4/lib-link.m4
  202. Copying file m4/lib-prefix.m4
  203. Copying file m4/lock.m4
  204. Copying file m4/longlong.m4
  205. Copying file m4/nls.m4
  206. Copying file m4/po.m4
  207. Copying file m4/printf-posix.m4
  208. Copying file m4/progtest.m4
  209. Copying file m4/size_max.m4
  210. Copying file m4/stdint_h.m4
  211. Copying file m4/uintmax_t.m4
  212. Copying file m4/visibility.m4
  213. Copying file m4/wchar_t.m4
  214. Copying file m4/wint_t.m4
  215. Copying file m4/xsize.m4
  216. Copying file po/Makefile.in.in
  217. Copying file po/Makevars.template
  218. Copying file po/Rules-quot
  219. Copying file po/boldquot.sed
  220. Copying file po/en@boldquot.header
  221. Copying file po/en@quot.header
  222. Copying file po/insert-header.sin
  223. Copying file po/quot.sed
  224. Copying file po/remove-potcdate.sin
  225. running: libtoolize --install --copy
  226. libtoolize: putting auxiliary files in AC_CONFIG_AUX_DIR, 'build-aux'.
  227. libtoolize: copying file 'build-aux/config.guess'
  228. libtoolize: copying file 'build-aux/config.sub'
  229. libtoolize: copying file 'build-aux/install-sh'
  230. libtoolize: copying file 'build-aux/ltmain.sh'
  231. libtoolize: putting macros in AC_CONFIG_MACRO_DIRS, 'm4'.
  232. libtoolize: copying file 'm4/libtool.m4'
  233. libtoolize: copying file 'm4/ltoptions.m4'
  234. libtoolize: copying file 'm4/ltsugar.m4'
  235. libtoolize: copying file 'm4/ltversion.m4'
  236. libtoolize: copying file 'm4/lt~obsolete.m4'
  237. ./bootstrap: .gnulib/gnulib-tool  --import --no-changelog --aux-dir build-aux --doc-base doc --lib libgnu --m4-base m4/ --source-base gnulib/lib/ --tests-base gnulib/tests --local-dir gnulib/local  --lgpl=2 --with-tests --makefile-name=gnulib.mk --avoid=pt_chown --avoid=lock-tests --libtool --import ...
  238. Module list with included dependencies (indented):
  239.     absolute-header
  240.   accept
  241.     accept-tests
  242.     alloca
  243.     alloca-opt
  244.     alloca-opt-tests
  245.     allocator
  246.   areadlink
  247.     areadlink-tests
  248.     arpa_inet
  249.     arpa_inet-tests
  250.     assure
  251.   autobuild
  252.   base64
  253.     base64-tests
  254.     binary-io
  255.     binary-io-tests
  256.   bind
  257.     bind-tests
  258.   bitrotate
  259.     bitrotate-tests
  260.     btowc
  261.     btowc-tests
  262.   byteswap
  263.     byteswap-tests
  264.   c-ctype
  265.     c-ctype-tests
  266.   c-strcase
  267.     c-strcase-tests
  268.   c-strcasestr
  269.     c-strcasestr-tests
  270.   calloc-posix
  271.   canonicalize-lgpl
  272.     canonicalize-lgpl-tests
  273.     careadlinkat
  274.   chown
  275.     chown-tests
  276.   clock-time
  277.     cloexec
  278.     cloexec-tests
  279.   close
  280.     close-tests
  281.   configmake
  282.   connect
  283.     connect-tests
  284.   count-leading-zeros
  285.     count-leading-zeros-tests
  286.   count-one-bits
  287.     count-one-bits-tests
  288.   crypto/md5
  289.     crypto/md5-tests
  290.   crypto/sha256
  291.     ctype
  292.     ctype-tests
  293.   dirname-lgpl
  294.     dosname
  295.     double-slash-root
  296.     dup
  297.     dup-tests
  298.     dup2
  299.     dup2-tests
  300.   environ
  301.     environ-tests
  302.     errno
  303.     errno-tests
  304.     error
  305.   execinfo
  306.     exitfail
  307.     extensions
  308.     extern-inline
  309.     fatal-signal
  310.   fclose
  311.     fclose-tests
  312.   fcntl
  313.   fcntl-h
  314.     fcntl-h-tests
  315.     fcntl-tests
  316.     fd-hook
  317.   fdatasync
  318.     fdatasync-tests
  319.     fdopen
  320.     fdopen-tests
  321.     fflush
  322.     fflush-tests
  323.   ffs
  324.     ffs-tests
  325.   ffsl
  326.     ffsl-tests
  327.     fgetc-tests
  328.     float
  329.     float-tests
  330.   fnmatch
  331.     fnmatch-tests
  332.     fpieee
  333.     fpucw
  334.     fpurge
  335.     fpurge-tests
  336.     fputc-tests
  337.     fread-tests
  338.     freading
  339.     freading-tests
  340.     fseek
  341.     fseek-tests
  342.     fseeko
  343.     fseeko-tests
  344.     fstat
  345.     fstat-tests
  346.   fsync
  347.     fsync-tests
  348.     ftell
  349.     ftell-tests
  350.     ftello
  351.     ftello-tests
  352.     ftruncate
  353.     ftruncate-tests
  354.   func
  355.     func-tests
  356.     fwrite-tests
  357.   getaddrinfo
  358.     getaddrinfo-tests
  359.   getcwd-lgpl
  360.     getcwd-lgpl-tests
  361.     getdelim
  362.     getdelim-tests
  363.     getdtablesize
  364.     getdtablesize-tests
  365.     getgroups
  366.     getgroups-tests
  367.   gethostname
  368.     gethostname-tests
  369.     getline
  370.     getline-tests
  371.     getpagesize
  372.   getpass
  373.   getpeername
  374.     getpeername-tests
  375.   getsockname
  376.     getsockname-tests
  377.     getsockopt
  378.     getsockopt-tests
  379.   gettext-h
  380.   gettimeofday
  381.     gettimeofday-tests
  382.     getugroups
  383.   gitlog-to-changelog
  384.   gnumakefile
  385.     grantpt
  386.     grantpt-tests
  387.     havelib
  388.     hostent
  389.   ignore-value
  390.     ignore-value-tests
  391.     include_next
  392.     inet_ntop
  393.     inet_ntop-tests
  394.   inet_pton
  395.     inet_pton-tests
  396.   intprops
  397.     intprops-tests
  398.     inttypes
  399.     inttypes-incomplete
  400.     inttypes-tests
  401.   ioctl
  402.     ioctl-tests
  403.   isatty
  404.     isatty-tests
  405.     isnand-nolibm
  406.     isnand-nolibm-tests
  407.     isnanf-nolibm
  408.     isnanf-nolibm-tests
  409.     isnanl-nolibm
  410.     isnanl-nolibm-tests
  411.     langinfo
  412.     langinfo-tests
  413.   largefile
  414.   ldexp
  415.     ldexp-tests
  416.   listen
  417.     listen-tests
  418.     localcharset
  419.     locale
  420.     locale-tests
  421.   localeconv
  422.     localeconv-tests
  423.     localename
  424.     localename-tests
  425.     lock
  426.     lseek
  427.     lseek-tests
  428.     lstat
  429.     lstat-tests
  430.   maintainer-makefile
  431.     malloc-posix
  432.     malloca
  433.     malloca-tests
  434.   manywarnings
  435.     math
  436.     math-tests
  437.     mbrtowc
  438.     mbrtowc-tests
  439.     mbsinit
  440.     mbsinit-tests
  441.     mbsrtowcs
  442.     mbsrtowcs-tests
  443.     mbtowc
  444.     memchr
  445.     memchr-tests
  446.   mgetgroups
  447.   mkdtemp
  448.   mkostemp
  449.   mkostemps
  450.   mktempd
  451.     mktime
  452.     mktime-internal
  453.     msvc-inval
  454.     msvc-nothrow
  455.     multiarch
  456.     nanosleep
  457.     nanosleep-tests
  458.   net_if
  459.     net_if-tests
  460.   netdb
  461.     netdb-tests
  462.     netinet_in
  463.     netinet_in-tests
  464.     nl_langinfo
  465.     nl_langinfo-tests
  466.     nocrash
  467.   nonblocking
  468.     nonblocking-pipe-tests
  469.     nonblocking-socket-tests
  470.     nonblocking-tests
  471.     open
  472.     open-tests
  473.   openpty
  474.     openpty-tests
  475.   passfd
  476.     passfd-tests
  477.     pathmax
  478.     pathmax-tests
  479.   perror
  480.     perror-tests
  481.   physmem
  482.   pipe-posix
  483.     pipe-posix-tests
  484.   pipe2
  485.     pipe2-tests
  486.   poll
  487.     poll-h
  488.     poll-h-tests
  489.     poll-tests
  490.   posix-shell
  491.     posix_openpt
  492.     posix_openpt-tests
  493.     posix_spawn-internal
  494.     posix_spawn_file_actions_addclose
  495.     posix_spawn_file_actions_addclose-tests
  496.     posix_spawn_file_actions_adddup2
  497.     posix_spawn_file_actions_adddup2-tests
  498.     posix_spawn_file_actions_addopen
  499.     posix_spawn_file_actions_addopen-tests
  500.     posix_spawn_file_actions_destroy
  501.     posix_spawn_file_actions_init
  502.     posix_spawnattr_destroy
  503.     posix_spawnattr_init
  504.     posix_spawnattr_setflags
  505.     posix_spawnattr_setsigmask
  506.     posix_spawnp
  507.     posix_spawnp-tests
  508.     progname
  509.   pthread
  510.   pthread_sigmask
  511.     pthread_sigmask-tests
  512.     ptsname
  513.     ptsname-tests
  514.     ptsname_r
  515.     ptsname_r-tests
  516.     pty
  517.     pty-tests
  518.     putenv
  519.     raise
  520.     raise-tests
  521.   random_r
  522.     random_r-tests
  523.     rawmemchr
  524.     rawmemchr-tests
  525.     read
  526.     read-tests
  527.     readlink
  528.     readlink-tests
  529.     realloc-posix
  530.   recv
  531.     recv-tests
  532.   regex
  533.     regex-tests
  534.     same-inode
  535.   sched
  536.     sched-tests
  537.   secure_getenv
  538.     select
  539.     select-tests
  540.   send
  541.     send-tests
  542.     servent
  543.   setenv
  544.     setenv-tests
  545.     setlocale
  546.     setlocale-tests
  547.   setsockopt
  548.     setsockopt-tests
  549.   sigaction
  550.     sigaction-tests
  551.     signal-h
  552.     signal-h-tests
  553.     signbit
  554.     signbit-tests
  555.   sigpipe
  556.     sigpipe-tests
  557.     sigprocmask
  558.     sigprocmask-tests
  559.     size_max
  560.     sleep
  561.     sleep-tests
  562.     snippet/_Noreturn
  563.     snippet/arg-nonnull
  564.     snippet/c++defs
  565.     snippet/unused-parameter
  566.     snippet/warn-on-use
  567.   snprintf
  568.     snprintf-tests
  569.   socket
  570.     socketlib
  571.     sockets
  572.     sockets-tests
  573.     socklen
  574.     spawn
  575.     spawn-tests
  576.     ssize_t
  577.     stat
  578.     stat-tests
  579.   stat-time
  580.     stat-time-tests
  581.     stdalign
  582.     stdalign-tests
  583.   stdarg
  584.     stdbool
  585.     stdbool-tests
  586.     stddef
  587.     stddef-tests
  588.     stdint
  589.     stdint-tests
  590.     stdio
  591.     stdio-tests
  592.     stdlib
  593.     stdlib-tests
  594.   stpcpy
  595.     strcase
  596.   strchrnul
  597.     strchrnul-tests
  598.   strdup-posix
  599.     streq
  600.   strerror
  601.     strerror-override
  602.     strerror-tests
  603.   strerror_r-posix
  604.     strerror_r-posix-tests
  605.     string
  606.     string-tests
  607.     strings
  608.     strings-tests
  609.   strndup
  610.     strnlen
  611.     strnlen-tests
  612.     strnlen1
  613.   strptime
  614.   strsep
  615.   strtok_r
  616.     symlink
  617.     symlink-tests
  618.     sys_ioctl
  619.     sys_ioctl-tests
  620.     sys_select
  621.     sys_select-tests
  622.     sys_socket
  623.     sys_socket-tests
  624.   sys_stat
  625.     sys_stat-tests
  626.     sys_time
  627.     sys_time-tests
  628.     sys_types
  629.     sys_types-tests
  630.     sys_uio
  631.     sys_uio-tests
  632.     sys_utsname
  633.     sys_utsname-tests
  634.   sys_wait
  635.     sys_wait-tests
  636.     tempname
  637.   termios
  638.     termios-tests
  639.     test-framework-sh
  640.     test-framework-sh-tests
  641.     thread
  642.     thread-tests
  643.     threadlib
  644.     time
  645.     time-tests
  646.   time_r
  647.   timegm
  648.   ttyname_r
  649.     ttyname_r-tests
  650.   uname
  651.     uname-tests
  652.     unistd
  653.     unistd-tests
  654.     unlockpt
  655.     unlockpt-tests
  656.     unsetenv
  657.     unsetenv-tests
  658.   useless-if-before-free
  659.   usleep
  660.     usleep-tests
  661.     vasnprintf
  662.     vasnprintf-tests
  663.   vasprintf
  664.     vasprintf-tests
  665.   vc-list-files
  666.     vc-list-files-tests
  667.   verify
  668.     verify-tests
  669.   vsnprintf
  670.     vsnprintf-tests
  671.     wait-process
  672.   waitpid
  673.   warnings
  674.     wchar
  675.     wchar-tests
  676.     wcrtomb
  677.     wcrtomb-tests
  678.     wctob
  679.     wctomb
  680.     wctype-h
  681.     wctype-h-tests
  682.     write
  683.     write-tests
  684.     xalloc
  685.     xalloc-die
  686.     xalloc-die-tests
  687.     xalloc-oversized
  688.     xsize
  689. Notice from module localcharset:
  690.   If your package's tests make use of the locale_charset() function directly or
  691.   indirectly, you may need to define the CHARSETALIASDIR environment variable,
  692.   so that "make check" works before "make install". In Makefile.am syntax:
  693.   TESTS_ENVIRONMENT += @LOCALCHARSET_TESTS_ENVIRONMENT@
  694. Notice from module vasprintf:
  695.   If you are using GNU gettext version 0.16.1 or older, add the following options
  696.   to XGETTEXT_OPTIONS in your po/Makevars:
  697.     --flag=asprintf:2:c-format --flag=vasprintf:2:c-format
  698. File list:
  699.   build-aux/config.rpath
  700.   build-aux/gitlog-to-changelog
  701.   build-aux/mktempd
  702.   build-aux/snippet/_Noreturn.h
  703.   build-aux/snippet/arg-nonnull.h
  704.   build-aux/snippet/c++defs.h
  705.   build-aux/snippet/unused-parameter.h
  706.   build-aux/snippet/warn-on-use.h
  707.   build-aux/useless-if-before-free
  708.   build-aux/vc-list-files
  709.   lib/accept.c
  710.   lib/alloca.c
  711.   lib/alloca.in.h
  712.   lib/allocator.c
  713.   lib/allocator.h
  714.   lib/areadlink.c
  715.   lib/areadlink.h
  716.   lib/arpa_inet.in.h
  717.   lib/asnprintf.c
  718.   lib/asprintf.c
  719.   lib/assure.h
  720.   lib/base64.c
  721.   lib/base64.h
  722.   lib/basename-lgpl.c
  723.   lib/binary-io.c
  724.   lib/binary-io.h
  725.   lib/bind.c
  726.   lib/bitrotate.c
  727.   lib/bitrotate.h
  728.   lib/btowc.c
  729.   lib/byteswap.in.h
  730.   lib/c-ctype.c
  731.   lib/c-ctype.h
  732.   lib/c-strcase.h
  733.   lib/c-strcasecmp.c
  734.   lib/c-strcasestr.c
  735.   lib/c-strcasestr.h
  736.   lib/c-strncasecmp.c
  737.   lib/calloc.c
  738.   lib/canonicalize-lgpl.c
  739.   lib/careadlinkat.c
  740.   lib/careadlinkat.h
  741.   lib/chown.c
  742.   lib/cloexec.c
  743.   lib/cloexec.h
  744.   lib/close.c
  745.   lib/config.charset
  746.   lib/connect.c
  747.   lib/count-leading-zeros.c
  748.   lib/count-leading-zeros.h
  749.   lib/count-one-bits.c
  750.   lib/count-one-bits.h
  751.   lib/dirname-lgpl.c
  752.   lib/dirname.h
  753.   lib/dosname.h
  754.   lib/dup2.c
  755.   lib/errno.in.h
  756.   lib/execinfo.c
  757.   lib/execinfo.in.h
  758.   lib/fchown-stub.c
  759.   lib/fclose.c
  760.   lib/fcntl.c
  761.   lib/fcntl.in.h
  762.   lib/fd-hook.c
  763.   lib/fd-hook.h
  764.   lib/fdatasync.c
  765.   lib/fflush.c
  766.   lib/ffs.c
  767.   lib/ffsl.c
  768.   lib/ffsl.h
  769.   lib/float+.h
  770.   lib/float.c
  771.   lib/float.in.h
  772.   lib/fnmatch.c
  773.   lib/fnmatch.in.h
  774.   lib/fnmatch_loop.c
  775.   lib/fpurge.c
  776.   lib/freading.c
  777.   lib/freading.h
  778.   lib/fseek.c
  779.   lib/fseeko.c
  780.   lib/fstat.c
  781.   lib/fsync.c
  782.   lib/ftell.c
  783.   lib/ftello.c
  784.   lib/gai_strerror.c
  785.   lib/getaddrinfo.c
  786.   lib/getcwd-lgpl.c
  787.   lib/getdelim.c
  788.   lib/getdtablesize.c
  789.   lib/getgroups.c
  790.   lib/gethostname.c
  791.   lib/getline.c
  792.   lib/getpass.c
  793.   lib/getpass.h
  794.   lib/getpeername.c
  795.   lib/getsockname.c
  796.   lib/gettext.h
  797.   lib/gettimeofday.c
  798.   lib/getugroups.c
  799.   lib/getugroups.h
  800.   lib/gl_openssl.h
  801.   lib/glthread/lock.c
  802.   lib/glthread/lock.h
  803.   lib/glthread/threadlib.c
  804.   lib/ignore-value.h
  805.   lib/inet_ntop.c
  806.   lib/inet_pton.c
  807.   lib/intprops.h
  808.   lib/ioctl.c
  809.   lib/isatty.c
  810.   lib/itold.c
  811.   lib/langinfo.in.h
  812.   lib/listen.c
  813.   lib/localcharset.c
  814.   lib/localcharset.h
  815.   lib/locale.in.h
  816.   lib/localeconv.c
  817.   lib/lseek.c
  818.   lib/lstat.c
  819.   lib/malloc.c
  820.   lib/malloca.c
  821.   lib/malloca.h
  822.   lib/malloca.valgrind
  823.   lib/mbrtowc.c
  824.   lib/mbsinit.c
  825.   lib/mbsrtowcs-impl.h
  826.   lib/mbsrtowcs-state.c
  827.   lib/mbsrtowcs.c
  828.   lib/mbtowc-impl.h
  829.   lib/mbtowc.c
  830.   lib/md5.c
  831.   lib/md5.h
  832.   lib/memchr.c
  833.   lib/memchr.valgrind
  834.   lib/mgetgroups.c
  835.   lib/mgetgroups.h
  836.   lib/mkdtemp.c
  837.   lib/mkostemp.c
  838.   lib/mkostemps.c
  839.   lib/mktime-internal.h
  840.   lib/mktime.c
  841.   lib/msvc-inval.c
  842.   lib/msvc-inval.h
  843.   lib/msvc-nothrow.c
  844.   lib/msvc-nothrow.h
  845.   lib/net_if.in.h
  846.   lib/netdb.in.h
  847.   lib/netinet_in.in.h
  848.   lib/nl_langinfo.c
  849.   lib/nonblocking.c
  850.   lib/nonblocking.h
  851.   lib/open.c
  852.   lib/openpty.c
  853.   lib/passfd.c
  854.   lib/passfd.h
  855.   lib/pathmax.h
  856.   lib/perror.c
  857.   lib/physmem.c
  858.   lib/physmem.h
  859.   lib/pipe.c
  860.   lib/pipe2.c
  861.   lib/poll.c
  862.   lib/poll.in.h
  863.   lib/posix_openpt.c
  864.   lib/printf-args.c
  865.   lib/printf-args.h
  866.   lib/printf-parse.c
  867.   lib/printf-parse.h
  868.   lib/pthread.c
  869.   lib/pthread.in.h
  870.   lib/pthread_sigmask.c
  871.   lib/pty.in.h
  872.   lib/raise.c
  873.   lib/random_r.c
  874.   lib/rawmemchr.c
  875.   lib/rawmemchr.valgrind
  876.   lib/readlink.c
  877.   lib/realloc.c
  878.   lib/recv.c
  879.   lib/ref-add.sin
  880.   lib/ref-del.sin
  881.   lib/regcomp.c
  882.   lib/regex.c
  883.   lib/regex.h
  884.   lib/regex_internal.c
  885.   lib/regex_internal.h
  886.   lib/regexec.c
  887.   lib/sched.in.h
  888.   lib/secure_getenv.c
  889.   lib/select.c
  890.   lib/send.c
  891.   lib/setenv.c
  892.   lib/setsockopt.c
  893.   lib/sha256.c
  894.   lib/sha256.h
  895.   lib/sig-handler.c
  896.   lib/sig-handler.h
  897.   lib/sigaction.c
  898.   lib/signal.in.h
  899.   lib/sigprocmask.c
  900.   lib/size_max.h
  901.   lib/sleep.c
  902.   lib/snprintf.c
  903.   lib/socket.c
  904.   lib/sockets.c
  905.   lib/sockets.h
  906.   lib/stat-time.c
  907.   lib/stat-time.h
  908.   lib/stat.c
  909.   lib/stdalign.in.h
  910.   lib/stdarg.in.h
  911.   lib/stdbool.in.h
  912.   lib/stddef.in.h
  913.   lib/stdint.in.h
  914.   lib/stdio-impl.h
  915.   lib/stdio-read.c
  916.   lib/stdio-write.c
  917.   lib/stdio.in.h
  918.   lib/stdlib.in.h
  919.   lib/stpcpy.c
  920.   lib/str-two-way.h
  921.   lib/strcasecmp.c
  922.   lib/strchrnul.c
  923.   lib/strchrnul.valgrind
  924.   lib/strdup.c
  925.   lib/streq.h
  926.   lib/strerror-override.c
  927.   lib/strerror-override.h
  928.   lib/strerror.c
  929.   lib/strerror_r.c
  930.   lib/string.in.h
  931.   lib/strings.in.h
  932.   lib/stripslash.c
  933.   lib/strncasecmp.c
  934.   lib/strndup.c
  935.   lib/strnlen.c
  936.   lib/strnlen1.c
  937.   lib/strnlen1.h
  938.   lib/strptime.c
  939.   lib/strsep.c
  940.   lib/strtok_r.c
  941.   lib/sys_ioctl.in.h
  942.   lib/sys_select.in.h
  943.   lib/sys_socket.c
  944.   lib/sys_socket.in.h
  945.   lib/sys_stat.in.h
  946.   lib/sys_time.in.h
  947.   lib/sys_types.in.h
  948.   lib/sys_uio.in.h
  949.   lib/sys_utsname.in.h
  950.   lib/sys_wait.in.h
  951.   lib/tempname.c
  952.   lib/tempname.h
  953.   lib/termios.in.h
  954.   lib/time.in.h
  955.   lib/time_r.c
  956.   lib/timegm.c
  957.   lib/ttyname_r.c
  958.   lib/uname.c
  959.   lib/unistd.c
  960.   lib/unistd.in.h
  961.   lib/usleep.c
  962.   lib/vasnprintf.c
  963.   lib/vasnprintf.h
  964.   lib/vasprintf.c
  965.   lib/verify.h
  966.   lib/vsnprintf.c
  967.   lib/w32sock.h
  968.   lib/waitpid.c
  969.   lib/wchar.in.h
  970.   lib/wcrtomb.c
  971.   lib/wctype-h.c
  972.   lib/wctype.in.h
  973.   lib/xalloc-oversized.h
  974.   lib/xsize.c
  975.   lib/xsize.h
  976.   m4/00gnulib.m4
  977.   m4/absolute-header.m4
  978.   m4/alloca.m4
  979.   m4/arpa_inet_h.m4
  980.   m4/asm-underscore.m4
  981.   m4/autobuild.m4
  982.   m4/base64.m4
  983.   m4/btowc.m4
  984.   m4/byteswap.m4
  985.   m4/calloc.m4
  986.   m4/canonicalize.m4
  987.   m4/chown.m4
  988.   m4/clock_time.m4
  989.   m4/close.m4
  990.   m4/codeset.m4
  991.   m4/configmake.m4
  992.   m4/count-leading-zeros.m4
  993.   m4/count-one-bits.m4
  994.   m4/ctype.m4
  995.   m4/dirname.m4
  996.   m4/double-slash-root.m4
  997.   m4/dup.m4
  998.   m4/dup2.m4
  999.   m4/eealloc.m4
  1000.   m4/environ.m4
  1001.   m4/errno_h.m4
  1002.   m4/error.m4
  1003.   m4/execinfo.m4
  1004.   m4/exponentd.m4
  1005.   m4/exponentf.m4
  1006.   m4/exponentl.m4
  1007.   m4/extensions.m4
  1008.   m4/extern-inline.m4
  1009.   m4/fatal-signal.m4
  1010.   m4/fclose.m4
  1011.   m4/fcntl-o.m4
  1012.   m4/fcntl.m4
  1013.   m4/fcntl_h.m4
  1014.   m4/fdatasync.m4
  1015.   m4/fdopen.m4
  1016.   m4/fflush.m4
  1017.   m4/ffs.m4
  1018.   m4/ffsl.m4
  1019.   m4/float_h.m4
  1020.   m4/fnmatch.m4
  1021.   m4/fpieee.m4
  1022.   m4/fpurge.m4
  1023.   m4/freading.m4
  1024.   m4/fseek.m4
  1025.   m4/fseeko.m4
  1026.   m4/fstat.m4
  1027.   m4/fsync.m4
  1028.   m4/ftell.m4
  1029.   m4/ftello.m4
  1030.   m4/ftruncate.m4
  1031.   m4/func.m4
  1032.   m4/getaddrinfo.m4
  1033.   m4/getcwd.m4
  1034.   m4/getdelim.m4
  1035.   m4/getdtablesize.m4
  1036.   m4/getgroups.m4
  1037.   m4/gethostname.m4
  1038.   m4/getline.m4
  1039.   m4/getpagesize.m4
  1040.   m4/getpass.m4
  1041.   m4/gettimeofday.m4
  1042.   m4/getugroups.m4
  1043.   m4/gl-openssl.m4
  1044.   m4/glibc21.m4
  1045.   m4/gnulib-common.m4
  1046.   m4/grantpt.m4
  1047.   m4/hostent.m4
  1048.   m4/include_next.m4
  1049.   m4/inet_ntop.m4
  1050.   m4/inet_pton.m4
  1051.   m4/intlmacosx.m4
  1052.   m4/intmax_t.m4
  1053.   m4/inttypes-pri.m4
  1054.   m4/inttypes.m4
  1055.   m4/inttypes_h.m4
  1056.   m4/ioctl.m4
  1057.   m4/isatty.m4
  1058.   m4/isnand.m4
  1059.   m4/isnanf.m4
  1060.   m4/isnanl.m4
  1061.   m4/langinfo_h.m4
  1062.   m4/largefile.m4
  1063.   m4/lcmessage.m4
  1064.   m4/ldexp.m4
  1065.   m4/lib-ld.m4
  1066.   m4/lib-link.m4
  1067.   m4/lib-prefix.m4
  1068.   m4/localcharset.m4
  1069.   m4/locale-fr.m4
  1070.   m4/locale-ja.m4
  1071.   m4/locale-tr.m4
  1072.   m4/locale-zh.m4
  1073.   m4/locale_h.m4
  1074.   m4/localeconv.m4
  1075.   m4/localename.m4
  1076.   m4/lock.m4
  1077.   m4/longlong.m4
  1078.   m4/lseek.m4
  1079.   m4/lstat.m4
  1080.   m4/malloc.m4
  1081.   m4/malloca.m4
  1082.   m4/manywarnings.m4
  1083.   m4/math_h.m4
  1084.   m4/mbrtowc.m4
  1085.   m4/mbsinit.m4
  1086.   m4/mbsrtowcs.m4
  1087.   m4/mbstate_t.m4
  1088.   m4/mbtowc.m4
  1089.   m4/md5.m4
  1090.   m4/memchr.m4
  1091.   m4/mgetgroups.m4
  1092.   m4/mkdtemp.m4
  1093.   m4/mkostemp.m4
  1094.   m4/mkostemps.m4
  1095.   m4/mktime.m4
  1096.   m4/mmap-anon.m4
  1097.   m4/mode_t.m4
  1098.   m4/msvc-inval.m4
  1099.   m4/msvc-nothrow.m4
  1100.   m4/multiarch.m4
  1101.   m4/nanosleep.m4
  1102.   m4/net_if_h.m4
  1103.   m4/netdb_h.m4
  1104.   m4/netinet_in_h.m4
  1105.   m4/nl_langinfo.m4
  1106.   m4/nocrash.m4
  1107.   m4/nonblocking.m4
  1108.   m4/off_t.m4
  1109.   m4/onceonly.m4
  1110.   m4/open.m4
  1111.   m4/passfd.m4
  1112.   m4/pathmax.m4
  1113.   m4/perror.m4
  1114.   m4/physmem.m4
  1115.   m4/pipe.m4
  1116.   m4/pipe2.m4
  1117.   m4/poll.m4
  1118.   m4/poll_h.m4
  1119.   m4/posix-shell.m4
  1120.   m4/posix_openpt.m4
  1121.   m4/posix_spawn.m4
  1122.   m4/printf.m4
  1123.   m4/pthread.m4
  1124.   m4/pthread_sigmask.m4
  1125.   m4/ptsname.m4
  1126.   m4/ptsname_r.m4
  1127.   m4/pty.m4
  1128.   m4/pty_h.m4
  1129.   m4/putenv.m4
  1130.   m4/raise.m4
  1131.   m4/random_r.m4
  1132.   m4/rawmemchr.m4
  1133.   m4/read.m4
  1134.   m4/readlink.m4
  1135.   m4/realloc.m4
  1136.   m4/regex.m4
  1137.   m4/sched_h.m4
  1138.   m4/secure_getenv.m4
  1139.   m4/select.m4
  1140.   m4/servent.m4
  1141.   m4/setenv.m4
  1142.   m4/setlocale.m4
  1143.   m4/sha256.m4
  1144.   m4/sig_atomic_t.m4
  1145.   m4/sigaction.m4
  1146.   m4/signal_h.m4
  1147.   m4/signalblocking.m4
  1148.   m4/signbit.m4
  1149.   m4/sigpipe.m4
  1150.   m4/size_max.m4
  1151.   m4/sleep.m4
  1152.   m4/snprintf.m4
  1153.   m4/socketlib.m4
  1154.   m4/sockets.m4
  1155.   m4/socklen.m4
  1156.   m4/sockpfaf.m4
  1157.   m4/spawn_h.m4
  1158.   m4/ssize_t.m4
  1159.   m4/stat-time.m4
  1160.   m4/stat.m4
  1161.   m4/stdalign.m4
  1162.   m4/stdarg.m4
  1163.   m4/stdbool.m4
  1164.   m4/stddef_h.m4
  1165.   m4/stdint.m4
  1166.   m4/stdint_h.m4
  1167.   m4/stdio_h.m4
  1168.   m4/stdlib_h.m4
  1169.   m4/stpcpy.m4
  1170.   m4/strcase.m4
  1171.   m4/strchrnul.m4
  1172.   m4/strdup.m4
  1173.   m4/strerror.m4
  1174.   m4/strerror_r.m4
  1175.   m4/string_h.m4
  1176.   m4/strings_h.m4
  1177.   m4/strndup.m4
  1178.   m4/strnlen.m4
  1179.   m4/strptime.m4
  1180.   m4/strsep.m4
  1181.   m4/strtok_r.m4
  1182.   m4/symlink.m4
  1183.   m4/sys_ioctl_h.m4
  1184.   m4/sys_select_h.m4
  1185.   m4/sys_socket_h.m4
  1186.   m4/sys_stat_h.m4
  1187.   m4/sys_time_h.m4
  1188.   m4/sys_types_h.m4
  1189.   m4/sys_uio_h.m4
  1190.   m4/sys_utsname_h.m4
  1191.   m4/sys_wait_h.m4
  1192.   m4/tempname.m4
  1193.   m4/termios_h.m4
  1194.   m4/thread.m4
  1195.   m4/threadlib.m4
  1196.   m4/time_h.m4
  1197.   m4/time_r.m4
  1198.   m4/timegm.m4
  1199.   m4/tm_gmtoff.m4
  1200.   m4/ttyname_r.m4
  1201.   m4/uname.m4
  1202.   m4/ungetc.m4
  1203.   m4/unistd_h.m4
  1204.   m4/unlockpt.m4
  1205.   m4/usleep.m4
  1206.   m4/vasnprintf.m4
  1207.   m4/vasprintf.m4
  1208.   m4/vsnprintf.m4
  1209.   m4/wait-process.m4
  1210.   m4/waitpid.m4
  1211.   m4/warn-on-use.m4
  1212.   m4/warnings.m4
  1213.   m4/wchar_h.m4
  1214.   m4/wchar_t.m4
  1215.   m4/wcrtomb.m4
  1216.   m4/wctob.m4
  1217.   m4/wctomb.m4
  1218.   m4/wctype_h.m4
  1219.   m4/wint_t.m4
  1220.   m4/write.m4
  1221.   m4/xalloc.m4
  1222.   m4/xsize.m4
  1223.   tests/infinity.h
  1224.   tests/init.sh
  1225.   tests/macros.h
  1226.   tests/minus-zero.h
  1227.   tests/nan.h
  1228.   tests/nap.h
  1229.   tests/randomd.c
  1230.   tests/signature.h
  1231.   tests/socket-client.h
  1232.   tests/socket-server.h
  1233.   tests/test-accept.c
  1234.   tests/test-alloca-opt.c
  1235.   tests/test-areadlink.c
  1236.   tests/test-areadlink.h
  1237.   tests/test-arpa_inet.c
  1238.   tests/test-base64.c
  1239.   tests/test-binary-io.c
  1240.   tests/test-binary-io.sh
  1241.   tests/test-bind.c
  1242.   tests/test-bitrotate.c
  1243.   tests/test-btowc.c
  1244.   tests/test-btowc1.sh
  1245.   tests/test-btowc2.sh
  1246.   tests/test-byteswap.c
  1247.   tests/test-c-ctype.c
  1248.   tests/test-c-strcase.sh
  1249.   tests/test-c-strcasecmp.c
  1250.   tests/test-c-strcasestr.c
  1251.   tests/test-c-strncasecmp.c
  1252.   tests/test-canonicalize-lgpl.c
  1253.   tests/test-chown.c
  1254.   tests/test-chown.h
  1255.   tests/test-cloexec.c
  1256.   tests/test-close.c
  1257.   tests/test-connect.c
  1258.   tests/test-count-leading-zeros.c
  1259.   tests/test-count-one-bits.c
  1260.   tests/test-ctype.c
  1261.   tests/test-dup.c
  1262.   tests/test-dup2.c
  1263.   tests/test-environ.c
  1264.   tests/test-errno.c
  1265.   tests/test-fclose.c
  1266.   tests/test-fcntl-h.c
  1267.   tests/test-fcntl.c
  1268.   tests/test-fdatasync.c
  1269.   tests/test-fdopen.c
  1270.   tests/test-fflush.c
  1271.   tests/test-fflush2.c
  1272.   tests/test-fflush2.sh
  1273.   tests/test-ffs.c
  1274.   tests/test-ffsl.c
  1275.   tests/test-fgetc.c
  1276.   tests/test-float.c
  1277.   tests/test-fnmatch.c
  1278.   tests/test-fpurge.c
  1279.   tests/test-fputc.c
  1280.   tests/test-fread.c
  1281.   tests/test-freading.c
  1282.   tests/test-fseek.c
  1283.   tests/test-fseek.sh
  1284.   tests/test-fseek2.sh
  1285.   tests/test-fseeko.c
  1286.   tests/test-fseeko.sh
  1287.   tests/test-fseeko2.sh
  1288.   tests/test-fseeko3.c
  1289.   tests/test-fseeko3.sh
  1290.   tests/test-fseeko4.c
  1291.   tests/test-fseeko4.sh
  1292.   tests/test-fstat.c
  1293.   tests/test-fsync.c
  1294.   tests/test-ftell.c
  1295.   tests/test-ftell.sh
  1296.   tests/test-ftell2.sh
  1297.   tests/test-ftell3.c
  1298.   tests/test-ftello.c
  1299.   tests/test-ftello.sh
  1300.   tests/test-ftello2.sh
  1301.   tests/test-ftello3.c
  1302.   tests/test-ftello4.c
  1303.   tests/test-ftello4.sh
  1304.   tests/test-ftruncate.c
  1305.   tests/test-ftruncate.sh
  1306.   tests/test-func.c
  1307.   tests/test-fwrite.c
  1308.   tests/test-getaddrinfo.c
  1309.   tests/test-getcwd-lgpl.c
  1310.   tests/test-getdelim.c
  1311.   tests/test-getdtablesize.c
  1312.   tests/test-getgroups.c
  1313.   tests/test-gethostname.c
  1314.   tests/test-getline.c
  1315.   tests/test-getpeername.c
  1316.   tests/test-getsockname.c
  1317.   tests/test-getsockopt.c
  1318.   tests/test-gettimeofday.c
  1319.   tests/test-grantpt.c
  1320.   tests/test-ignore-value.c
  1321.   tests/test-inet_ntop.c
  1322.   tests/test-inet_pton.c
  1323.   tests/test-init.sh
  1324.   tests/test-intprops.c
  1325.   tests/test-inttypes.c
  1326.   tests/test-ioctl.c
  1327.   tests/test-isatty.c
  1328.   tests/test-isnand-nolibm.c
  1329.   tests/test-isnand.h
  1330.   tests/test-isnanf-nolibm.c
  1331.   tests/test-isnanf.h
  1332.   tests/test-isnanl-nolibm.c
  1333.   tests/test-isnanl.h
  1334.   tests/test-langinfo.c
  1335.   tests/test-ldexp.c
  1336.   tests/test-ldexp.h
  1337.   tests/test-listen.c
  1338.   tests/test-locale.c
  1339.   tests/test-localeconv.c
  1340.   tests/test-localename.c
  1341.   tests/test-lseek.c
  1342.   tests/test-lseek.sh
  1343.   tests/test-lstat.c
  1344.   tests/test-lstat.h
  1345.   tests/test-malloca.c
  1346.   tests/test-math.c
  1347.   tests/test-mbrtowc-w32-1.sh
  1348.   tests/test-mbrtowc-w32-2.sh
  1349.   tests/test-mbrtowc-w32-3.sh
  1350.   tests/test-mbrtowc-w32-4.sh
  1351.   tests/test-mbrtowc-w32-5.sh
  1352.   tests/test-mbrtowc-w32.c
  1353.   tests/test-mbrtowc.c
  1354.   tests/test-mbrtowc1.sh
  1355.   tests/test-mbrtowc2.sh
  1356.   tests/test-mbrtowc3.sh
  1357.   tests/test-mbrtowc4.sh
  1358.   tests/test-mbsinit.c
  1359.   tests/test-mbsinit.sh
  1360.   tests/test-mbsrtowcs.c
  1361.   tests/test-mbsrtowcs1.sh
  1362.   tests/test-mbsrtowcs2.sh
  1363.   tests/test-mbsrtowcs3.sh
  1364.   tests/test-mbsrtowcs4.sh
  1365.   tests/test-md5.c
  1366.   tests/test-memchr.c
  1367.   tests/test-nanosleep.c
  1368.   tests/test-net_if.c
  1369.   tests/test-netdb.c
  1370.   tests/test-netinet_in.c
  1371.   tests/test-nl_langinfo.c
  1372.   tests/test-nl_langinfo.sh
  1373.   tests/test-nonblocking-misc.h
  1374.   tests/test-nonblocking-pipe-child.c
  1375.   tests/test-nonblocking-pipe-main.c
  1376.   tests/test-nonblocking-pipe.h
  1377.   tests/test-nonblocking-pipe.sh
  1378.   tests/test-nonblocking-reader.h
  1379.   tests/test-nonblocking-socket-child.c
  1380.   tests/test-nonblocking-socket-main.c
  1381.   tests/test-nonblocking-socket.h
  1382.   tests/test-nonblocking-socket.sh
  1383.   tests/test-nonblocking-writer.h
  1384.   tests/test-nonblocking.c
  1385.   tests/test-open.c
  1386.   tests/test-open.h
  1387.   tests/test-openpty.c
  1388.   tests/test-passfd.c
  1389.   tests/test-pathmax.c
  1390.   tests/test-perror.c
  1391.   tests/test-perror.sh
  1392.   tests/test-perror2.c
  1393.   tests/test-pipe.c
  1394.   tests/test-pipe2.c
  1395.   tests/test-poll-h.c
  1396.   tests/test-poll.c
  1397.   tests/test-posix_openpt.c
  1398.   tests/test-posix_spawn1.c
  1399.   tests/test-posix_spawn1.in.sh
  1400.   tests/test-posix_spawn2.c
  1401.   tests/test-posix_spawn2.in.sh
  1402.   tests/test-posix_spawn_file_actions_addclose.c
  1403.   tests/test-posix_spawn_file_actions_adddup2.c
  1404.   tests/test-posix_spawn_file_actions_addopen.c
  1405.   tests/test-pthread_sigmask1.c
  1406.   tests/test-pthread_sigmask2.c
  1407.   tests/test-ptsname.c
  1408.   tests/test-ptsname_r.c
  1409.   tests/test-raise.c
  1410.   tests/test-random_r.c
  1411.   tests/test-rawmemchr.c
  1412.   tests/test-read.c
  1413.   tests/test-readlink.c
  1414.   tests/test-readlink.h
  1415.   tests/test-recv.c
  1416.   tests/test-regex.c
  1417.   tests/test-sched.c
  1418.   tests/test-select-fd.c
  1419.   tests/test-select-in.sh
  1420.   tests/test-select-out.sh
  1421.   tests/test-select-stdin.c
  1422.   tests/test-select.c
  1423.   tests/test-select.h
  1424.   tests/test-send.c
  1425.   tests/test-setenv.c
  1426.   tests/test-setlocale1.c
  1427.   tests/test-setlocale1.sh
  1428.   tests/test-setlocale2.c
  1429.   tests/test-setlocale2.sh
  1430.   tests/test-setsockopt.c
  1431.   tests/test-sigaction.c
  1432.   tests/test-signal-h.c
  1433.   tests/test-signbit.c
  1434.   tests/test-sigpipe.c
  1435.   tests/test-sigpipe.sh
  1436.   tests/test-sigprocmask.c
  1437.   tests/test-sleep.c
  1438.   tests/test-snprintf.c
  1439.   tests/test-sockets.c
  1440.   tests/test-spawn.c
  1441.   tests/test-stat-time.c
  1442.   tests/test-stat.c
  1443.   tests/test-stat.h
  1444.   tests/test-stdalign.c
  1445.   tests/test-stdbool.c
  1446.   tests/test-stddef.c
  1447.   tests/test-stdint.c
  1448.   tests/test-stdio.c
  1449.   tests/test-stdlib.c
  1450.   tests/test-strchrnul.c
  1451.   tests/test-strerror.c
  1452.   tests/test-strerror_r.c
  1453.   tests/test-string.c
  1454.   tests/test-strings.c
  1455.   tests/test-strnlen.c
  1456.   tests/test-symlink.c
  1457.   tests/test-symlink.h
  1458.   tests/test-sys_ioctl.c
  1459.   tests/test-sys_select.c
  1460.   tests/test-sys_socket.c
  1461.   tests/test-sys_stat.c
  1462.   tests/test-sys_time.c
  1463.   tests/test-sys_types.c
  1464.   tests/test-sys_uio.c
  1465.   tests/test-sys_utsname.c
  1466.   tests/test-sys_wait.c
  1467.   tests/test-sys_wait.h
  1468.   tests/test-termios.c
  1469.   tests/test-thread_create.c
  1470.   tests/test-thread_self.c
  1471.   tests/test-time.c
  1472.   tests/test-ttyname_r.c
  1473.   tests/test-uname.c
  1474.   tests/test-unistd.c
  1475.   tests/test-unlockpt.c
  1476.   tests/test-unsetenv.c
  1477.   tests/test-usleep.c
  1478.   tests/test-vasnprintf.c
  1479.   tests/test-vasprintf.c
  1480.   tests/test-vc-list-files-cvs.sh
  1481.   tests/test-vc-list-files-git.sh
  1482.   tests/test-verify.c
  1483.   tests/test-verify.sh
  1484.   tests/test-vsnprintf.c
  1485.   tests/test-wchar.c
  1486.   tests/test-wcrtomb-w32-1.sh
  1487.   tests/test-wcrtomb-w32-2.sh
  1488.   tests/test-wcrtomb-w32-3.sh
  1489.   tests/test-wcrtomb-w32-4.sh
  1490.   tests/test-wcrtomb-w32-5.sh
  1491.   tests/test-wcrtomb-w32.c
  1492.   tests/test-wcrtomb.c
  1493.   tests/test-wcrtomb.sh
  1494.   tests/test-wctype-h.c
  1495.   tests/test-write.c
  1496.   tests/test-xalloc-die.c
  1497.   tests/test-xalloc-die.sh
  1498.   tests/zerosize-ptr.h
  1499.   lib/ctype.in.h -> tests/ctype.in.h
  1500.   lib/dup.c -> tests/dup.c
  1501.   lib/error.c -> tests/error.c
  1502.   lib/error.h -> tests/error.h
  1503.   lib/exitfail.c -> tests/exitfail.c
  1504.   lib/exitfail.h -> tests/exitfail.h
  1505.   lib/fatal-signal.c -> tests/fatal-signal.c
  1506.   lib/fatal-signal.h -> tests/fatal-signal.h
  1507.   lib/fdopen.c -> tests/fdopen.c
  1508.   lib/float+.h -> tests/float+.h
  1509.   lib/fpucw.h -> tests/fpucw.h
  1510.   lib/ftruncate.c -> tests/ftruncate.c
  1511.   lib/getpagesize.c -> tests/getpagesize.c
  1512.   lib/getsockopt.c -> tests/getsockopt.c
  1513.   lib/glthread/thread.c -> tests/glthread/thread.c
  1514.   lib/glthread/thread.h -> tests/glthread/thread.h
  1515.   lib/grantpt.c -> tests/grantpt.c
  1516.   lib/inttypes.in.h -> tests/inttypes.in.h
  1517.   lib/isnan.c -> tests/isnan.c
  1518.   lib/isnand-nolibm.h -> tests/isnand-nolibm.h
  1519.   lib/isnand.c -> tests/isnand.c
  1520.   lib/isnanf-nolibm.h -> tests/isnanf-nolibm.h
  1521.   lib/isnanf.c -> tests/isnanf.c
  1522.   lib/isnanl-nolibm.h -> tests/isnanl-nolibm.h
  1523.   lib/isnanl.c -> tests/isnanl.c
  1524.   lib/localename.c -> tests/localename.c
  1525.   lib/localename.h -> tests/localename.h
  1526.   lib/math.c -> tests/math.c
  1527.   lib/math.in.h -> tests/math.in.h
  1528.   lib/nanosleep.c -> tests/nanosleep.c
  1529.   lib/progname.c -> tests/progname.c
  1530.   lib/progname.h -> tests/progname.h
  1531.   lib/ptsname.c -> tests/ptsname.c
  1532.   lib/ptsname_r.c -> tests/ptsname_r.c
  1533.   lib/pty-private.h -> tests/pty-private.h
  1534.   lib/putenv.c -> tests/putenv.c
  1535.   lib/read.c -> tests/read.c
  1536.   lib/same-inode.h -> tests/same-inode.h
  1537.   lib/setlocale.c -> tests/setlocale.c
  1538.   lib/signbitd.c -> tests/signbitd.c
  1539.   lib/signbitf.c -> tests/signbitf.c
  1540.   lib/signbitl.c -> tests/signbitl.c
  1541.   lib/spawn.in.h -> tests/spawn.in.h
  1542.   lib/spawn_faction_addclose.c -> tests/spawn_faction_addclose.c
  1543.   lib/spawn_faction_adddup2.c -> tests/spawn_faction_adddup2.c
  1544.   lib/spawn_faction_addopen.c -> tests/spawn_faction_addopen.c
  1545.   lib/spawn_faction_destroy.c -> tests/spawn_faction_destroy.c
  1546.   lib/spawn_faction_init.c -> tests/spawn_faction_init.c
  1547.   lib/spawn_int.h -> tests/spawn_int.h
  1548.   lib/spawnattr_destroy.c -> tests/spawnattr_destroy.c
  1549.   lib/spawnattr_init.c -> tests/spawnattr_init.c
  1550.   lib/spawnattr_setflags.c -> tests/spawnattr_setflags.c
  1551.   lib/spawnattr_setsigmask.c -> tests/spawnattr_setsigmask.c
  1552.   lib/spawni.c -> tests/spawni.c
  1553.   lib/spawnp.c -> tests/spawnp.c
  1554.   lib/symlink.c -> tests/symlink.c
  1555.   lib/unlockpt.c -> tests/unlockpt.c
  1556.   lib/unsetenv.c -> tests/unsetenv.c
  1557.   lib/w32sock.h -> tests/w32sock.h
  1558.   lib/wait-process.c -> tests/wait-process.c
  1559.   lib/wait-process.h -> tests/wait-process.h
  1560.   lib/wctob.c -> tests/wctob.c
  1561.   lib/wctomb-impl.h -> tests/wctomb-impl.h
  1562.   lib/wctomb.c -> tests/wctomb.c
  1563.   lib/write.c -> tests/write.c
  1564.   lib/xalloc-die.c -> tests/xalloc-die.c
  1565.   lib/xalloc.h -> tests/xalloc.h
  1566.   lib/xmalloc.c -> tests/xmalloc.c
  1567.   top/GNUmakefile
  1568.   top/maint.mk
  1569. Creating directory ./build-aux/snippet
  1570. Creating directory ./gnulib/lib/glthread
  1571. Creating directory ./gnulib/tests/glthread
  1572. Copying file GNUmakefile
  1573. Replacing file build-aux/config.rpath (non-gnulib code backed up in build-aux/config.rpath~) !!
  1574. Copying file build-aux/gitlog-to-changelog
  1575. Copying file build-aux/mktempd
  1576. Copying file build-aux/snippet/_Noreturn.h
  1577. Copying file build-aux/snippet/arg-nonnull.h
  1578. Copying file build-aux/snippet/c++defs.h
  1579. Copying file build-aux/snippet/unused-parameter.h
  1580. Copying file build-aux/snippet/warn-on-use.h
  1581. Copying file build-aux/useless-if-before-free
  1582. Copying file build-aux/vc-list-files
  1583. Copying file gnulib/lib/accept.c
  1584. Copying file gnulib/lib/alloca.c
  1585. Copying file gnulib/lib/alloca.in.h
  1586. Copying file gnulib/lib/allocator.c
  1587. Copying file gnulib/lib/allocator.h
  1588. Copying file gnulib/lib/areadlink.c
  1589. Copying file gnulib/lib/areadlink.h
  1590. Copying file gnulib/lib/arpa_inet.in.h
  1591. Copying file gnulib/lib/asnprintf.c
  1592. Copying file gnulib/lib/asprintf.c
  1593. Copying file gnulib/lib/assure.h
  1594. Copying file gnulib/lib/base64.c
  1595. Copying file gnulib/lib/base64.h
  1596. Copying file gnulib/lib/basename-lgpl.c
  1597. Copying file gnulib/lib/binary-io.c
  1598. Copying file gnulib/lib/binary-io.h
  1599. Copying file gnulib/lib/bind.c
  1600. Copying file gnulib/lib/bitrotate.c
  1601. Copying file gnulib/lib/bitrotate.h
  1602. Copying file gnulib/lib/btowc.c
  1603. Copying file gnulib/lib/byteswap.in.h
  1604. Copying file gnulib/lib/c-ctype.c
  1605. Copying file gnulib/lib/c-ctype.h
  1606. Copying file gnulib/lib/c-strcase.h
  1607. Copying file gnulib/lib/c-strcasecmp.c
  1608. Copying file gnulib/lib/c-strcasestr.c
  1609. Copying file gnulib/lib/c-strcasestr.h
  1610. Copying file gnulib/lib/c-strncasecmp.c
  1611. Copying file gnulib/lib/calloc.c
  1612. Copying file gnulib/lib/canonicalize-lgpl.c
  1613. Copying file gnulib/lib/careadlinkat.c
  1614. Copying file gnulib/lib/careadlinkat.h
  1615. Copying file gnulib/lib/chown.c
  1616. Copying file gnulib/lib/cloexec.c
  1617. Copying file gnulib/lib/cloexec.h
  1618. Copying file gnulib/lib/close.c
  1619. Copying file gnulib/lib/config.charset
  1620. Copying file gnulib/lib/connect.c
  1621. Copying file gnulib/lib/count-leading-zeros.c
  1622. Copying file gnulib/lib/count-leading-zeros.h
  1623. Copying file gnulib/lib/count-one-bits.c
  1624. Copying file gnulib/lib/count-one-bits.h
  1625. Copying file gnulib/lib/dirname-lgpl.c
  1626. Copying file gnulib/lib/dirname.h
  1627. Copying file gnulib/lib/dosname.h
  1628. Copying file gnulib/lib/dup2.c
  1629. Copying file gnulib/lib/errno.in.h
  1630. Copying file gnulib/lib/execinfo.c
  1631. Copying file gnulib/lib/execinfo.in.h
  1632. Copying file gnulib/lib/fchown-stub.c
  1633. Copying file gnulib/lib/fclose.c
  1634. Copying file gnulib/lib/fcntl.c
  1635. Copying file gnulib/lib/fcntl.in.h
  1636. Copying file gnulib/lib/fd-hook.c
  1637. Copying file gnulib/lib/fd-hook.h
  1638. Copying file gnulib/lib/fdatasync.c
  1639. Copying file gnulib/lib/fflush.c
  1640. Copying file gnulib/lib/ffs.c
  1641. Copying file gnulib/lib/ffsl.c
  1642. Copying file gnulib/lib/ffsl.h
  1643. Copying file gnulib/lib/float+.h
  1644. Copying file gnulib/lib/float.c
  1645. Copying file gnulib/lib/float.in.h
  1646. Copying file gnulib/lib/fnmatch.c
  1647. Copying file gnulib/lib/fnmatch.in.h
  1648. Copying file gnulib/lib/fnmatch_loop.c
  1649. Copying file gnulib/lib/fpurge.c
  1650. Copying file gnulib/lib/freading.c
  1651. Copying file gnulib/lib/freading.h
  1652. Copying file gnulib/lib/fseek.c
  1653. Copying file gnulib/lib/fseeko.c
  1654. Copying file gnulib/lib/fstat.c
  1655. Copying file gnulib/lib/fsync.c
  1656. Copying file gnulib/lib/ftell.c
  1657. Copying file gnulib/lib/ftello.c
  1658. Copying file gnulib/lib/gai_strerror.c
  1659. Copying file gnulib/lib/getaddrinfo.c
  1660. Copying file gnulib/lib/getcwd-lgpl.c
  1661. Copying file gnulib/lib/getdelim.c
  1662. Copying file gnulib/lib/getdtablesize.c
  1663. Copying file gnulib/lib/getgroups.c
  1664. Copying file gnulib/lib/gethostname.c
  1665. Copying file gnulib/lib/getline.c
  1666. Copying file gnulib/lib/getpass.c
  1667. Copying file gnulib/lib/getpass.h
  1668. Copying file gnulib/lib/getpeername.c
  1669. Copying file gnulib/lib/getsockname.c
  1670. Copying file gnulib/lib/gettext.h
  1671. Copying file gnulib/lib/gettimeofday.c
  1672. Copying file gnulib/lib/getugroups.c
  1673. Copying file gnulib/lib/getugroups.h
  1674. Copying file gnulib/lib/gl_openssl.h
  1675. Copying file gnulib/lib/glthread/lock.c
  1676. Copying file gnulib/lib/glthread/lock.h
  1677. Copying file gnulib/lib/glthread/threadlib.c
  1678. Copying file gnulib/lib/ignore-value.h
  1679. Copying file gnulib/lib/inet_ntop.c
  1680. Copying file gnulib/lib/inet_pton.c
  1681. Copying file gnulib/lib/intprops.h
  1682. Copying file gnulib/lib/ioctl.c
  1683. Copying file gnulib/lib/isatty.c
  1684. Copying file gnulib/lib/itold.c
  1685. Copying file gnulib/lib/langinfo.in.h
  1686. Copying file gnulib/lib/listen.c
  1687. Copying file gnulib/lib/localcharset.c
  1688. Copying file gnulib/lib/localcharset.h
  1689. Copying file gnulib/lib/locale.in.h
  1690. Copying file gnulib/lib/localeconv.c
  1691. Copying file gnulib/lib/lseek.c
  1692. Copying file gnulib/lib/lstat.c
  1693. Copying file gnulib/lib/malloc.c
  1694. Copying file gnulib/lib/malloca.c
  1695. Copying file gnulib/lib/malloca.h
  1696. Copying file gnulib/lib/malloca.valgrind
  1697. Copying file gnulib/lib/mbrtowc.c
  1698. Copying file gnulib/lib/mbsinit.c
  1699. Copying file gnulib/lib/mbsrtowcs-impl.h
  1700. Copying file gnulib/lib/mbsrtowcs-state.c
  1701. Copying file gnulib/lib/mbsrtowcs.c
  1702. Copying file gnulib/lib/mbtowc-impl.h
  1703. Copying file gnulib/lib/mbtowc.c
  1704. Copying file gnulib/lib/md5.c
  1705. Copying file gnulib/lib/md5.h
  1706. Copying file gnulib/lib/memchr.c
  1707. Copying file gnulib/lib/memchr.valgrind
  1708. Copying file gnulib/lib/mgetgroups.c
  1709. Copying file gnulib/lib/mgetgroups.h
  1710. Copying file gnulib/lib/mkdtemp.c
  1711. Copying file gnulib/lib/mkostemp.c
  1712. Copying file gnulib/lib/mkostemps.c
  1713. Copying file gnulib/lib/mktime-internal.h
  1714. Copying file gnulib/lib/mktime.c
  1715. Copying file gnulib/lib/msvc-inval.c
  1716. Copying file gnulib/lib/msvc-inval.h
  1717. Copying file gnulib/lib/msvc-nothrow.c
  1718. Copying file gnulib/lib/msvc-nothrow.h
  1719. Copying file gnulib/lib/net_if.in.h
  1720. Copying file gnulib/lib/netdb.in.h
  1721. Copying file gnulib/lib/netinet_in.in.h
  1722. Copying file gnulib/lib/nl_langinfo.c
  1723. Copying file gnulib/lib/nonblocking.c
  1724. Copying file gnulib/lib/nonblocking.h
  1725. Copying file gnulib/lib/open.c
  1726. Copying file gnulib/lib/openpty.c
  1727. Copying file gnulib/lib/passfd.c
  1728. Copying file gnulib/lib/passfd.h
  1729. Copying file gnulib/lib/pathmax.h
  1730. Copying file gnulib/lib/perror.c
  1731. Copying file gnulib/lib/physmem.c
  1732. Copying file gnulib/lib/physmem.h
  1733. Copying file gnulib/lib/pipe.c
  1734. Copying file gnulib/lib/pipe2.c
  1735. Copying file gnulib/lib/poll.c
  1736. Copying file gnulib/lib/poll.in.h
  1737. Copying file gnulib/lib/posix_openpt.c
  1738. Copying file gnulib/lib/printf-args.c
  1739. Copying file gnulib/lib/printf-args.h
  1740. Copying file gnulib/lib/printf-parse.c
  1741. Copying file gnulib/lib/printf-parse.h
  1742. Copying file gnulib/lib/pthread.c
  1743. Copying file gnulib/lib/pthread.in.h
  1744. Copying file gnulib/lib/pthread_sigmask.c
  1745. Copying file gnulib/lib/pty.in.h
  1746. Copying file gnulib/lib/raise.c
  1747. Copying file gnulib/lib/random_r.c
  1748. Copying file gnulib/lib/rawmemchr.c
  1749. Copying file gnulib/lib/rawmemchr.valgrind
  1750. Copying file gnulib/lib/readlink.c
  1751. Copying file gnulib/lib/realloc.c
  1752. Copying file gnulib/lib/recv.c
  1753. Copying file gnulib/lib/ref-add.sin
  1754. Copying file gnulib/lib/ref-del.sin
  1755. Copying file gnulib/lib/regcomp.c
  1756. Copying file gnulib/lib/regex.c
  1757. Copying file gnulib/lib/regex.h
  1758. Copying file gnulib/lib/regex_internal.c
  1759. Copying file gnulib/lib/regex_internal.h
  1760. Copying file gnulib/lib/regexec.c
  1761. Copying file gnulib/lib/sched.in.h
  1762. Copying file gnulib/lib/secure_getenv.c
  1763. Copying file gnulib/lib/select.c
  1764. Copying file gnulib/lib/send.c
  1765. Copying file gnulib/lib/setenv.c
  1766. Copying file gnulib/lib/setsockopt.c
  1767. Copying file gnulib/lib/sha256.c
  1768. Copying file gnulib/lib/sha256.h
  1769. Copying file gnulib/lib/sig-handler.c
  1770. Copying file gnulib/lib/sig-handler.h
  1771. Copying file gnulib/lib/sigaction.c
  1772. Copying file gnulib/lib/signal.in.h
  1773. Copying file gnulib/lib/sigprocmask.c
  1774. Copying file gnulib/lib/size_max.h
  1775. Copying file gnulib/lib/sleep.c
  1776. Copying file gnulib/lib/snprintf.c
  1777. Copying file gnulib/lib/socket.c
  1778. Copying file gnulib/lib/sockets.c
  1779. Copying file gnulib/lib/sockets.h
  1780. Copying file gnulib/lib/stat-time.c
  1781. Copying file gnulib/lib/stat-time.h
  1782. Copying file gnulib/lib/stat.c
  1783. Copying file gnulib/lib/stdalign.in.h
  1784. Copying file gnulib/lib/stdarg.in.h
  1785. Copying file gnulib/lib/stdbool.in.h
  1786. Copying file gnulib/lib/stddef.in.h
  1787. Copying file gnulib/lib/stdint.in.h
  1788. Copying file gnulib/lib/stdio-impl.h
  1789. Copying file gnulib/lib/stdio-read.c
  1790. Copying file gnulib/lib/stdio-write.c
  1791. Copying file gnulib/lib/stdio.in.h
  1792. Copying file gnulib/lib/stdlib.in.h
  1793. Copying file gnulib/lib/stpcpy.c
  1794. Copying file gnulib/lib/str-two-way.h
  1795. Copying file gnulib/lib/strcasecmp.c
  1796. Copying file gnulib/lib/strchrnul.c
  1797. Copying file gnulib/lib/strchrnul.valgrind
  1798. Copying file gnulib/lib/strdup.c
  1799. Copying file gnulib/lib/streq.h
  1800. Copying file gnulib/lib/strerror-override.c
  1801. Copying file gnulib/lib/strerror-override.h
  1802. Copying file gnulib/lib/strerror.c
  1803. Copying file gnulib/lib/strerror_r.c
  1804. Copying file gnulib/lib/string.in.h
  1805. Copying file gnulib/lib/strings.in.h
  1806. Copying file gnulib/lib/stripslash.c
  1807. Copying file gnulib/lib/strncasecmp.c
  1808. Copying file gnulib/lib/strndup.c
  1809. Copying file gnulib/lib/strnlen.c
  1810. Copying file gnulib/lib/strnlen1.c
  1811. Copying file gnulib/lib/strnlen1.h
  1812. Copying file gnulib/lib/strptime.c
  1813. Copying file gnulib/lib/strsep.c
  1814. Copying file gnulib/lib/strtok_r.c
  1815. Copying file gnulib/lib/sys_ioctl.in.h
  1816. Copying file gnulib/lib/sys_select.in.h
  1817. Copying file gnulib/lib/sys_socket.c
  1818. Copying file gnulib/lib/sys_socket.in.h
  1819. Copying file gnulib/lib/sys_stat.in.h
  1820. Copying file gnulib/lib/sys_time.in.h
  1821. Copying file gnulib/lib/sys_types.in.h
  1822. Copying file gnulib/lib/sys_uio.in.h
  1823. Copying file gnulib/lib/sys_utsname.in.h
  1824. Copying file gnulib/lib/sys_wait.in.h
  1825. Copying file gnulib/lib/tempname.c
  1826. Copying file gnulib/lib/tempname.h
  1827. Copying file gnulib/lib/termios.in.h
  1828. Copying file gnulib/lib/time.in.h
  1829. Copying file gnulib/lib/time_r.c
  1830. Copying file gnulib/lib/timegm.c
  1831. Copying file gnulib/lib/ttyname_r.c
  1832. Copying file gnulib/lib/uname.c
  1833. Copying file gnulib/lib/unistd.c
  1834. Copying file gnulib/lib/unistd.in.h
  1835. Copying file gnulib/lib/usleep.c
  1836. Copying file gnulib/lib/vasnprintf.c
  1837. Copying file gnulib/lib/vasnprintf.h
  1838. Copying file gnulib/lib/vasprintf.c
  1839. Copying file gnulib/lib/verify.h
  1840. Copying file gnulib/lib/vsnprintf.c
  1841. Copying file gnulib/lib/w32sock.h
  1842. Copying file gnulib/lib/waitpid.c
  1843. Copying file gnulib/lib/wchar.in.h
  1844. Copying file gnulib/lib/wcrtomb.c
  1845. Copying file gnulib/lib/wctype-h.c
  1846. Copying file gnulib/lib/wctype.in.h
  1847. Copying file gnulib/lib/xalloc-oversized.h
  1848. Copying file gnulib/lib/xsize.c
  1849. Copying file gnulib/lib/xsize.h
  1850. Copying file gnulib/tests/ctype.in.h
  1851. Copying file gnulib/tests/dup.c
  1852. Copying file gnulib/tests/error.c
  1853. Copying file gnulib/tests/error.h
  1854. Copying file gnulib/tests/exitfail.c
  1855. Copying file gnulib/tests/exitfail.h
  1856. Copying file gnulib/tests/fatal-signal.c
  1857. Copying file gnulib/tests/fatal-signal.h
  1858. Copying file gnulib/tests/fdopen.c
  1859. Copying file gnulib/tests/float+.h
  1860. Copying file gnulib/tests/fpucw.h
  1861. Copying file gnulib/tests/ftruncate.c
  1862. Copying file gnulib/tests/getpagesize.c
  1863. Copying file gnulib/tests/getsockopt.c
  1864. Copying file gnulib/tests/glthread/thread.c
  1865. Copying file gnulib/tests/glthread/thread.h
  1866. Copying file gnulib/tests/grantpt.c
  1867. Copying file gnulib/tests/infinity.h
  1868. Copying file gnulib/tests/init.sh
  1869. Copying file gnulib/tests/inttypes.in.h
  1870. Copying file gnulib/tests/isnan.c
  1871. Copying file gnulib/tests/isnand-nolibm.h
  1872. Copying file gnulib/tests/isnand.c
  1873. Copying file gnulib/tests/isnanf-nolibm.h
  1874. Copying file gnulib/tests/isnanf.c
  1875. Copying file gnulib/tests/isnanl-nolibm.h
  1876. Copying file gnulib/tests/isnanl.c
  1877. Copying file gnulib/tests/localename.c
  1878. Copying file gnulib/tests/localename.h
  1879. Copying file gnulib/tests/macros.h
  1880. Copying file gnulib/tests/math.c
  1881. Copying file gnulib/tests/math.in.h
  1882. Copying file gnulib/tests/minus-zero.h
  1883. Copying file gnulib/tests/nan.h
  1884. Copying file gnulib/tests/nanosleep.c
  1885. Copying file gnulib/tests/nap.h
  1886. Copying file gnulib/tests/progname.c
  1887. Copying file gnulib/tests/progname.h
  1888. Copying file gnulib/tests/ptsname.c
  1889. Copying file gnulib/tests/ptsname_r.c
  1890. Copying file gnulib/tests/pty-private.h
  1891. Copying file gnulib/tests/putenv.c
  1892. Copying file gnulib/tests/randomd.c
  1893. Copying file gnulib/tests/read.c
  1894. Copying file gnulib/tests/same-inode.h
  1895. Copying file gnulib/tests/setlocale.c
  1896. Copying file gnulib/tests/signature.h
  1897. Copying file gnulib/tests/signbitd.c
  1898. Copying file gnulib/tests/signbitf.c
  1899. Copying file gnulib/tests/signbitl.c
  1900. Copying file gnulib/tests/socket-client.h
  1901. Copying file gnulib/tests/socket-server.h
  1902. Copying file gnulib/tests/spawn.in.h
  1903. Copying file gnulib/tests/spawn_faction_addclose.c
  1904. Copying file gnulib/tests/spawn_faction_adddup2.c
  1905. Copying file gnulib/tests/spawn_faction_addopen.c
  1906. Copying file gnulib/tests/spawn_faction_destroy.c
  1907. Copying file gnulib/tests/spawn_faction_init.c
  1908. Copying file gnulib/tests/spawn_int.h
  1909. Copying file gnulib/tests/spawnattr_destroy.c
  1910. Copying file gnulib/tests/spawnattr_init.c
  1911. Copying file gnulib/tests/spawnattr_setflags.c
  1912. Copying file gnulib/tests/spawnattr_setsigmask.c
  1913. Copying file gnulib/tests/spawni.c
  1914. Copying file gnulib/tests/spawnp.c
  1915. Copying file gnulib/tests/symlink.c
  1916. Copying file gnulib/tests/test-accept.c
  1917. Copying file gnulib/tests/test-alloca-opt.c
  1918. Copying file gnulib/tests/test-areadlink.c
  1919. Copying file gnulib/tests/test-areadlink.h
  1920. Copying file gnulib/tests/test-arpa_inet.c
  1921. Copying file gnulib/tests/test-base64.c
  1922. Copying file gnulib/tests/test-binary-io.c
  1923. Copying file gnulib/tests/test-binary-io.sh
  1924. Copying file gnulib/tests/test-bind.c
  1925. Copying file gnulib/tests/test-bitrotate.c
  1926. Copying file gnulib/tests/test-btowc.c
  1927. Copying file gnulib/tests/test-btowc1.sh
  1928. Copying file gnulib/tests/test-btowc2.sh
  1929. Copying file gnulib/tests/test-byteswap.c
  1930. Copying file gnulib/tests/test-c-ctype.c
  1931. Copying file gnulib/tests/test-c-strcase.sh
  1932. Copying file gnulib/tests/test-c-strcasecmp.c
  1933. Copying file gnulib/tests/test-c-strcasestr.c
  1934. Copying file gnulib/tests/test-c-strncasecmp.c
  1935. Copying file gnulib/tests/test-canonicalize-lgpl.c
  1936. Copying file gnulib/tests/test-chown.c
  1937. Copying file gnulib/tests/test-chown.h
  1938. Copying file gnulib/tests/test-cloexec.c
  1939. Copying file gnulib/tests/test-close.c
  1940. Copying file gnulib/tests/test-connect.c
  1941. Copying file gnulib/tests/test-count-leading-zeros.c
  1942. Copying file gnulib/tests/test-count-one-bits.c
  1943. Copying file gnulib/tests/test-ctype.c
  1944. Copying file gnulib/tests/test-dup.c
  1945. Copying file gnulib/tests/test-dup2.c
  1946. Copying file gnulib/tests/test-environ.c
  1947. Copying file gnulib/tests/test-errno.c
  1948. Copying file gnulib/tests/test-fclose.c
  1949. Copying file gnulib/tests/test-fcntl-h.c
  1950. Copying file gnulib/tests/test-fcntl.c
  1951. Copying file gnulib/tests/test-fdatasync.c
  1952. Copying file gnulib/tests/test-fdopen.c
  1953. Copying file gnulib/tests/test-fflush.c
  1954. Copying file gnulib/tests/test-fflush2.c
  1955. Copying file gnulib/tests/test-fflush2.sh
  1956. Copying file gnulib/tests/test-ffs.c
  1957. Copying file gnulib/tests/test-ffsl.c
  1958. Copying file gnulib/tests/test-fgetc.c
  1959. Copying file gnulib/tests/test-float.c
  1960. Copying file gnulib/tests/test-fnmatch.c
  1961. Copying file gnulib/tests/test-fpurge.c
  1962. Copying file gnulib/tests/test-fputc.c
  1963. Copying file gnulib/tests/test-fread.c
  1964. Copying file gnulib/tests/test-freading.c
  1965. Copying file gnulib/tests/test-fseek.c
  1966. Copying file gnulib/tests/test-fseek.sh
  1967. Copying file gnulib/tests/test-fseek2.sh
  1968. Copying file gnulib/tests/test-fseeko.c
  1969. Copying file gnulib/tests/test-fseeko.sh
  1970. Copying file gnulib/tests/test-fseeko2.sh
  1971. Copying file gnulib/tests/test-fseeko3.c
  1972. Copying file gnulib/tests/test-fseeko3.sh
  1973. Copying file gnulib/tests/test-fseeko4.c
  1974. Copying file gnulib/tests/test-fseeko4.sh
  1975. Copying file gnulib/tests/test-fstat.c
  1976. Copying file gnulib/tests/test-fsync.c
  1977. Copying file gnulib/tests/test-ftell.c
  1978. Copying file gnulib/tests/test-ftell.sh
  1979. Copying file gnulib/tests/test-ftell2.sh
  1980. Copying file gnulib/tests/test-ftell3.c
  1981. Copying file gnulib/tests/test-ftello.c
  1982. Copying file gnulib/tests/test-ftello.sh
  1983. Copying file gnulib/tests/test-ftello2.sh
  1984. Copying file gnulib/tests/test-ftello3.c
  1985. Copying file gnulib/tests/test-ftello4.c
  1986. Copying file gnulib/tests/test-ftello4.sh
  1987. Copying file gnulib/tests/test-ftruncate.c
  1988. Copying file gnulib/tests/test-ftruncate.sh
  1989. Copying file gnulib/tests/test-func.c
  1990. Copying file gnulib/tests/test-fwrite.c
  1991. Copying file gnulib/tests/test-getaddrinfo.c
  1992. Copying file gnulib/tests/test-getcwd-lgpl.c
  1993. Copying file gnulib/tests/test-getdelim.c
  1994. Copying file gnulib/tests/test-getdtablesize.c
  1995. Copying file gnulib/tests/test-getgroups.c
  1996. Copying file gnulib/tests/test-gethostname.c
  1997. Copying file gnulib/tests/test-getline.c
  1998. Copying file gnulib/tests/test-getpeername.c
  1999. Copying file gnulib/tests/test-getsockname.c
  2000. Copying file gnulib/tests/test-getsockopt.c
  2001. Copying file gnulib/tests/test-gettimeofday.c
  2002. Copying file gnulib/tests/test-grantpt.c
  2003. Copying file gnulib/tests/test-ignore-value.c
  2004. Copying file gnulib/tests/test-inet_ntop.c
  2005. Copying file gnulib/tests/test-inet_pton.c
  2006. Copying file gnulib/tests/test-init.sh
  2007. Copying file gnulib/tests/test-intprops.c
  2008. Copying file gnulib/tests/test-inttypes.c
  2009. Copying file gnulib/tests/test-ioctl.c
  2010. Copying file gnulib/tests/test-isatty.c
  2011. Copying file gnulib/tests/test-isnand-nolibm.c
  2012. Copying file gnulib/tests/test-isnand.h
  2013. Copying file gnulib/tests/test-isnanf-nolibm.c
  2014. Copying file gnulib/tests/test-isnanf.h
  2015. Copying file gnulib/tests/test-isnanl-nolibm.c
  2016. Copying file gnulib/tests/test-isnanl.h
  2017. Copying file gnulib/tests/test-langinfo.c
  2018. Copying file gnulib/tests/test-ldexp.c
  2019. Copying file gnulib/tests/test-ldexp.h
  2020. Copying file gnulib/tests/test-listen.c
  2021. Copying file gnulib/tests/test-locale.c
  2022. Copying file gnulib/tests/test-localeconv.c
  2023. Copying file gnulib/tests/test-localename.c
  2024. Copying file gnulib/tests/test-lseek.c
  2025. Copying file gnulib/tests/test-lseek.sh
  2026. Copying file gnulib/tests/test-lstat.c
  2027. Copying file gnulib/tests/test-lstat.h
  2028. Copying file gnulib/tests/test-malloca.c
  2029. Copying file gnulib/tests/test-math.c
  2030. Copying file gnulib/tests/test-mbrtowc-w32-1.sh
  2031. Copying file gnulib/tests/test-mbrtowc-w32-2.sh
  2032. Copying file gnulib/tests/test-mbrtowc-w32-3.sh
  2033. Copying file gnulib/tests/test-mbrtowc-w32-4.sh
  2034. Copying file gnulib/tests/test-mbrtowc-w32-5.sh
  2035. Copying file gnulib/tests/test-mbrtowc-w32.c
  2036. Copying file gnulib/tests/test-mbrtowc.c
  2037. Copying file gnulib/tests/test-mbrtowc1.sh
  2038. Copying file gnulib/tests/test-mbrtowc2.sh
  2039. Copying file gnulib/tests/test-mbrtowc3.sh
  2040. Copying file gnulib/tests/test-mbrtowc4.sh
  2041. Copying file gnulib/tests/test-mbsinit.c
  2042. Copying file gnulib/tests/test-mbsinit.sh
  2043. Copying file gnulib/tests/test-mbsrtowcs.c
  2044. Copying file gnulib/tests/test-mbsrtowcs1.sh
  2045. Copying file gnulib/tests/test-mbsrtowcs2.sh
  2046. Copying file gnulib/tests/test-mbsrtowcs3.sh
  2047. Copying file gnulib/tests/test-mbsrtowcs4.sh
  2048. Copying file gnulib/tests/test-md5.c
  2049. Copying file gnulib/tests/test-memchr.c
  2050. Copying file gnulib/tests/test-nanosleep.c
  2051. Copying file gnulib/tests/test-net_if.c
  2052. Copying file gnulib/tests/test-netdb.c
  2053. Copying file gnulib/tests/test-netinet_in.c
  2054. Copying file gnulib/tests/test-nl_langinfo.c
  2055. Copying file gnulib/tests/test-nl_langinfo.sh
  2056. Copying file gnulib/tests/test-nonblocking-misc.h
  2057. Copying file gnulib/tests/test-nonblocking-pipe-child.c
  2058. Copying file gnulib/tests/test-nonblocking-pipe-main.c
  2059. Copying file gnulib/tests/test-nonblocking-pipe.h
  2060. Copying file gnulib/tests/test-nonblocking-pipe.sh
  2061. Copying file gnulib/tests/test-nonblocking-reader.h
  2062. Copying file gnulib/tests/test-nonblocking-socket-child.c
  2063. Copying file gnulib/tests/test-nonblocking-socket-main.c
  2064. Copying file gnulib/tests/test-nonblocking-socket.h
  2065. Copying file gnulib/tests/test-nonblocking-socket.sh
  2066. Copying file gnulib/tests/test-nonblocking-writer.h
  2067. Copying file gnulib/tests/test-nonblocking.c
  2068. Copying file gnulib/tests/test-open.c
  2069. Copying file gnulib/tests/test-open.h
  2070. Copying file gnulib/tests/test-openpty.c
  2071. Copying file gnulib/tests/test-passfd.c
  2072. Copying file gnulib/tests/test-pathmax.c
  2073. Copying file gnulib/tests/test-perror.c
  2074. Copying file gnulib/tests/test-perror.sh
  2075. Copying file gnulib/tests/test-perror2.c
  2076. Copying file gnulib/tests/test-pipe.c
  2077. Copying file gnulib/tests/test-pipe2.c
  2078. Copying file gnulib/tests/test-poll-h.c
  2079. Copying file gnulib/tests/test-poll.c
  2080. Copying file gnulib/tests/test-posix_openpt.c
  2081. Copying file gnulib/tests/test-posix_spawn1.c
  2082. Copying file gnulib/tests/test-posix_spawn1.in.sh
  2083. Copying file gnulib/tests/test-posix_spawn2.c
  2084. Copying file gnulib/tests/test-posix_spawn2.in.sh
  2085. Copying file gnulib/tests/test-posix_spawn_file_actions_addclose.c
  2086. Copying file gnulib/tests/test-posix_spawn_file_actions_adddup2.c
  2087. Copying file gnulib/tests/test-posix_spawn_file_actions_addopen.c
  2088. Copying file gnulib/tests/test-pthread_sigmask1.c
  2089. Copying file gnulib/tests/test-pthread_sigmask2.c
  2090. Copying file gnulib/tests/test-ptsname.c
  2091. Copying file gnulib/tests/test-ptsname_r.c
  2092. Copying file gnulib/tests/test-raise.c
  2093. Copying file gnulib/tests/test-random_r.c
  2094. Copying file gnulib/tests/test-rawmemchr.c
  2095. Copying file gnulib/tests/test-read.c
  2096. Copying file gnulib/tests/test-readlink.c
  2097. Copying file gnulib/tests/test-readlink.h
  2098. Copying file gnulib/tests/test-recv.c
  2099. Copying file gnulib/tests/test-regex.c
  2100. Copying file gnulib/tests/test-sched.c
  2101. Copying file gnulib/tests/test-select-fd.c
  2102. Copying file gnulib/tests/test-select-in.sh
  2103. Copying file gnulib/tests/test-select-out.sh
  2104. Copying file gnulib/tests/test-select-stdin.c
  2105. Copying file gnulib/tests/test-select.c
  2106. Copying file gnulib/tests/test-select.h
  2107. Copying file gnulib/tests/test-send.c
  2108. Copying file gnulib/tests/test-setenv.c
  2109. Copying file gnulib/tests/test-setlocale1.c
  2110. Copying file gnulib/tests/test-setlocale1.sh
  2111. Copying file gnulib/tests/test-setlocale2.c
  2112. Copying file gnulib/tests/test-setlocale2.sh
  2113. Copying file gnulib/tests/test-setsockopt.c
  2114. Copying file gnulib/tests/test-sigaction.c
  2115. Copying file gnulib/tests/test-signal-h.c
  2116. Copying file gnulib/tests/test-signbit.c
  2117. Copying file gnulib/tests/test-sigpipe.c
  2118. Copying file gnulib/tests/test-sigpipe.sh
  2119. Copying file gnulib/tests/test-sigprocmask.c
  2120. Copying file gnulib/tests/test-sleep.c
  2121. Copying file gnulib/tests/test-snprintf.c
  2122. Copying file gnulib/tests/test-sockets.c
  2123. Copying file gnulib/tests/test-spawn.c
  2124. Copying file gnulib/tests/test-stat-time.c
  2125. Copying file gnulib/tests/test-stat.c
  2126. Copying file gnulib/tests/test-stat.h
  2127. Copying file gnulib/tests/test-stdalign.c
  2128. Copying file gnulib/tests/test-stdbool.c
  2129. Copying file gnulib/tests/test-stddef.c
  2130. Copying file gnulib/tests/test-stdint.c
  2131. Copying file gnulib/tests/test-stdio.c
  2132. Copying file gnulib/tests/test-stdlib.c
  2133. Copying file gnulib/tests/test-strchrnul.c
  2134. Copying file gnulib/tests/test-strerror.c
  2135. Copying file gnulib/tests/test-strerror_r.c
  2136. Copying file gnulib/tests/test-string.c
  2137. Copying file gnulib/tests/test-strings.c
  2138. Copying file gnulib/tests/test-strnlen.c
  2139. Copying file gnulib/tests/test-symlink.c
  2140. Copying file gnulib/tests/test-symlink.h
  2141. Copying file gnulib/tests/test-sys_ioctl.c
  2142. Copying file gnulib/tests/test-sys_select.c
  2143. Copying file gnulib/tests/test-sys_socket.c
  2144. Copying file gnulib/tests/test-sys_stat.c
  2145. Copying file gnulib/tests/test-sys_time.c
  2146. Copying file gnulib/tests/test-sys_types.c
  2147. Copying file gnulib/tests/test-sys_uio.c
  2148. Copying file gnulib/tests/test-sys_utsname.c
  2149. Copying file gnulib/tests/test-sys_wait.c
  2150. Copying file gnulib/tests/test-sys_wait.h
  2151. Copying file gnulib/tests/test-termios.c
  2152. Copying file gnulib/tests/test-thread_create.c
  2153. Copying file gnulib/tests/test-thread_self.c
  2154. Copying file gnulib/tests/test-time.c
  2155. Copying file gnulib/tests/test-ttyname_r.c
  2156. Copying file gnulib/tests/test-uname.c
  2157. Copying file gnulib/tests/test-unistd.c
  2158. Copying file gnulib/tests/test-unlockpt.c
  2159. Copying file gnulib/tests/test-unsetenv.c
  2160. Copying file gnulib/tests/test-usleep.c
  2161. Copying file gnulib/tests/test-vasnprintf.c
  2162. Copying file gnulib/tests/test-vasprintf.c
  2163. Copying file gnulib/tests/test-vc-list-files-cvs.sh
  2164. Copying file gnulib/tests/test-vc-list-files-git.sh
  2165. Copying file gnulib/tests/test-verify.c
  2166. Copying file gnulib/tests/test-verify.sh
  2167. Copying file gnulib/tests/test-vsnprintf.c
  2168. Copying file gnulib/tests/test-wchar.c
  2169. Copying file gnulib/tests/test-wcrtomb-w32-1.sh
  2170. Copying file gnulib/tests/test-wcrtomb-w32-2.sh
  2171. Copying file gnulib/tests/test-wcrtomb-w32-3.sh
  2172. Copying file gnulib/tests/test-wcrtomb-w32-4.sh
  2173. Copying file gnulib/tests/test-wcrtomb-w32-5.sh
  2174. Copying file gnulib/tests/test-wcrtomb-w32.c
  2175. Copying file gnulib/tests/test-wcrtomb.c
  2176. Copying file gnulib/tests/test-wcrtomb.sh
  2177. Copying file gnulib/tests/test-wctype-h.c
  2178. Copying file gnulib/tests/test-write.c
  2179. Copying file gnulib/tests/test-xalloc-die.c
  2180. Copying file gnulib/tests/test-xalloc-die.sh
  2181. Copying file gnulib/tests/unlockpt.c
  2182. Copying file gnulib/tests/unsetenv.c
  2183. Copying file gnulib/tests/w32sock.h
  2184. Copying file gnulib/tests/wait-process.c
  2185. Copying file gnulib/tests/wait-process.h
  2186. Copying file gnulib/tests/wctob.c
  2187. Copying file gnulib/tests/wctomb-impl.h
  2188. Copying file gnulib/tests/wctomb.c
  2189. Copying file gnulib/tests/write.c
  2190. Copying file gnulib/tests/xalloc-die.c
  2191. Copying file gnulib/tests/xalloc.h
  2192. Copying file gnulib/tests/xmalloc.c
  2193. Copying file gnulib/tests/zerosize-ptr.h
  2194. Copying file m4/00gnulib.m4
  2195. Copying file m4/absolute-header.m4
  2196. Copying file m4/alloca.m4
  2197. Copying file m4/arpa_inet_h.m4
  2198. Copying file m4/asm-underscore.m4
  2199. Copying file m4/autobuild.m4
  2200. Copying file m4/base64.m4
  2201. Copying file m4/btowc.m4
  2202. Copying file m4/byteswap.m4
  2203. Copying file m4/calloc.m4
  2204. Copying file m4/canonicalize.m4
  2205. Copying file m4/chown.m4
  2206. Copying file m4/clock_time.m4
  2207. Copying file m4/close.m4
  2208. Replacing file m4/codeset.m4 (non-gnulib code backed up in m4/codeset.m4~) !!
  2209. Copying file m4/configmake.m4
  2210. Copying file m4/count-leading-zeros.m4
  2211. Copying file m4/count-one-bits.m4
  2212. Copying file m4/ctype.m4
  2213. Copying file m4/dirname.m4
  2214. Copying file m4/double-slash-root.m4
  2215. Copying file m4/dup.m4
  2216. Copying file m4/dup2.m4
  2217. Copying file m4/eealloc.m4
  2218. Copying file m4/environ.m4
  2219. Copying file m4/errno_h.m4
  2220. Copying file m4/error.m4
  2221. Copying file m4/execinfo.m4
  2222. Copying file m4/exponentd.m4
  2223. Copying file m4/exponentf.m4
  2224. Copying file m4/exponentl.m4
  2225. Copying file m4/extensions.m4
  2226. Copying file m4/extern-inline.m4
  2227. Copying file m4/fatal-signal.m4
  2228. Copying file m4/fclose.m4
  2229. Copying file m4/fcntl-o.m4
  2230. Copying file m4/fcntl.m4
  2231. Copying file m4/fcntl_h.m4
  2232. Copying file m4/fdatasync.m4
  2233. Copying file m4/fdopen.m4
  2234. Copying file m4/fflush.m4
  2235. Copying file m4/ffs.m4
  2236. Copying file m4/ffsl.m4
  2237. Copying file m4/float_h.m4
  2238. Copying file m4/fnmatch.m4
  2239. Copying file m4/fpieee.m4
  2240. Copying file m4/fpurge.m4
  2241. Copying file m4/freading.m4
  2242. Copying file m4/fseek.m4
  2243. Copying file m4/fseeko.m4
  2244. Copying file m4/fstat.m4
  2245. Copying file m4/fsync.m4
  2246. Copying file m4/ftell.m4
  2247. Copying file m4/ftello.m4
  2248. Copying file m4/ftruncate.m4
  2249. Copying file m4/func.m4
  2250. Copying file m4/getaddrinfo.m4
  2251. Copying file m4/getcwd.m4
  2252. Copying file m4/getdelim.m4
  2253. Copying file m4/getdtablesize.m4
  2254. Copying file m4/getgroups.m4
  2255. Copying file m4/gethostname.m4
  2256. Copying file m4/getline.m4
  2257. Copying file m4/getpagesize.m4
  2258. Copying file m4/getpass.m4
  2259. Copying file m4/gettimeofday.m4
  2260. Copying file m4/getugroups.m4
  2261. Copying file m4/gl-openssl.m4
  2262. Replacing file m4/glibc21.m4 (non-gnulib code backed up in m4/glibc21.m4~) !!
  2263. Copying file m4/gnulib-common.m4
  2264. Copying file m4/gnulib-tool.m4
  2265. Copying file m4/grantpt.m4
  2266. Copying file m4/hostent.m4
  2267. Copying file m4/include_next.m4
  2268. Copying file m4/inet_ntop.m4
  2269. Copying file m4/inet_pton.m4
  2270. Replacing file m4/intlmacosx.m4 (non-gnulib code backed up in m4/intlmacosx.m4~) !!
  2271. Copying file m4/intmax_t.m4
  2272. Replacing file m4/inttypes-pri.m4 (non-gnulib code backed up in m4/inttypes-pri.m4~) !!
  2273. Copying file m4/inttypes.m4
  2274. Replacing file m4/inttypes_h.m4 (non-gnulib code backed up in m4/inttypes_h.m4~) !!
  2275. Copying file m4/ioctl.m4
  2276. Copying file m4/isatty.m4
  2277. Copying file m4/isnand.m4
  2278. Copying file m4/isnanf.m4
  2279. Copying file m4/isnanl.m4
  2280. Copying file m4/langinfo_h.m4
  2281. Copying file m4/largefile.m4
  2282. Replacing file m4/lcmessage.m4 (non-gnulib code backed up in m4/lcmessage.m4~) !!
  2283. Copying file m4/ldexp.m4
  2284. Replacing file m4/lib-ld.m4 (non-gnulib code backed up in m4/lib-ld.m4~) !!
  2285. Replacing file m4/lib-link.m4 (non-gnulib code backed up in m4/lib-link.m4~) !!
  2286. Replacing file m4/lib-prefix.m4 (non-gnulib code backed up in m4/lib-prefix.m4~) !!
  2287. Copying file m4/localcharset.m4
  2288. Copying file m4/locale-fr.m4
  2289. Copying file m4/locale-ja.m4
  2290. Copying file m4/locale-tr.m4
  2291. Copying file m4/locale-zh.m4
  2292. Copying file m4/locale_h.m4
  2293. Copying file m4/localeconv.m4
  2294. Copying file m4/localename.m4
  2295. Replacing file m4/lock.m4 (non-gnulib code backed up in m4/lock.m4~) !!
  2296. Replacing file m4/longlong.m4 (non-gnulib code backed up in m4/longlong.m4~) !!
  2297. Copying file m4/lseek.m4
  2298. Copying file m4/lstat.m4
  2299. Copying file m4/malloc.m4
  2300. Copying file m4/malloca.m4
  2301. Copying file m4/manywarnings.m4
  2302. Copying file m4/math_h.m4
  2303. Copying file m4/mbrtowc.m4
  2304. Copying file m4/mbsinit.m4
  2305. Copying file m4/mbsrtowcs.m4
  2306. Copying file m4/mbstate_t.m4
  2307. Copying file m4/mbtowc.m4
  2308. Copying file m4/md5.m4
  2309. Copying file m4/memchr.m4
  2310. Copying file m4/mgetgroups.m4
  2311. Copying file m4/mkdtemp.m4
  2312. Copying file m4/mkostemp.m4
  2313. Copying file m4/mkostemps.m4
  2314. Copying file m4/mktime.m4
  2315. Copying file m4/mmap-anon.m4
  2316. Copying file m4/mode_t.m4
  2317. Copying file m4/msvc-inval.m4
  2318. Copying file m4/msvc-nothrow.m4
  2319. Copying file m4/multiarch.m4
  2320. Copying file m4/nanosleep.m4
  2321. Copying file m4/net_if_h.m4
  2322. Copying file m4/netdb_h.m4
  2323. Copying file m4/netinet_in_h.m4
  2324. Copying file m4/nl_langinfo.m4
  2325. Copying file m4/nocrash.m4
  2326. Copying file m4/nonblocking.m4
  2327. Copying file m4/off_t.m4
  2328. Copying file m4/onceonly.m4
  2329. Copying file m4/open.m4
  2330. Copying file m4/passfd.m4
  2331. Copying file m4/pathmax.m4
  2332. Copying file m4/perror.m4
  2333. Copying file m4/physmem.m4
  2334. Copying file m4/pipe.m4
  2335. Copying file m4/pipe2.m4
  2336. Copying file m4/poll.m4
  2337. Copying file m4/poll_h.m4
  2338. Copying file m4/posix-shell.m4
  2339. Copying file m4/posix_openpt.m4
  2340. Copying file m4/posix_spawn.m4
  2341. Copying file m4/printf.m4
  2342. Copying file m4/pthread.m4
  2343. Copying file m4/pthread_sigmask.m4
  2344. Copying file m4/ptsname.m4
  2345. Copying file m4/ptsname_r.m4
  2346. Copying file m4/pty.m4
  2347. Copying file m4/pty_h.m4
  2348. Copying file m4/putenv.m4
  2349. Copying file m4/raise.m4
  2350. Copying file m4/random_r.m4
  2351. Copying file m4/rawmemchr.m4
  2352. Copying file m4/read.m4
  2353. Copying file m4/readlink.m4
  2354. Copying file m4/realloc.m4
  2355. Copying file m4/regex.m4
  2356. Copying file m4/sched_h.m4
  2357. Copying file m4/secure_getenv.m4
  2358. Copying file m4/select.m4
  2359. Copying file m4/servent.m4
  2360. Copying file m4/setenv.m4
  2361. Copying file m4/setlocale.m4
  2362. Copying file m4/sha256.m4
  2363. Copying file m4/sig_atomic_t.m4
  2364. Copying file m4/sigaction.m4
  2365. Copying file m4/signal_h.m4
  2366. Copying file m4/signalblocking.m4
  2367. Copying file m4/signbit.m4
  2368. Copying file m4/sigpipe.m4
  2369. Replacing file m4/size_max.m4 (non-gnulib code backed up in m4/size_max.m4~) !!
  2370. Copying file m4/sleep.m4
  2371. Copying file m4/snprintf.m4
  2372. Copying file m4/socketlib.m4
  2373. Copying file m4/sockets.m4
  2374. Copying file m4/socklen.m4
  2375. Copying file m4/sockpfaf.m4
  2376. Copying file m4/spawn_h.m4
  2377. Copying file m4/ssize_t.m4
  2378. Copying file m4/stat-time.m4
  2379. Copying file m4/stat.m4
  2380. Copying file m4/stdalign.m4
  2381. Copying file m4/stdarg.m4
  2382. Copying file m4/stdbool.m4
  2383. Copying file m4/stddef_h.m4
  2384. Copying file m4/stdint.m4
  2385. Replacing file m4/stdint_h.m4 (non-gnulib code backed up in m4/stdint_h.m4~) !!
  2386. Copying file m4/stdio_h.m4
  2387. Copying file m4/stdlib_h.m4
  2388. Copying file m4/stpcpy.m4
  2389. Copying file m4/strcase.m4
  2390. Copying file m4/strchrnul.m4
  2391. Copying file m4/strdup.m4
  2392. Copying file m4/strerror.m4
  2393. Copying file m4/strerror_r.m4
  2394. Copying file m4/string_h.m4
  2395. Copying file m4/strings_h.m4
  2396. Copying file m4/strndup.m4
  2397. Copying file m4/strnlen.m4
  2398. Copying file m4/strptime.m4
  2399. Copying file m4/strsep.m4
  2400. Copying file m4/strtok_r.m4
  2401. Copying file m4/symlink.m4
  2402. Copying file m4/sys_ioctl_h.m4
  2403. Copying file m4/sys_select_h.m4
  2404. Copying file m4/sys_socket_h.m4
  2405. Copying file m4/sys_stat_h.m4
  2406. Copying file m4/sys_time_h.m4
  2407. Copying file m4/sys_types_h.m4
  2408. Copying file m4/sys_uio_h.m4
  2409. Copying file m4/sys_utsname_h.m4
  2410. Copying file m4/sys_wait_h.m4
  2411. Copying file m4/tempname.m4
  2412. Copying file m4/termios_h.m4
  2413. Copying file m4/thread.m4
  2414. Copying file m4/threadlib.m4
  2415. Copying file m4/time_h.m4
  2416. Copying file m4/time_r.m4
  2417. Copying file m4/timegm.m4
  2418. Copying file m4/tm_gmtoff.m4
  2419. Copying file m4/ttyname_r.m4
  2420. Copying file m4/uname.m4
  2421. Copying file m4/ungetc.m4
  2422. Copying file m4/unistd_h.m4
  2423. Copying file m4/unlockpt.m4
  2424. Copying file m4/usleep.m4
  2425. Copying file m4/vasnprintf.m4
  2426. Copying file m4/vasprintf.m4
  2427. Copying file m4/vsnprintf.m4
  2428. Copying file m4/wait-process.m4
  2429. Copying file m4/waitpid.m4
  2430. Copying file m4/warn-on-use.m4
  2431. Copying file m4/warnings.m4
  2432. Copying file m4/wchar_h.m4
  2433. Replacing file m4/wchar_t.m4 (non-gnulib code backed up in m4/wchar_t.m4~) !!
  2434. Copying file m4/wcrtomb.m4
  2435. Copying file m4/wctob.m4
  2436. Copying file m4/wctomb.m4
  2437. Copying file m4/wctype_h.m4
  2438. Replacing file m4/wint_t.m4 (non-gnulib code backed up in m4/wint_t.m4~) !!
  2439. Copying file m4/write.m4
  2440. Copying file m4/xalloc.m4
  2441. Replacing file m4/xsize.m4 (non-gnulib code backed up in m4/xsize.m4~) !!
  2442. Copying file maint.mk
  2443. Creating gnulib/lib/gnulib.mk
  2444. Creating m4/gnulib-cache.m4
  2445. Creating m4/gnulib-comp.m4
  2446. Creating gnulib/tests/gnulib.mk
  2447. Updating ./build-aux/.gitignore (backup in ./build-aux/.gitignore~)
  2448. Creating ./build-aux/snippet/.gitignore
  2449. Creating ./gnulib/lib/.gitignore
  2450. Creating ./gnulib/lib/glthread/.gitignore
  2451. Creating ./gnulib/tests/.gitignore
  2452. Creating ./gnulib/tests/glthread/.gitignore
  2453. Updating ./m4/.gitignore (backup in ./m4/.gitignore~)
  2454. Finished.
  2455.  
  2456. You may need to add #include directives for the following .h files.
  2457.   #include <arpa/inet.h>
  2458.   #include <byteswap.h>
  2459.   #include <execinfo.h>
  2460.   #include <fcntl.h>
  2461.   #include <fnmatch.h>
  2462.   #include <locale.h>
  2463.   #include <math.h>
  2464.   #include <net/if.h>
  2465.   #include <netdb.h>
  2466.   #include <poll.h>
  2467.   #include <pthread.h>
  2468.   #include <pty.h>
  2469.   #include <regex.h>
  2470.   #include <sched.h>
  2471.   #include <signal.h>
  2472.   #include <stdarg.h>
  2473.   #include <stdio.h>
  2474.   #include <stdlib.h>
  2475.   #include <string.h>
  2476.   #include <strings.h>
  2477.   #include <sys/ioctl.h>
  2478.   #include <sys/socket.h>
  2479.   #include <sys/stat.h>
  2480.   #include <sys/time.h>
  2481.   #include <sys/utsname.h>
  2482.   #include <sys/wait.h>
  2483.   #include <termios.h>
  2484.   #include <time.h>
  2485.   #include <unistd.h>
  2486.   /* Include only after all system include files.  */
  2487.   #include "areadlink.h"
  2488.   #include "base64.h"
  2489.   #include "bitrotate.h"
  2490.   #include "c-ctype.h"
  2491.   #include "c-strcase.h"
  2492.   #include "c-strcasestr.h"
  2493.   #include "configmake.h"
  2494.   #include "count-leading-zeros.h"
  2495.   #include "count-one-bits.h"
  2496.   #include "dirname.h"
  2497.   #include "getpass.h"
  2498.   #include "gettext.h"
  2499.   #include "ignore-value.h"
  2500.   #include "intprops.h"
  2501.   #include "md5.h"
  2502.   #include "mgetgroups.h"
  2503.   #include "nonblocking.h"
  2504.   #include "passfd.h"
  2505.   #include "physmem.h"
  2506.   #include "sha256.h"
  2507.   #include "stat-time.h"
  2508.   #include "verify.h"
  2509.  
  2510. You may need to use the following Makefile variables when linking.
  2511. Use them in <program>_LDADD when linking a program, or
  2512. in <library>_a_LDFLAGS or <library>_la_LDFLAGS when linking a library.
  2513.   $(GETADDRINFO_LIB)
  2514.   $(GETHOSTNAME_LIB)
  2515.   $(HOSTENT_LIB)
  2516.   $(INET_NTOP_LIB)
  2517.   $(INET_PTON_LIB)
  2518.   $(LDEXP_LIBM)
  2519.   $(LIBSOCKET)
  2520.   $(LIB_CLOCK_GETTIME)
  2521.   $(LIB_CRYPTO)
  2522.   $(LIB_EXECINFO)
  2523.   $(LIB_FDATASYNC)
  2524.   $(LIB_POLL)
  2525.   $(LIB_PTHREAD)
  2526.   $(LIB_PTHREAD_SIGMASK)
  2527.   $(LIB_SELECT)
  2528.   $(LTLIBINTL) when linking with libtool, $(LIBINTL) otherwise
  2529.   $(LTLIBTHREAD) when linking with libtool, $(LIBTHREAD) otherwise
  2530.   $(PTY_LIB)
  2531.   $(SERVENT_LIB)
  2532.  
  2533. Don't forget to
  2534.   - "include gnulib.mk" from within "gnulib/lib/Makefile.am",
  2535.   - "include gnulib.mk" from within "gnulib/tests/Makefile.am",
  2536.   - mention "-I m4" in ACLOCAL_AMFLAGS in Makefile.am,
  2537.   - mention "m4/gnulib-cache.m4" in EXTRA_DIST in Makefile.am,
  2538.   - invoke gl_EARLY in ./configure.ac, right after AC_PROG_CC,
  2539.   - invoke gl_INIT in ./configure.ac.
  2540. running: AUTOPOINT=true LIBTOOLIZE=true autoreconf --verbose --install --force -I m4  --no-recursive
  2541. autoreconf: Entering directory `.'
  2542. autoreconf: running: true --force
  2543. autoreconf: running: aclocal -I m4 --force -I m4
  2544. autoreconf: configure.ac: tracing
  2545. autoreconf: running: true --copy --force
  2546. autoreconf: running: /usr/bin/autoconf --include=m4 --force
  2547. autoreconf: running: /usr/bin/autoheader --include=m4 --force
  2548. autoreconf: running: automake --add-missing --copy --force-missing
  2549. Unescaped left brace in regex is deprecated, passed through in regex; marked by <-- HERE in m/\${ <-- HERE ([^ \t=:+{}]+)}/ at /usr/bin/automake line 3936.
  2550. configure.ac:139: installing 'build-aux/ar-lib'
  2551. configure.ac:129: installing 'build-aux/compile'
  2552. configure.ac:27: installing 'build-aux/missing'
  2553. Makefile.am: installing './INSTALL'
  2554. daemon/Makefile.am: installing 'build-aux/depcomp'
  2555. parallel-tests: installing 'build-aux/test-driver'
  2556. autoreconf: Leaving directory `.'
  2557. ./bootstrap: ln -fs ../.gnulib/build-aux/install-sh build-aux/install-sh
  2558. ./bootstrap: ln -fs ../.gnulib/build-aux/depcomp build-aux/depcomp
  2559. ./bootstrap: ln -fs ../.gnulib/build-aux/config.guess build-aux/config.guess
  2560. ./bootstrap: ln -fs ../.gnulib/build-aux/config.sub build-aux/config.sub
  2561. ./bootstrap: ln -fs .gnulib/doc/INSTALL INSTALL
  2562. ./bootstrap: Creating po/Makevars from po/Makevars.template ...
  2563. ./bootstrap: done.  Now you can run './configure'.
  2564. checking for a BSD-compatible install... /usr/bin/install -c
  2565. checking whether build environment is sane... yes
  2566. checking for a thread-safe mkdir -p... /usr/bin/mkdir -p
  2567. checking for gawk... gawk
  2568. checking whether make sets $(MAKE)... yes
  2569. checking whether make supports nested variables... yes
  2570. checking whether UID '1000' is supported by ustar format... yes
  2571. checking whether GID '100' is supported by ustar format... yes
  2572. checking how to create a ustar tar archive... gnutar
  2573. checking whether make supports nested variables... (cached) yes
  2574. checking build system type... x86_64-pc-linux-gnu
  2575. checking host system type... x86_64-pc-linux-gnu
  2576. checking for gcc... gcc
  2577. checking whether the C compiler works... yes
  2578. checking for C compiler default output file name... a.out
  2579. checking for suffix of executables...
  2580. checking whether we are cross compiling... no
  2581. checking for suffix of object files... o
  2582. checking whether we are using the GNU C compiler... yes
  2583. checking whether gcc accepts -g... yes
  2584. checking for gcc option to accept ISO C89... none needed
  2585. checking whether gcc understands -c and -o together... yes
  2586. checking for style of include used by make... GNU
  2587. checking dependency style of gcc... gcc3
  2588. checking how to run the C preprocessor... gcc -E
  2589. checking for grep that handles long lines and -e... /usr/bin/grep
  2590. checking for egrep... /usr/bin/grep -E
  2591. checking for ANSI C header files... yes
  2592. checking for sys/types.h... yes
  2593. checking for sys/stat.h... yes
  2594. checking for stdlib.h... yes
  2595. checking for string.h... yes
  2596. checking for memory.h... yes
  2597. checking for strings.h... yes
  2598. checking for inttypes.h... yes
  2599. checking for stdint.h... yes
  2600. checking for unistd.h... yes
  2601. checking minix/config.h usability... no
  2602. checking minix/config.h presence... no
  2603. checking for minix/config.h... no
  2604. checking whether it is safe to define __EXTENSIONS__... yes
  2605. checking whether _XOPEN_SOURCE should be defined... no
  2606. checking for Minix Amsterdam compiler... no
  2607. checking for ar... ar
  2608. checking the archiver (ar) interface... ar
  2609. checking for ar... (cached) ar
  2610. checking for ranlib... ranlib
  2611. checking for _LARGEFILE_SOURCE value needed for large files... no
  2612. checking for special C compiler options needed for large files... no
  2613. checking for _FILE_OFFSET_BITS value needed for large files... no
  2614. checking for gcc option to accept ISO C99... none needed
  2615. checking for gcc option to accept ISO Standard C... (cached) none needed
  2616. configure: autobuild project... libvirt
  2617. configure: autobuild revision... v1.3.1-rc2-3-g8f0a157
  2618. ./configure: line 8280: hostname: command not found
  2619. configure: autobuild timestamp... 20160116T180759Z
  2620. checking sys/socket.h usability... yes
  2621. checking sys/socket.h presence... yes
  2622. checking for sys/socket.h... yes
  2623. checking arpa/inet.h usability... yes
  2624. checking arpa/inet.h presence... yes
  2625. checking for arpa/inet.h... yes
  2626. checking features.h usability... yes
  2627. checking features.h presence... yes
  2628. checking for features.h... yes
  2629. checking sys/param.h usability... yes
  2630. checking sys/param.h presence... yes
  2631. checking for sys/param.h... yes
  2632. checking for unistd.h... (cached) yes
  2633. checking execinfo.h usability... yes
  2634. checking execinfo.h presence... yes
  2635. checking for execinfo.h... yes
  2636. checking wctype.h usability... yes
  2637. checking wctype.h presence... yes
  2638. checking for wctype.h... yes
  2639. checking for sys/stat.h... (cached) yes
  2640. checking netdb.h usability... yes
  2641. checking netdb.h presence... yes
  2642. checking for netdb.h... yes
  2643. checking netinet/in.h usability... yes
  2644. checking netinet/in.h presence... yes
  2645. checking for netinet/in.h... yes
  2646. checking stdio_ext.h usability... yes
  2647. checking stdio_ext.h presence... yes
  2648. checking for stdio_ext.h... yes
  2649. checking termios.h usability... yes
  2650. checking termios.h presence... yes
  2651. checking for termios.h... yes
  2652. checking sys/time.h usability... yes
  2653. checking sys/time.h presence... yes
  2654. checking for sys/time.h... yes
  2655. checking grp.h usability... yes
  2656. checking grp.h presence... yes
  2657. checking for grp.h... yes
  2658. checking langinfo.h usability... yes
  2659. checking langinfo.h presence... yes
  2660. checking for langinfo.h... yes
  2661. checking xlocale.h usability... yes
  2662. checking xlocale.h presence... yes
  2663. checking for xlocale.h... yes
  2664. checking sys/mman.h usability... yes
  2665. checking sys/mman.h presence... yes
  2666. checking for sys/mman.h... yes
  2667. checking pty.h usability... yes
  2668. checking pty.h presence... yes
  2669. checking for pty.h... yes
  2670. checking poll.h usability... yes
  2671. checking poll.h presence... yes
  2672. checking for poll.h... yes
  2673. checking sys/ioctl.h usability... yes
  2674. checking sys/ioctl.h presence... yes
  2675. checking for sys/ioctl.h... yes
  2676. checking sys/filio.h usability... no
  2677. checking sys/filio.h presence... no
  2678. checking for sys/filio.h... no
  2679. checking pthread.h usability... yes
  2680. checking pthread.h presence... yes
  2681. checking for pthread.h... yes
  2682. checking malloc.h usability... yes
  2683. checking malloc.h presence... yes
  2684. checking for malloc.h... yes
  2685. checking sched.h usability... yes
  2686. checking sched.h presence... yes
  2687. checking for sched.h... yes
  2688. checking sys/select.h usability... yes
  2689. checking sys/select.h presence... yes
  2690. checking for sys/select.h... yes
  2691. checking wchar.h usability... yes
  2692. checking wchar.h presence... yes
  2693. checking for wchar.h... yes
  2694. checking for stdint.h... (cached) yes
  2695. checking for strings.h... (cached) yes
  2696. checking sys/uio.h usability... yes
  2697. checking sys/uio.h presence... yes
  2698. checking for sys/uio.h... yes
  2699. checking sys/utsname.h usability... yes
  2700. checking sys/utsname.h presence... yes
  2701. checking for sys/utsname.h... yes
  2702. checking sys/wait.h usability... yes
  2703. checking sys/wait.h presence... yes
  2704. checking for sys/wait.h... yes
  2705. checking for inttypes.h... (cached) yes
  2706. checking math.h usability... yes
  2707. checking math.h presence... yes
  2708. checking for math.h... yes
  2709. checking spawn.h usability... yes
  2710. checking spawn.h presence... yes
  2711. checking for spawn.h... yes
  2712. checking whether the preprocessor supports include_next... yes
  2713. checking whether system header files limit the line length... no
  2714. checking whether <sys/socket.h> is self-contained... yes
  2715. checking for shutdown... yes
  2716. checking whether <sys/socket.h> defines the SHUT_* macros... yes
  2717. checking for struct sockaddr_storage... yes
  2718. checking for sa_family_t... yes
  2719. checking for struct sockaddr_storage.ss_family... yes
  2720. checking for size_t... yes
  2721. checking for working alloca.h... yes
  2722. checking for alloca... yes
  2723. checking for C/C++ restrict keyword... __restrict
  2724. checking whether <wchar.h> uses 'inline' correctly... yes
  2725. checking for btowc... yes
  2726. checking for canonicalize_file_name... yes
  2727. checking for getcwd... yes
  2728. checking for readlink... yes
  2729. checking for realpath... yes
  2730. checking for readlinkat... yes
  2731. checking for chown... yes
  2732. checking for fchown... yes
  2733. checking for _set_invalid_parameter_handler... no
  2734. checking for fcntl... yes
  2735. checking for symlink... yes
  2736. checking for ffs... yes
  2737. checking for ffsl... yes
  2738. checking for isblank... yes
  2739. checking for iswctype... yes
  2740. checking for mbsrtowcs... yes
  2741. checking for mempcpy... yes
  2742. checking for wmemchr... yes
  2743. checking for wmemcpy... yes
  2744. checking for wmempcpy... yes
  2745. checking for fpurge... no
  2746. checking for __fpurge... yes
  2747. checking for __freading... yes
  2748. checking for fsync... yes
  2749. checking for getdelim... yes
  2750. checking for getdtablesize... yes
  2751. checking for __fsetlocking... yes
  2752. checking for tcgetattr... yes
  2753. checking for tcsetattr... yes
  2754. checking for gettimeofday... yes
  2755. checking for lstat... yes
  2756. checking for mbsinit... yes
  2757. checking for mbrtowc... yes
  2758. checking for mprotect... yes
  2759. checking for getgrouplist... yes
  2760. checking for mkostemp... yes
  2761. checking for mkostemps... yes
  2762. checking for nl_langinfo... yes
  2763. checking for recvmsg... yes
  2764. checking for sendmsg... yes
  2765. checking for strerror_r... yes
  2766. checking for __xpg_strerror_r... yes
  2767. checking for pipe... yes
  2768. checking for pipe2... yes
  2769. checking for posix_openpt... yes
  2770. checking for pthread_sigmask... no
  2771. checking for secure_getenv... yes
  2772. checking for setenv... yes
  2773. checking for sigaction... yes
  2774. checking for sigaltstack... yes
  2775. checking for siginterrupt... yes
  2776. checking for sleep... yes
  2777. checking for snprintf... yes
  2778. checking for strdup... yes
  2779. checking for catgets... yes
  2780. checking for strndup... yes
  2781. checking for strptime... yes
  2782. checking for localtime_r... yes
  2783. checking for timegm... yes
  2784. checking for usleep... yes
  2785. checking for vasnprintf... no
  2786. checking for wcrtomb... yes
  2787. checking for iswcntrl... yes
  2788. checking for getegid... yes
  2789. checking for ftruncate... yes
  2790. checking for newlocale... yes
  2791. checking for socketpair... yes
  2792. checking for ptsname_r... yes
  2793. checking for shutdown... (cached) yes
  2794. checking for wctob... yes
  2795. checking for cfmakeraw... yes
  2796. checking for fallocate... yes
  2797. checking for geteuid... yes
  2798. checking for getgid... yes
  2799. checking for getgrnam_r... yes
  2800. checking for getmntent_r... yes
  2801. checking for getpwuid_r... yes
  2802. checking for getrlimit... yes
  2803. checking for getuid... yes
  2804. checking for kill... yes
  2805. checking for mmap... yes
  2806. checking for posix_fallocate... yes
  2807. checking for posix_memalign... yes
  2808. checking for prlimit... yes
  2809. checking for regexec... yes
  2810. checking for sched_getaffinity... yes
  2811. checking for setgroups... yes
  2812. checking for setns... yes
  2813. checking for setrlimit... yes
  2814. checking for sysctlbyname... no
  2815. checking for getifaddrs... yes
  2816. checking for sched_setscheduler... yes
  2817. checking for nl_langinfo and CODESET... yes
  2818. checking for a traditional french locale... none
  2819. checking whether malloc, realloc, calloc are POSIX compliant... yes
  2820. checking whether // is distinct from /... no
  2821. checking whether realpath works... yes
  2822. checking for uid_t in sys/types.h... yes
  2823. checking for unistd.h... (cached) yes
  2824. checking for working chown... yes
  2825. checking whether chown dereferences symlinks... yes
  2826. checking whether chown honors trailing slash... yes
  2827. checking whether chown always updates ctime... yes
  2828. checking for unsigned long long int... yes
  2829. checking whether byte ordering is bigendian... no
  2830. checking if environ is properly declared... yes
  2831. checking for complete errno.h... yes
  2832. checking for working fcntl.h... yes
  2833. checking for pid_t... yes
  2834. checking for mode_t... yes
  2835. checking whether fdatasync is declared... yes
  2836. checking for mbstate_t... yes
  2837. checking whether stdin defaults to large file offsets... yes
  2838. checking whether fseeko is declared... yes
  2839. checking for fseeko... yes
  2840. checking whether fflush works on input streams... no
  2841. checking whether stat file-mode macros are broken... no
  2842. checking for nlink_t... yes
  2843. checking whether ftello is declared... yes
  2844. checking for ftello... yes
  2845. checking whether ftello works... yes
  2846. checking for library containing gethostbyname... none required
  2847. checking for gethostbyname... yes
  2848. checking for library containing getservbyname... none required
  2849. checking for getservbyname... yes
  2850. checking for library containing inet_ntop... none required
  2851. checking whether inet_ntop is declared... yes
  2852. checking for IPv4 sockets... yes
  2853. checking for IPv6 sockets... yes
  2854. checking whether getcwd (NULL, 0) allocates memory for result... yes
  2855. checking for getcwd with POSIX signature... yes
  2856. checking whether getdelim is declared... yes
  2857. checking whether getdtablesize is declared... yes
  2858. checking type of array argument to getgroups... gid_t
  2859. checking whether getline is declared... yes
  2860. checking whether getpass is declared... yes
  2861. checking whether fflush_unlocked is declared... yes
  2862. checking whether flockfile is declared... yes
  2863. checking whether fputs_unlocked is declared... yes
  2864. checking whether funlockfile is declared... yes
  2865. checking whether putc_unlocked is declared... yes
  2866. checking for struct timeval... yes
  2867. checking for wide-enough struct timeval.tv_sec member... yes
  2868. checking whether ldexp() can be used without linking with libm... yes
  2869. checking whether getc_unlocked is declared... yes
  2870. checking whether we are using the GNU C Library >= 2.1 or uClibc... yes
  2871. checking for wchar_t... yes
  2872. checking for max_align_t... yes
  2873. checking whether NULL can be used in arbitrary expressions... yes
  2874. checking for ld used by gcc... /usr/bin/ld
  2875. checking if the linker (/usr/bin/ld) is GNU ld... yes
  2876. checking for shared library run path origin... done
  2877. checking whether imported symbols can be declared weak... yes
  2878. checking for pthread.h... (cached) yes
  2879. checking for multithread API to use... posix
  2880. checking whether lstat correctly handles trailing slash... yes
  2881. checking for a sed that does not truncate output... /usr/bin/sed
  2882. checking for stdlib.h... (cached) yes
  2883. checking for GNU libc compatible malloc... yes
  2884. checking for long long int... yes
  2885. checking for a traditional japanese locale... none
  2886. checking for a transitional chinese locale... none
  2887. checking for a french Unicode locale... none
  2888. checking for mmap... (cached) yes
  2889. checking for MAP_ANONYMOUS... yes
  2890. checking whether memchr works... yes
  2891. checking whether alarm is declared... yes
  2892. checking whether C symbols are prefixed with underscore at the linker level... no
  2893. checking for promoted mode_t type... mode_t
  2894. checking for library containing forkpty... -lutil
  2895. checking whether strerror(0) succeeds... yes
  2896. checking for strerror_r with POSIX signature... no
  2897. checking whether __xpg_strerror_r works... yes
  2898. checking whether strerror_r is declared... yes
  2899. checking for external symbol _system_configuration... no
  2900. checking for inline... inline
  2901. checking for library containing setsockopt... none needed
  2902. checking for sigset_t... yes
  2903. checking for SIGPIPE... yes
  2904. checking whether <sys/select.h> is self-contained... yes
  2905. checking whether setenv is declared... yes
  2906. checking search.h usability... yes
  2907. checking search.h presence... yes
  2908. checking for search.h... yes
  2909. checking for tsearch... yes
  2910. checking whether snprintf returns a byte count as in C99... yes
  2911. checking whether snprintf is declared... yes
  2912. checking for stdbool.h that conforms to C99... yes
  2913. checking for _Bool... yes
  2914. checking whether stdint.h conforms to C99... yes
  2915. checking whether strdup is declared... yes
  2916. checking whether strndup is declared... yes
  2917. checking whether strnlen is declared... yes
  2918. checking for struct tm.tm_gmtoff... yes
  2919. checking whether strtok_r is declared... yes
  2920. checking for struct timespec in <time.h>... yes
  2921. checking whether ttyname_r is declared... yes
  2922. checking for wint_t... yes
  2923. checking for inttypes.h... yes
  2924. checking for stdint.h... yes
  2925. checking for intmax_t... yes
  2926. checking where to find the exponent in a 'double'... word 1 bit 20
  2927. checking for snprintf... (cached) yes
  2928. checking for strnlen... yes
  2929. checking for wcslen... yes
  2930. checking for wcsnlen... yes
  2931. checking for mbrtowc... (cached) yes
  2932. checking for wcrtomb... (cached) yes
  2933. checking whether _snprintf is declared... no
  2934. checking whether vsnprintf is declared... yes
  2935. checking whether strerror_r is declared... (cached) yes
  2936. checking for strerror_r... (cached) yes
  2937. checking whether strerror_r returns char *... yes
  2938. checking for sig_atomic_t... yes
  2939. checking whether ungetc works on arbitrary bytes... yes
  2940. checking for inttypes.h... (cached) yes
  2941. checking whether the inttypes.h PRIxNN macros are broken... no
  2942. checking where to find the exponent in a 'float'... word 0 bit 23
  2943. checking whether long double and double are the same... no
  2944. checking for LC_MESSAGES... yes
  2945. checking for CFPreferencesCopyAppValue... no
  2946. checking for CFLocaleCopyCurrent... no
  2947. checking for library containing posix_spawn... none required
  2948. checking for posix_spawn... yes
  2949. checking whether posix_spawn works... yes
  2950. checking whether posix_spawnattr_setschedpolicy is supported... yes
  2951. checking whether posix_spawnattr_setschedparam is supported... yes
  2952. checking whether unsetenv is declared... yes
  2953. checking for alloca as a compiler built-in... yes
  2954. checking whether btowc(0) is correct... yes
  2955. checking whether btowc(EOF) is correct... guessing yes
  2956. checking byteswap.h usability... yes
  2957. checking byteswap.h presence... yes
  2958. checking for byteswap.h... yes
  2959. checking for library containing clock_gettime... none required
  2960. checking for clock_gettime... yes
  2961. checking for clock_settime... yes
  2962. checking whether // is distinct from /... (cached) no
  2963. checking whether dup2 works... yes
  2964. checking for library containing backtrace_symbols_fd... none required
  2965. checking whether fflush works on input streams... (cached) no
  2966. checking whether fcntl handles F_DUPFD correctly... yes
  2967. checking whether fcntl understands F_DUPFD_CLOEXEC... needs runtime check
  2968. checking for library containing fdatasync... none required
  2969. checking whether fflush works on input streams... (cached) no
  2970. checking whether conversion from 'int' to 'long double' works... yes
  2971. checking for working POSIX fnmatch... yes
  2972. checking whether fpurge is declared... no
  2973. checking for fseeko... (cached) yes
  2974. checking whether fflush works on input streams... (cached) no
  2975. checking for _fseeki64... no
  2976. checking for ftello... (cached) yes
  2977. checking whether ftello works... (cached) yes
  2978. checking whether __func__ is available... yes
  2979. configure: checking how to do getaddrinfo, freeaddrinfo and getnameinfo
  2980. checking for library containing getaddrinfo... none required
  2981. checking for getaddrinfo... yes
  2982. checking whether gai_strerror is declared... yes
  2983. checking whether gai_strerrorA is declared... no
  2984. checking for gai_strerror with POSIX signature... yes
  2985. checking for struct sockaddr.sa_len... no
  2986. checking whether getaddrinfo is declared... yes
  2987. checking whether freeaddrinfo is declared... yes
  2988. checking whether getnameinfo is declared... yes
  2989. checking for struct addrinfo... yes
  2990. checking for working getdelim function... yes
  2991. checking whether getdtablesize works... yes
  2992. checking for getgroups... yes
  2993. checking for working getgroups... yes
  2994. checking whether getgroups handles negative values... yes
  2995. checking for gethostname... yes
  2996. checking for HOST_NAME_MAX... yes
  2997. checking for getline... yes
  2998. checking for working getline function... yes
  2999. checking for getpass... yes
  3000. checking whether gettimeofday clobbers localtime buffer... no
  3001. checking for gettimeofday with POSIX signature... almost
  3002. checking for library containing gethostbyname... (cached) none required
  3003. checking for gethostbyname... (cached) yes
  3004. checking for library containing inet_ntop... (cached) none required
  3005. checking whether inet_ntop is declared... (cached) yes
  3006. checking for library containing inet_pton... none required
  3007. checking whether inet_pton is declared... yes
  3008. checking for ioctl... yes
  3009. checking for ioctl with POSIX signature... no
  3010. checking whether langinfo.h defines CODESET... yes
  3011. checking whether langinfo.h defines T_FMT_AMPM... yes
  3012. checking whether langinfo.h defines ERA... yes
  3013. checking whether langinfo.h defines YESEXPR... yes
  3014. checking whether locale.h conforms to POSIX:2001... yes
  3015. checking whether locale.h defines locale_t... yes
  3016. checking whether struct lconv is properly defined... yes
  3017. checking for pthread_rwlock_t... yes
  3018. checking whether lseek detects pipes... yes
  3019. checking whether mbrtowc handles incomplete characters... guessing yes
  3020. checking whether mbrtowc works as well as mbtowc... guessing yes
  3021. checking whether mbrtowc handles a NULL pwc argument... guessing yes
  3022. checking whether mbrtowc handles a NULL string argument... guessing yes
  3023. checking whether mbrtowc has a correct return value... guessing yes
  3024. checking whether mbrtowc returns 0 when parsing a NUL character... guessing yes
  3025. checking whether mbrtowc works on empty input... yes
  3026. checking whether mbrtowc handles incomplete characters... (cached) guessing yes
  3027. checking whether mbrtowc works as well as mbtowc... (cached) guessing yes
  3028. checking whether mbrtowc handles incomplete characters... (cached) guessing yes
  3029. checking whether mbrtowc works as well as mbtowc... (cached) guessing yes
  3030. checking whether mbsrtowcs works... guessing yes
  3031. checking for mkdtemp... yes
  3032. checking for working mktime... yes
  3033. checking for __mktime_internal... no
  3034. checking whether <net/if.h> is self-contained... yes
  3035. checking whether <netinet/in.h> is self-contained... yes
  3036. checking whether YESEXPR works... yes
  3037. checking whether open recognizes a trailing slash... yes
  3038. checking whether openpty is declared... yes
  3039. checking for const-safe openpty signature... yes
  3040. checking for struct msghdr.msg_accrights... no
  3041. checking whether perror matches strerror... yes
  3042. checking for sys/pstat.h... no
  3043. checking for sys/sysmp.h... no
  3044. checking for sys/sysinfo.h... yes
  3045. checking for machine/hal_sysinfo.h... no
  3046. checking for sys/table.h... no
  3047. checking for sys/param.h... (cached) yes
  3048. checking for sys/systemcfg.h... no
  3049. checking for sys/sysctl.h... yes
  3050. checking for pstat_getstatic... no
  3051. checking for pstat_getdynamic... no
  3052. checking for sysmp... no
  3053. checking for getsysinfo... no
  3054. checking for sysctl... yes
  3055. checking for table... no
  3056. checking for sysinfo... yes
  3057. checking for struct sysinfo.mem_unit... yes
  3058. checking for poll... yes
  3059. checking for a shell that conforms to POSIX... /bin/sh
  3060. checking whether <pthread.h> pollutes the namespace... no
  3061. checking for pthread_t... yes
  3062. checking for pthread_spinlock_t... yes
  3063. checking for library containing pthread_create and pthread_join... -pthread
  3064. checking for pthread_sigmask in -pthread... yes
  3065. checking whether pthread_sigmask is only a macro... no
  3066. checking whether pthread_sigmask returns error numbers... yes
  3067. checking whether pthread_sigmask unblocks signals correctly... guessing yes
  3068. checking for raise... yes
  3069. checking for sigprocmask... yes
  3070. checking for random.h... no
  3071. checking for struct random_data... yes
  3072. checking for random_r... yes
  3073. checking for rawmemchr... yes
  3074. checking whether readlink signature is correct... yes
  3075. checking whether readlink handles trailing slash correctly... yes
  3076. checking for working re_compile_pattern... yes
  3077. checking whether select supports a 0 argument... yes
  3078. checking whether select detects invalid fds... yes
  3079. checking for library containing getservbyname... (cached) none required
  3080. checking for getservbyname... (cached) yes
  3081. checking whether setenv validates arguments... yes
  3082. checking for struct sigaction.sa_sigaction... yes
  3083. checking for volatile sig_atomic_t... yes
  3084. checking for sighandler_t... yes
  3085. checking for sigprocmask... (cached) yes
  3086. checking for stdint.h... (cached) yes
  3087. checking for SIZE_MAX... yes
  3088. checking whether sleep is declared... yes
  3089. checking for working sleep... yes
  3090. checking for snprintf... (cached) yes
  3091. checking whether snprintf respects a size of 1... yes
  3092. checking whether printf supports POSIX/XSI format strings with positions... yes
  3093. checking for socklen_t... yes
  3094. checking for ssize_t... yes
  3095. checking whether stat handles trailing slashes on directories... yes
  3096. checking whether stat handles trailing slashes on files... yes
  3097. checking for struct stat.st_atim.tv_nsec... yes
  3098. checking whether struct stat.st_atim is of type struct timespec... yes
  3099. checking for struct stat.st_birthtimespec.tv_nsec... no
  3100. checking for struct stat.st_birthtimensec... no
  3101. checking for struct stat.st_birthtim.tv_nsec... no
  3102. checking for working stdalign.h... yes
  3103. checking for va_copy... yes
  3104. checking for max_align_t... (cached) yes
  3105. checking whether NULL can be used in arbitrary expressions... (cached) yes
  3106. checking which flavor of printf attribute matches inttypes macros... system
  3107. checking for stpcpy... yes
  3108. checking for strcasecmp... yes
  3109. checking for strncasecmp... yes
  3110. checking whether strncasecmp is declared... yes
  3111. checking for strchrnul... yes
  3112. checking whether strchrnul works... yes
  3113. checking for working strerror function... yes
  3114. checking for working strndup... yes
  3115. checking for working strnlen... yes
  3116. checking for strsep... yes
  3117. checking for strtok_r... yes
  3118. checking whether strtok_r works... yes
  3119. checking whether <sys/ioctl.h> declares ioctl... yes
  3120. checking whether <sys/select.h> is self-contained... (cached) yes
  3121. checking for nlink_t... (cached) yes
  3122. checking for struct utsname... yes
  3123. checking whether localtime_r is declared... yes
  3124. checking whether localtime_r is compatible with its POSIX signature... yes
  3125. checking for ttyname_r... yes
  3126. checking whether ttyname_r is compatible with its POSIX signature... yes
  3127. checking whether ttyname_r works with small buffers... yes
  3128. checking for uname... yes
  3129. checking for useconds_t... yes
  3130. checking whether usleep allows large arguments... yes
  3131. checking for ptrdiff_t... yes
  3132. checking for vasprintf... yes
  3133. checking for vsnprintf... yes
  3134. checking whether snprintf respects a size of 1... (cached) yes
  3135. checking whether printf supports POSIX/XSI format strings with positions... (cached) yes
  3136. checking whether mbrtowc handles incomplete characters... (cached) guessing yes
  3137. checking whether mbrtowc works as well as mbtowc... (cached) guessing yes
  3138. checking whether wcrtomb return value is correct... guessing yes
  3139. checking whether iswcntrl works... yes
  3140. checking for towlower... yes
  3141. checking for wctype_t... yes
  3142. checking for wctrans_t... yes
  3143. checking for stdint.h... (cached) yes
  3144. checking for a traditional french locale... (cached) none
  3145. checking for a french Unicode locale... (cached) none
  3146. checking for a traditional french locale... (cached) none
  3147. checking for a turkish Unicode locale... none
  3148. checking for error_at_line... yes
  3149. checking whether fdopen sets errno... yes
  3150. checking for getpagesize... yes
  3151. checking whether getpagesize is declared... yes
  3152. checking for grantpt... yes
  3153. checking whether byte ordering is bigendian... (cached) no
  3154. checking whether byte ordering is bigendian... (cached) no
  3155. checking whether INT32_MAX < INTMAX_MAX... yes
  3156. checking whether INT64_MAX == LONG_MAX... yes
  3157. checking whether UINT32_MAX < UINTMAX_MAX... yes
  3158. checking whether UINT64_MAX == ULONG_MAX... yes
  3159. checking whether isnan(double) can be used without linking with libm... yes
  3160. checking where to find the exponent in a 'double'... (cached) word 1 bit 20
  3161. checking whether isnan(float) can be used without linking with libm... yes
  3162. checking whether isnan(float) works... yes
  3163. checking where to find the exponent in a 'float'... (cached) word 0 bit 23
  3164. checking whether isnan(long double) can be used without linking with libm... yes
  3165. checking whether isnanl works... yes
  3166. checking where to find the exponent in a 'long double'... unknown
  3167. checking for setlocale... yes
  3168. checking for uselocale... yes
  3169. checking for getlocalename_l... no
  3170. checking whether NAN macro works... yes
  3171. checking whether HUGE_VAL works... yes
  3172. checking for a traditional french locale... (cached) none
  3173. checking for a french Unicode locale... (cached) none
  3174. checking for a traditional japanese locale... (cached) none
  3175. checking for a transitional chinese locale... (cached) none
  3176. checking for a french Unicode locale... (cached) none
  3177. checking for a traditional french locale... (cached) none
  3178. checking for a french Unicode locale... (cached) none
  3179. checking for a traditional japanese locale... (cached) none
  3180. checking for a transitional chinese locale... (cached) none
  3181. checking for mmap... (cached) yes
  3182. checking for MAP_ANONYMOUS... yes
  3183. checking for library containing nanosleep... none required
  3184. checking for working nanosleep... no (mishandles large arguments)
  3185. checking for library containing if_nameindex... none required
  3186. checking for a traditional french locale... (cached) none
  3187. checking for a french Unicode locale... (cached) none
  3188. checking whether posix_spawn_file_actions_addclose works... yes
  3189. checking whether posix_spawn_file_actions_adddup2 works... yes
  3190. checking whether posix_spawn_file_actions_addopen works... yes
  3191. checking whether program_invocation_name is declared... yes
  3192. checking whether program_invocation_short_name is declared... yes
  3193. checking for ptsname... yes
  3194. checking whether ptsname sets errno on failure... yes
  3195. checking whether ptsname_r has the same signature as in glibc... yes
  3196. checking for putenv compatible with GNU and SVID... yes
  3197. checking for mmap... (cached) yes
  3198. checking for MAP_ANONYMOUS... yes
  3199. checking for a traditional french locale... (cached) none
  3200. checking for a french Unicode locale... (cached) none
  3201. checking for a traditional japanese locale... (cached) none
  3202. checking for a transitional chinese locale... (cached) none
  3203. checking for signbit macro... yes
  3204. checking for signbit compiler built-ins... yes
  3205. checking for posix_spawnattr_t... yes
  3206. checking for posix_spawn_file_actions_t... yes
  3207. checking for mmap... (cached) yes
  3208. checking for MAP_ANONYMOUS... yes
  3209. checking whether symlink handles trailing slash correctly... yes
  3210. checking for pthread_atfork... yes
  3211. checking for unlockpt... yes
  3212. checking for unsetenv... yes
  3213. checking for unsetenv() return type... int
  3214. checking whether unsetenv obeys POSIX... yes
  3215. checking for waitid... yes
  3216. checking for a traditional french locale... (cached) none
  3217. checking for a french Unicode locale... (cached) none
  3218. checking for a traditional japanese locale... (cached) none
  3219. checking for a transitional chinese locale... (cached) none
  3220. checking whether wctob works... guessing yes
  3221. checking whether wctob is declared... yes
  3222. checking for uid_t in sys/types.h... (cached) yes
  3223. checking how to print strings... printf
  3224. checking for a sed that does not truncate output... (cached) /usr/bin/sed
  3225. checking for fgrep... /usr/bin/grep -F
  3226. checking for ld used by gcc... /usr/bin/ld
  3227. checking if the linker (/usr/bin/ld) is GNU ld... yes
  3228. checking for BSD- or MS-compatible name lister (nm)... /usr/bin/nm -B
  3229. checking the name lister (/usr/bin/nm -B) interface... BSD nm
  3230. checking whether ln -s works... yes
  3231. checking the maximum length of command line arguments... 1572864
  3232. checking how to convert x86_64-pc-linux-gnu file names to x86_64-pc-linux-gnu format... func_convert_file_noop
  3233. checking how to convert x86_64-pc-linux-gnu file names to toolchain format... func_convert_file_noop
  3234. checking for /usr/bin/ld option to reload object files... -r
  3235. checking for objdump... objdump
  3236. checking how to recognize dependent libraries... pass_all
  3237. checking for dlltool... dlltool
  3238. checking how to associate runtime and link libraries... printf %s\n
  3239. checking for archiver @FILE support... @
  3240. checking for strip... strip
  3241. checking for ranlib... (cached) ranlib
  3242. checking command to parse /usr/bin/nm -B output from gcc object... ok
  3243. checking for sysroot... no
  3244. checking for a working dd... /usr/bin/dd
  3245. checking how to truncate binary pipes... /usr/bin/dd bs=4096 count=1
  3246. checking for mt... no
  3247. checking if : is a manifest tool... no
  3248. checking for dlfcn.h... yes
  3249. checking for objdir... .libs
  3250. checking if gcc supports -fno-rtti -fno-exceptions... no
  3251. checking for gcc option to produce PIC... -fPIC -DPIC
  3252. checking if gcc PIC flag -fPIC -DPIC works... yes
  3253. checking if gcc static flag -static works... no
  3254. checking if gcc supports -c -o file.o... yes
  3255. checking if gcc supports -c -o file.o... (cached) yes
  3256. checking whether the gcc linker (/usr/bin/ld -m elf_x86_64) supports shared libraries... yes
  3257. checking whether -lc should be explicitly linked in... no
  3258. checking dynamic linker characteristics... GNU/Linux ld.so
  3259. checking how to hardcode library paths into programs... immediate
  3260. checking whether stripping libraries is possible... yes
  3261. checking if libtool supports shared libraries... yes
  3262. checking whether to build shared libraries... yes
  3263. checking whether to build static libraries... no
  3264. checking for ld used by gcc... (cached) /usr/bin/ld
  3265. checking if the linker (/usr/bin/ld) is GNU ld... (cached) yes
  3266. checking for how to mark DSO non-deletable at runtime... -Wl,-z -Wl,nodelete
  3267. checking for how to set DSO symbol versions... -Wl,--version-script=
  3268. checking whether C compiler handles -Werror -Wunknown-warning-option... no
  3269. checking whether the C compiler's -Wformat allows NULL strings... yes
  3270. checking whether pragma GCC diagnostic push works... yes
  3271. checking whether the C compiler's -Wlogical-op gives bogus warnings... no
  3272. checking whether -Wno-missing-field-initializers is supported... yes
  3273. checking whether -Wno-missing-field-initializers is needed... no
  3274. checking whether -Wuninitialized is supported... yes
  3275. checking whether C compiler handles -W... yes
  3276. checking whether C compiler handles -Waddress... yes
  3277. checking whether C compiler handles -Waggressive-loop-optimizations... yes
  3278. checking whether C compiler handles -Wall... yes
  3279. checking whether C compiler handles -Wattributes... yes
  3280. checking whether C compiler handles -Wbad-function-cast... yes
  3281. checking whether C compiler handles -Wbool-compare... yes
  3282. checking whether C compiler handles -Wbuiltin-macro-redefined... yes
  3283. checking whether C compiler handles -Wcast-align... yes
  3284. checking whether C compiler handles -Wchar-subscripts... yes
  3285. checking whether C compiler handles -Wchkp... yes
  3286. checking whether C compiler handles -Wclobbered... yes
  3287. checking whether C compiler handles -Wcomment... yes
  3288. checking whether C compiler handles -Wcomments... yes
  3289. checking whether C compiler handles -Wcoverage-mismatch... yes
  3290. checking whether C compiler handles -Wcpp... yes
  3291. checking whether C compiler handles -Wdate-time... yes
  3292. checking whether C compiler handles -Wdeprecated-declarations... yes
  3293. checking whether C compiler handles -Wdesignated-init... yes
  3294. checking whether C compiler handles -Wdisabled-optimization... yes
  3295. checking whether C compiler handles -Wdiscarded-array-qualifiers... yes
  3296. checking whether C compiler handles -Wdiscarded-qualifiers... yes
  3297. checking whether C compiler handles -Wdiv-by-zero... yes
  3298. checking whether C compiler handles -Wdouble-promotion... yes
  3299. checking whether C compiler handles -Wempty-body... yes
  3300. checking whether C compiler handles -Wendif-labels... yes
  3301. checking whether C compiler handles -Wextra... yes
  3302. checking whether C compiler handles -Wformat-contains-nul... yes
  3303. checking whether C compiler handles -Wformat-extra-args... yes
  3304. checking whether C compiler handles -Wformat-security... yes
  3305. checking whether C compiler handles -Wformat-y2k... yes
  3306. checking whether C compiler handles -Wformat-zero-length... yes
  3307. checking whether C compiler handles -Wfree-nonheap-object... yes
  3308. checking whether C compiler handles -Wignored-qualifiers... yes
  3309. checking whether C compiler handles -Wimplicit... yes
  3310. checking whether C compiler handles -Wimplicit-function-declaration... yes
  3311. checking whether C compiler handles -Wimplicit-int... yes
  3312. checking whether C compiler handles -Wincompatible-pointer-types... yes
  3313. checking whether C compiler handles -Winit-self... yes
  3314. checking whether C compiler handles -Winline... yes
  3315. checking whether C compiler handles -Wint-conversion... yes
  3316. checking whether C compiler handles -Wint-to-pointer-cast... yes
  3317. checking whether C compiler handles -Winvalid-memory-model... yes
  3318. checking whether C compiler handles -Winvalid-pch... yes
  3319. checking whether C compiler handles -Wjump-misses-init... yes
  3320. checking whether C compiler handles -Wlogical-not-parentheses... yes
  3321. checking whether C compiler handles -Wlogical-op... yes
  3322. checking whether C compiler handles -Wmain... yes
  3323. checking whether C compiler handles -Wmaybe-uninitialized... yes
  3324. checking whether C compiler handles -Wmemset-transposed-args... yes
  3325. checking whether C compiler handles -Wmissing-braces... yes
  3326. checking whether C compiler handles -Wmissing-declarations... yes
  3327. checking whether C compiler handles -Wmissing-field-initializers... yes
  3328. checking whether C compiler handles -Wmissing-include-dirs... yes
  3329. checking whether C compiler handles -Wmissing-parameter-type... yes
  3330. checking whether C compiler handles -Wmissing-prototypes... yes
  3331. checking whether C compiler handles -Wmultichar... yes
  3332. checking whether C compiler handles -Wnarrowing... yes
  3333. checking whether C compiler handles -Wnested-externs... yes
  3334. checking whether C compiler handles -Wnonnull... yes
  3335. checking whether C compiler handles -Wodr... yes
  3336. checking whether C compiler handles -Wold-style-declaration... yes
  3337. checking whether C compiler handles -Wold-style-definition... yes
  3338. checking whether C compiler handles -Wopenmp-simd... yes
  3339. checking whether C compiler handles -Woverflow... yes
  3340. checking whether C compiler handles -Woverride-init... yes
  3341. checking whether C compiler handles -Wpacked-bitfield-compat... yes
  3342. checking whether C compiler handles -Wparentheses... yes
  3343. checking whether C compiler handles -Wpointer-arith... yes
  3344. checking whether C compiler handles -Wpointer-sign... yes
  3345. checking whether C compiler handles -Wpointer-to-int-cast... yes
  3346. checking whether C compiler handles -Wpragmas... yes
  3347. checking whether C compiler handles -Wreturn-local-addr... yes
  3348. checking whether C compiler handles -Wreturn-type... yes
  3349. checking whether C compiler handles -Wsequence-point... yes
  3350. checking whether C compiler handles -Wshadow... yes
  3351. checking whether C compiler handles -Wshift-count-negative... yes
  3352. checking whether C compiler handles -Wshift-count-overflow... yes
  3353. checking whether C compiler handles -Wsizeof-array-argument... yes
  3354. checking whether C compiler handles -Wsizeof-pointer-memaccess... yes
  3355. checking whether C compiler handles -Wstrict-aliasing... yes
  3356. checking whether C compiler handles -Wstrict-prototypes... yes
  3357. checking whether C compiler handles -Wsuggest-attribute=const... yes
  3358. checking whether C compiler handles -Wsuggest-attribute=format... yes
  3359. checking whether C compiler handles -Wsuggest-attribute=noreturn... yes
  3360. checking whether C compiler handles -Wsuggest-attribute=pure... yes
  3361. checking whether C compiler handles -Wsuggest-final-methods... yes
  3362. checking whether C compiler handles -Wsuggest-final-types... yes
  3363. checking whether C compiler handles -Wswitch... yes
  3364. checking whether C compiler handles -Wswitch-bool... yes
  3365. checking whether C compiler handles -Wsync-nand... yes
  3366. checking whether C compiler handles -Wtrampolines... yes
  3367. checking whether C compiler handles -Wtrigraphs... yes
  3368. checking whether C compiler handles -Wtype-limits... yes
  3369. checking whether C compiler handles -Wuninitialized... yes
  3370. checking whether C compiler handles -Wunknown-pragmas... yes
  3371. checking whether C compiler handles -Wunused... yes
  3372. checking whether C compiler handles -Wunused-but-set-parameter... yes
  3373. checking whether C compiler handles -Wunused-but-set-variable... yes
  3374. checking whether C compiler handles -Wunused-function... yes
  3375. checking whether C compiler handles -Wunused-label... yes
  3376. checking whether C compiler handles -Wunused-local-typedefs... yes
  3377. checking whether C compiler handles -Wunused-parameter... yes
  3378. checking whether C compiler handles -Wunused-result... yes
  3379. checking whether C compiler handles -Wunused-value... yes
  3380. checking whether C compiler handles -Wunused-variable... yes
  3381. checking whether C compiler handles -Wvarargs... yes
  3382. checking whether C compiler handles -Wvariadic-macros... yes
  3383. checking whether C compiler handles -Wvector-operation-performance... yes
  3384. checking whether C compiler handles -Wvolatile-register-var... yes
  3385. checking whether C compiler handles -Wwrite-strings... yes
  3386. checking whether C compiler handles -Warray-bounds=2... yes
  3387. checking whether C compiler handles -Wnormalized=nfc... yes
  3388. checking whether C compiler handles -Wno-sign-compare... yes
  3389. checking whether C compiler handles -Wjump-misses-init... (cached) yes
  3390. checking whether C compiler handles -Wno-format-nonliteral... yes
  3391. checking whether C compiler handles -Wframe-larger-than=4096... yes
  3392. checking whether C compiler handles -fstack-protector-strong... yes
  3393. checking whether C compiler handles -fexceptions... yes
  3394. checking whether C compiler handles -fasynchronous-unwind-tables... yes
  3395. checking whether C compiler handles -fipa-pure-const... yes
  3396. checking whether C compiler handles -Wno-suggest-attribute=pure... yes
  3397. checking whether C compiler handles -Wno-suggest-attribute=const... yes
  3398. checking whether C compiler handles -Werror... yes
  3399. checking whether C compiler handles -fPIE -DPIE -pie... yes
  3400. checking for how to force completely read-only GOT table... -Wl,-z -Wl,relro -Wl,-z -Wl,now
  3401. checking for how to avoid indirect lib deps... -Wl,--no-copy-dt-needed-entries
  3402. checking for aa_change_profile in -lapparmor... no
  3403. checking for getxattr in -lattr... yes
  3404. checking attr/xattr.h usability... yes
  3405. checking attr/xattr.h presence... yes
  3406. checking for attr/xattr.h... yes
  3407. checking for audit_encode_nv_string in -laudit... no
  3408. checking for pkg-config... /usr/bin/pkg-config
  3409. checking pkg-config is at least version 0.9.0... yes
  3410. checking for AVAHI... yes
  3411. checking for BLKID... yes
  3412. checking for capng_updatev in -lcap-ng... no
  3413. checking for CURL... yes
  3414. checking for DBUS... yes
  3415. checking for dbus_watch_get_unix_fd... yes
  3416. checking for DBusBasicValue... yes
  3417. checking for FUSE... no
  3418. checking for GLUSTERFS... no
  3419. checking for HAL... no
  3420. checking for NETCF... no
  3421. checking for numa_available in -lnuma... no
  3422. checking for numa_bitmask_isbitset in -lnuma... no
  3423. checking for OPENWSMAN... no
  3424. checking for PCIACCESS... yes
  3425. checking for library containing tgetent... -lncurses
  3426. checking for readline in -lreadline... yes
  3427. checking for readline/readline.h... (cached) yes
  3428. checking for rl_initialize in -lreadline... yes
  3429. checking for sanlock_init in -lsanlock_client... no
  3430. checking for sasl_client_init in -lsasl2... yes
  3431. checking for sasl/sasl.h... (cached) yes
  3432. checking for fgetfilecon_raw in -lselinux... no
  3433. checking for SSH2... yes
  3434. checking for SYSTEMD_DAEMON... yes
  3435. checking for sd_notify... yes
  3436. checking for UDEV... yes
  3437. checking for WIRESHARK_DISSECTOR... no
  3438. checking for qemu-kvm... no
  3439. checking for qemu... no
  3440. checking for kvm... no
  3441. checking for qemu-system-x86_64... no
  3442. checking for yajl_parse_complete in -lyajl... no
  3443. checking for yajl_tree_parse in -lyajl... yes
  3444. checking for yajl/yajl_common.h... (cached) yes
  3445. checking for CPUID instruction... yes
  3446. checking size of long... 8
  3447. checking for pthread_mutexattr_init... yes
  3448. checking for pthread.h... (cached) yes
  3449. checking whether pthread_sigmask does anything... yes
  3450. checking pwd.h usability... yes
  3451. checking pwd.h presence... yes
  3452. checking for pwd.h... yes
  3453. checking paths.h usability... yes
  3454. checking paths.h presence... yes
  3455. checking for paths.h... yes
  3456. checking regex.h usability... yes
  3457. checking regex.h presence... yes
  3458. checking for regex.h... yes
  3459. checking sys/un.h usability... yes
  3460. checking sys/un.h presence... yes
  3461. checking for sys/un.h... yes
  3462. checking sys/poll.h usability... yes
  3463. checking sys/poll.h presence... yes
  3464. checking for sys/poll.h... yes
  3465. checking syslog.h usability... yes
  3466. checking syslog.h presence... yes
  3467. checking for syslog.h... yes
  3468. checking mntent.h usability... yes
  3469. checking mntent.h presence... yes
  3470. checking for mntent.h... yes
  3471. checking net/ethernet.h usability... yes
  3472. checking net/ethernet.h presence... yes
  3473. checking for net/ethernet.h... yes
  3474. checking linux/magic.h usability... yes
  3475. checking linux/magic.h presence... yes
  3476. checking for linux/magic.h... yes
  3477. checking for sys/un.h... (cached) yes
  3478. checking sys/syscall.h usability... yes
  3479. checking sys/syscall.h presence... yes
  3480. checking for sys/syscall.h... yes
  3481. checking for sys/sysctl.h... (cached) yes
  3482. checking netinet/tcp.h usability... yes
  3483. checking netinet/tcp.h presence... yes
  3484. checking for netinet/tcp.h... yes
  3485. checking ifaddrs.h usability... yes
  3486. checking ifaddrs.h presence... yes
  3487. checking for ifaddrs.h... yes
  3488. checking libtasn1.h usability... yes
  3489. checking libtasn1.h presence... yes
  3490. checking for libtasn1.h... yes
  3491. checking sys/ucred.h usability... no
  3492. checking sys/ucred.h presence... no
  3493. checking for sys/ucred.h... no
  3494. checking sys/mount.h usability... yes
  3495. checking sys/mount.h presence... yes
  3496. checking for sys/mount.h... yes
  3497. checking whether htole64 is declared... yes
  3498. checking for atomic ops implementation... gcc
  3499. checking for struct ifreq... yes
  3500. checking for struct sockpeercred... no
  3501. checking whether ETH_FLAG_TXVLAN is declared... yes
  3502. checking whether ETH_FLAG_NTUPLE is declared... yes
  3503. checking whether ETH_FLAG_RXHASH is declared... yes
  3504. checking whether ETH_FLAG_LRO is declared... yes
  3505. checking whether ETHTOOL_GGSO is declared... yes
  3506. checking whether ETHTOOL_GGRO is declared... yes
  3507. checking whether ETHTOOL_GFLAGS is declared... yes
  3508. checking whether ETHTOOL_GFEATURES is declared... yes
  3509. checking for gettext in -lintl... no
  3510. checking for rpcgen... /usr/bin/rpcgen
  3511. checking for xmllint... /usr/bin/xmllint
  3512. checking for xmlcatalog... /usr/bin/xmlcatalog
  3513. checking for xsltproc... /usr/bin/xsltproc
  3514. checking for augparse... /usr/bin/augparse
  3515. checking for dmidecode... dmidecode
  3516. checking for dnsmasq... /sbin/dnsmasq
  3517. checking for radvd... /usr/bin/radvd
  3518. checking for tc... /sbin/tc
  3519. checking for udevadm... /sbin/udevadm
  3520. checking for udevsettle... no
  3521. checking for modprobe... /sbin/modprobe
  3522. checking for rmmod... /sbin/rmmod
  3523. checking for mm-ctl... mm-ctl
  3524. checking for ovs-vsctl... ovs-vsctl
  3525. checking for scrub... scrub
  3526. checking for addr2line... /sbin/addr2line
  3527. checking for init script flavor... systemd
  3528. checking for whether to install sysctl config... yes
  3529. checking for ip... /usr/sbin/ip
  3530. checking for iptables... /usr/sbin/iptables
  3531. checking for ip6tables... /usr/sbin/ip6tables
  3532. checking for ebtables... /sbin/ebtables
  3533. checking for xdrmem_create in -lportablexdr... no
  3534. checking for library containing xdrmem_create... none required
  3535. checking for xdr_u_int64_t... no
  3536. checking where to find <rpc/rpc.h>... none
  3537. checking for dlfcn.h... (cached) yes
  3538. checking for library containing dlopen... -ldl
  3539. checking for xen_vm_start in -lxenserver... no
  3540. checking for LIBXL... no
  3541. checking for libxl_ctx_alloc in -lxenlight... no
  3542. checking for xs_read in -lxenstore... no
  3543. checking linux/kvm.h usability... yes
  3544. checking linux/kvm.h presence... yes
  3545. checking for linux/kvm.h... yes
  3546. checking for PARALLELS_SDK... no
  3547. checking for bhyve... no
  3548. checking for bhyvectl... no
  3549. checking for bhyveload... no
  3550. checking for shell that supports <> redirection... /bin/sh
  3551. checking whether <linux/*.h> and <netinet/*.h> headers are compatible... yes
  3552. checking for linux/param.h... yes
  3553. checking for linux/sockios.h... yes
  3554. checking for linux/if_bridge.h... yes
  3555. checking for linux/if_tun.h... yes
  3556. checking for pkg-config... (cached) /usr/bin/pkg-config
  3557. checking pkg-config is at least version 0.9.0... yes
  3558. checking for LIBXML... yes
  3559. checking for struct _xmlURI.query_raw... yes
  3560. checking for GNUTLS... yes
  3561. checking for gnutls/crypto.h... yes
  3562. checking for pkcheck... /usr/sbin/pkcheck
  3563. checking for dtrace... no
  3564. checking for numad... no
  3565. checking libpcap pcap-config >= 1.0.0 ... yes
  3566. checking sys/inotify.h usability... yes
  3567. checking sys/inotify.h presence... yes
  3568. checking for sys/inotify.h... yes
  3569. checking for mntent.h... (cached) yes
  3570. checking for mount... /usr/bin/mount
  3571. checking for umount... /usr/bin/umount
  3572. checking for mkfs... /usr/bin/mkfs
  3573. checking for showmount... no
  3574. checking for pvcreate... /usr/bin/pvcreate
  3575. checking for vgcreate... /usr/bin/vgcreate
  3576. checking for lvcreate... /usr/bin/lvcreate
  3577. checking for pvremove... /usr/bin/pvremove
  3578. checking for vgremove... /usr/bin/vgremove
  3579. checking for lvremove... /usr/bin/lvremove
  3580. checking for lvchange... /usr/bin/lvchange
  3581. checking for vgchange... /usr/bin/vgchange
  3582. checking for vgscan... /usr/bin/vgscan
  3583. checking for pvs... /usr/bin/pvs
  3584. checking for vgs... /usr/bin/vgs
  3585. checking for lvs... /usr/bin/lvs
  3586. checking for iscsiadm... no
  3587. checking rbd/librbd.h usability... no
  3588. checking rbd/librbd.h presence... no
  3589. checking for rbd/librbd.h... no
  3590. checking for collie... no
  3591. checking for dog... no
  3592. checking for gluster... no
  3593. checking for parted... /usr/bin/parted
  3594. checking for dmsetup... /usr/bin/dmsetup
  3595. checking for LIBPARTED... yes
  3596. checking for DEVMAPPER... yes
  3597. checking libdevmapper.h usability... yes
  3598. checking libdevmapper.h presence... yes
  3599. checking for libdevmapper.h... yes
  3600. checking linux/btrfs.h usability... yes
  3601. checking linux/btrfs.h presence... yes
  3602. checking for linux/btrfs.h... yes
  3603. checking for python2... no
  3604. checking for python... /usr/bin/python
  3605. checking for perl... /usr/bin/perl
  3606. checking Whether to build test suite by default... yes
  3607. checking whether NLS is requested... yes
  3608. checking for msgfmt... /usr/bin/msgfmt
  3609. checking for gmsgfmt... /usr/bin/msgfmt
  3610. checking for xgettext... /usr/bin/xgettext
  3611. checking for msgmerge... /usr/bin/msgmerge
  3612. checking for CFPreferencesCopyAppValue... (cached) no
  3613. checking for CFLocaleCopyCurrent... (cached) no
  3614. checking for GNU gettext in libc... yes
  3615. checking whether to use NLS... yes
  3616. checking where the gettext function comes from... libc
  3617. checking for qemu-bridge-helper... /usr/libexec/qemu-bridge-helper
  3618. checking whether to compile with macvtap support... yes
  3619. checking whether MACVLAN_MODE_PASSTHRU is declared... yes
  3620. checking whether to compile with virtual port support... yes
  3621. checking whether GET_VLAN_VID_CMD is declared... yes
  3622. checking for LIBNL... yes
  3623. checking for LIBNL_ROUTE3... yes
  3624. checking for struct ifreq.ifr_newname... yes
  3625. checking for struct ifreq.ifr_ifindex... yes
  3626. checking for struct ifreq.ifr_index... no
  3627. checking for struct ifreq.ifr_hwaddr... yes
  3628. checking whether BRDGSFD is declared... no
  3629. checking whether BRDGADD is declared... no
  3630. checking whether BRDGDEL is declared... no
  3631. checking whether cpuset_getaffinity is declared... no
  3632. checking for struct if_data.ifi_oqdrops... no
  3633. checking whether this build is done by a static analysis tool... no
  3634. checking that generated files are newer than configure... done
  3635. configure: creating ./config.status
  3636. config.status: creating run
  3637. config.status: creating Makefile
  3638. config.status: creating src/Makefile
  3639. config.status: creating include/Makefile
  3640. config.status: creating docs/Makefile
  3641. config.status: creating gnulib/lib/Makefile
  3642. config.status: creating gnulib/tests/Makefile
  3643. config.status: creating libvirt.pc
  3644. config.status: creating libvirt-qemu.pc
  3645. config.status: creating libvirt-lxc.pc
  3646. config.status: creating libvirt-admin.pc
  3647. config.status: creating src/libvirt.pc
  3648. config.status: creating src/libvirt-qemu.pc
  3649. config.status: creating src/libvirt-lxc.pc
  3650. config.status: creating libvirt.spec
  3651. config.status: creating mingw-libvirt.spec
  3652. config.status: creating po/Makefile.in
  3653. config.status: creating include/libvirt/libvirt-common.h
  3654. config.status: creating daemon/Makefile
  3655. config.status: creating examples/Makefile
  3656. config.status: creating tests/Makefile
  3657. config.status: creating tools/Makefile
  3658. config.status: creating config.h
  3659. config.status: executing depfiles commands
  3660. config.status: executing libtool commands
  3661. config.status: executing po-directories commands
  3662. config.status: creating po/POTFILES
  3663. config.status: creating po/Makefile
  3664. configure:
  3665. configure: Configuration summary
  3666. configure: =====================
  3667. configure:
  3668. configure: Drivers
  3669. configure:
  3670. configure:       Xen: no
  3671. configure:      QEMU: yes
  3672. configure:       UML: yes
  3673. configure:    OpenVZ: yes
  3674. configure:    VMware: yes
  3675. configure:      VBox: yes
  3676. configure:    XenAPI: no
  3677. configure:  xenlight: no
  3678. configure:       LXC: yes
  3679. configure:      PHYP: yes
  3680. configure:       ESX: yes
  3681. configure:   Hyper-V: no
  3682. configure:        vz: no
  3683. configure:     Bhyve: no
  3684. configure:      Test: yes
  3685. configure:    Remote: yes
  3686. configure:   Network: yes
  3687. configure:  Libvirtd: yes
  3688. configure: Interface: yes
  3689. configure:   macvtap: yes
  3690. configure:  virtport: yes
  3691. configure:
  3692. configure: Storage Drivers
  3693. configure:
  3694. configure:      Dir: yes
  3695. configure:       FS: yes
  3696. configure:    NetFS: yes
  3697. configure:      LVM: yes
  3698. configure:    iSCSI: no
  3699. configure:     SCSI: yes
  3700. configure:    mpath: yes
  3701. configure:     Disk: yes
  3702. configure:      RBD: no
  3703. configure: Sheepdog: no
  3704. configure:  Gluster: no
  3705. configure:      ZFS: no
  3706. configure:
  3707. configure: Security Drivers
  3708. configure:
  3709. configure:  SELinux: no ()
  3710. configure: AppArmor: no (install profiles: no)
  3711. configure:
  3712. configure: Driver Loadable Modules
  3713. configure:
  3714. configure:   dlopen:  -ldl
  3715. configure:
  3716. configure: Libraries
  3717. configure:
  3718. configure:   apparmor: no
  3719. configure:       attr: yes (CFLAGS='' LIBS='-lattr')
  3720. configure:      audit: no
  3721. configure:      avahi: yes (CFLAGS='-D_REENTRANT' LIBS='-lavahi-common -lavahi-client')
  3722. configure:      blkid: yes (CFLAGS='-I/usr/include/blkid -I/usr/include/uuid' LIBS='-lblkid')
  3723. configure:      capng: no
  3724. configure:       curl: yes (CFLAGS='-DCURL_DISABLE_TYPECHECK ' LIBS='-lcurl')
  3725. configure:       dbus: yes (CFLAGS='-I/usr/include/dbus-1.0 -I/usr/lib/dbus-1.0/include' LIBS='-ldbus-1')
  3726. configure:       fuse: no
  3727. configure:  glusterfs: no
  3728. configure:        hal: no
  3729. configure:      netcf: no
  3730. configure:    numactl: no
  3731. configure:  openwsman: no
  3732. configure:  pciaccess: yes (CFLAGS='' LIBS='-lpciaccess')
  3733. configure:   readline: yes (CFLAGS='' LIBS='-lreadline')
  3734. configure:    sanlock: no
  3735. configure:       sasl: yes (CFLAGS='' LIBS='-lsasl2')
  3736. configure:    selinux: no
  3737. configure:       ssh2: yes (CFLAGS='' LIBS='-lssh2 -Wl,-O1,--sort-common,--as-needed,-z,relro')
  3738. configure: systemd_daemon: yes (CFLAGS='' LIBS='-lsystemd')
  3739. configure:       udev: yes (CFLAGS='' LIBS='-ludev')
  3740. configure: wireshark_dissector: no
  3741. configure:       yajl: yes (CFLAGS='' LIBS='-lyajl')
  3742. configure:   libxml: -I/usr/include/libxml2 -lxml2
  3743. configure:   dlopen: -ldl
  3744. configure: openwsman: no
  3745. configure:   gnutls: -I/usr/include/p11-kit-1 -lgnutls
  3746. configure: firewalld: yes
  3747. configure:   polkit: /usr/sbin/pkcheck (version 1)
  3748. configure:      xen: no
  3749. configure:   xenapi: no
  3750. configure: xenlight: no
  3751. configure:     pcap: -I/usr/include -L/usr/lib  -lpcap
  3752. configure:       nl: -I/usr/include/libnl3 -I/usr/include/libnl3 -lnl-3 -lnl-route-3 -lnl-3
  3753. configure:    mscom: no
  3754. configure:      xdr:
  3755. configure:      rbd: no
  3756. configure: pm-utils: no
  3757. configure:
  3758. configure: Test suite
  3759. configure:
  3760. configure:          Coverage: no
  3761. configure:         Alloc OOM: no
  3762. configure:
  3763. configure: Miscellaneous
  3764. configure:
  3765. configure:             Debug: yes
  3766. configure:       Use -Werror: yes
  3767. configure:     Warning Flags:  -W -Waddress -Waggressive-loop-optimizations -Wall -Wattributes -Wbad-function-cast -Wbool-compare -Wbuiltin-macro-redefined -Wcast-align -Wchar-subscripts -Wchkp -Wclobbered -Wcomment -Wcomments -Wcoverage-mismatch -Wcpp -Wdate-time -Wdeprecated-declarations -Wdesignated-init -Wdisabled-optimization -Wdiscarded-array-qualifiers -Wdiscarded-qualifiers -Wdiv-by-zero -Wdouble-promotion -Wempty-body -Wendif-labels -Wextra -Wformat-contains-nul -Wformat-extra-args -Wformat-security -Wformat-y2k -Wformat-zero-length -Wfree-nonheap-object -Wignored-qualifiers -Wimplicit -Wimplicit-function-declaration -Wimplicit-int -Wincompatible-pointer-types -Winit-self -Winline -Wint-conversion -Wint-to-pointer-cast -Winvalid-memory-model -Winvalid-pch -Wjump-misses-init -Wlogical-not-parentheses -Wlogical-op -Wmain -Wmaybe-uninitialized -Wmemset-transposed-args -Wmissing-braces -Wmissing-declarations -Wmissing-field-initializers -Wmissing-include-dirs -Wmissing-parameter-type -Wmissing-prototypes -Wmultichar -Wnarrowing -Wnested-externs -Wnonnull -Wodr -Wold-style-declaration -Wold-style-definition -Wopenmp-simd -Woverflow -Woverride-init -Wpacked-bitfield-compat -Wparentheses -Wpointer-arith -Wpointer-sign -Wpointer-to-int-cast -Wpragmas -Wreturn-local-addr -Wreturn-type -Wsequence-point -Wshadow -Wshift-count-negative -Wshift-count-overflow -Wsizeof-array-argument -Wsizeof-pointer-memaccess -Wstrict-aliasing -Wstrict-prototypes -Wsuggest-attribute=const -Wsuggest-attribute=format -Wsuggest-attribute=noreturn -Wsuggest-attribute=pure -Wsuggest-final-methods -Wsuggest-final-types -Wswitch -Wswitch-bool -Wsync-nand -Wtrampolines -Wtrigraphs -Wtype-limits -Wuninitialized -Wunknown-pragmas -Wunused -Wunused-but-set-parameter -Wunused-but-set-variable -Wunused-function -Wunused-label -Wunused-local-typedefs -Wunused-parameter -Wunused-result -Wunused-value -Wunused-variable -Wvarargs -Wvariadic-macros -Wvector-operation-performance -Wvolatile-register-var -Wwrite-strings -Warray-bounds=2 -Wnormalized=nfc -Wno-sign-compare -Wjump-misses-init -Wno-format-nonliteral -Wframe-larger-than=4096 -fstack-protector-strong -fexceptions -fasynchronous-unwind-tables -fipa-pure-const -Wno-suggest-attribute=pure -Wno-suggest-attribute=const -Werror
  3768. configure:            DTrace: no
  3769. configure:             numad: no
  3770. configure:       XML Catalog: /etc/xml/catalog
  3771. configure:       Init script: systemd
  3772. configure: Char device locks: /var/lock
  3773. configure:    Default Editor: vi
  3774. configure:      Loader/NVRAM:
  3775. configure:  virt-login-shell: yes
  3776. configure:
  3777. configure: Developer Tools
  3778. configure:
  3779. configure: Wireshark dissector: no
  3780. configure:
  3781. configure: Privileges
  3782. configure:
  3783. configure:       QEMU: root:root
  3784. configure:
  3785. STARTING MAKE
  3786. make  all-recursive
  3787. make[1]: Entering directory '/build/libvirt-git/src/libvirt'
  3788. Making all in .
  3789. make[2]: Entering directory '/build/libvirt-git/src/libvirt'
  3790. make[2]: Nothing to be done for 'all-am'.
  3791. make[2]: Leaving directory '/build/libvirt-git/src/libvirt'
  3792. Making all in gnulib/lib
  3793. make[2]: Entering directory '/build/libvirt-git/src/libvirt/gnulib/lib'
  3794.   GEN      alloca.h
  3795.   GEN      c++defs.h
  3796.   GEN      warn-on-use.h
  3797.   GEN      arg-nonnull.h
  3798.   GEN      arpa/inet.h
  3799.   GEN      configmake.h
  3800.   GEN      fcntl.h
  3801.   GEN      langinfo.h
  3802.   GEN      locale.h
  3803.   GEN      netdb.h
  3804.   GEN      poll.h
  3805.   GEN      pty.h
  3806.   GEN      signal.h
  3807.   GEN      unused-parameter.h
  3808.   GEN      stdio.h
  3809.   GEN      stdlib.h
  3810.   GEN      string.h
  3811.   GEN      strings.h
  3812.   GEN      sys/ioctl.h
  3813.   GEN      sys/select.h
  3814.   GEN      sys/socket.h
  3815.   GEN      sys/stat.h
  3816.   GEN      sys/time.h
  3817.   GEN      sys/types.h
  3818.   GEN      sys/uio.h
  3819.   GEN      sys/utsname.h
  3820.   GEN      sys/wait.h
  3821.   GEN      termios.h
  3822.   GEN      time.h
  3823.   GEN      unistd.h
  3824.   GEN      wchar.h
  3825.   GEN      wctype.h
  3826. make  all-am
  3827. make[3]: Entering directory '/build/libvirt-git/src/libvirt/gnulib/lib'
  3828.   CC       allocator.lo
  3829.   CC       areadlink.lo
  3830.   CC       base64.lo
  3831.   CC       binary-io.lo
  3832.   CC       bitrotate.lo
  3833.   CC       c-ctype.lo
  3834.   CC       c-strcasecmp.lo
  3835.   CC       c-strncasecmp.lo
  3836.   CC       c-strcasestr.lo
  3837.   CC       careadlinkat.lo
  3838.   CC       cloexec.lo
  3839.   CC       count-leading-zeros.lo
  3840.   CC       count-one-bits.lo
  3841.   CC       md5.lo
  3842.   CC       sha256.lo
  3843.   CC       dirname-lgpl.lo
  3844.   CC       basename-lgpl.lo
  3845.   CC       stripslash.lo
  3846.   CC       fd-hook.lo
  3847.   CC       freading.lo
  3848.   CC       getugroups.lo
  3849.   CC       localcharset.lo
  3850.   CC       glthread/lock.lo
  3851.   CC       malloca.lo
  3852.   CC       mgetgroups.lo
  3853.   CC       nonblocking.lo
  3854.   CC       passfd.lo
  3855.   CC       physmem.lo
  3856.   CC       pipe2.lo
  3857.   CC       sig-handler.lo
  3858.   CC       sockets.lo
  3859.   CC       stat-time.lo
  3860.   CC       strnlen1.lo
  3861.   CC       sys_socket.lo
  3862.   CC       tempname.lo
  3863.   CC       glthread/threadlib.lo
  3864.   CC       unistd.lo
  3865.   CC       wctype-h.lo
  3866.   CC       xsize.lo
  3867.   CC       asnprintf.lo
  3868.   CC       fclose.lo
  3869.   CC       fcntl.lo
  3870.   CC       fflush.lo
  3871.   CC       fpurge.lo
  3872.   CC       fseek.lo
  3873.   CC       fseeko.lo
  3874.   CC       ioctl.lo
  3875.   CC       mktime.lo
  3876.   CC       printf-args.lo
  3877.   CC       printf-parse.lo
  3878.   CC       strerror_r.lo
  3879.   CC       vasnprintf.lo
  3880.   CCLD     libgnu.la
  3881.   GEN      charset.alias
  3882.   GEN      ref-add.sed
  3883.   GEN      ref-del.sed
  3884. make[3]: Leaving directory '/build/libvirt-git/src/libvirt/gnulib/lib'
  3885. make[2]: Leaving directory '/build/libvirt-git/src/libvirt/gnulib/lib'
  3886. Making all in include
  3887. make[2]: Entering directory '/build/libvirt-git/src/libvirt/include'
  3888. make[2]: Nothing to be done for 'all'.
  3889. make[2]: Leaving directory '/build/libvirt-git/src/libvirt/include'
  3890. Making all in src
  3891. make[2]: Entering directory '/build/libvirt-git/src/libvirt/src'
  3892. /usr/bin/mkdir -p util/
  3893.   GEN      util/virkeymaps.h
  3894.   File "./util/virkeycode-mapgen.py", line 50
  3895.     '''
  3896.       ^
  3897. SyntaxError: Missing parentheses in call to 'print'
  3898. Makefile:10339: recipe for target 'util/virkeymaps.h' failed
  3899. make[2]: *** [util/virkeymaps.h] Error 1
  3900. make[2]: Leaving directory '/build/libvirt-git/src/libvirt/src'
  3901. Makefile:2002: recipe for target 'all-recursive' failed
  3902. make[1]: *** [all-recursive] Error 1
  3903. make[1]: Leaving directory '/build/libvirt-git/src/libvirt'
  3904. Makefile:1897: recipe for target 'all' failed
  3905. make: *** [all] Error 2
  3906. ==> ERROR: A failure occurred in build().
  3907.     Aborting...
  3908. ==> ERROR: Build failed, check /tmp/chroot/extra-x86_64/dan/build
RAW Paste Data
We use cookies for various purposes including analytics. By continuing to use Pastebin, you agree to our use of cookies as described in the Cookies Policy. OK, I Understand
 
Top