Guest User

Untitled

a guest
May 29th, 2016
82
Never
Not a member of Pastebin yet? Sign Up, it unlocks many cool features!
  1.  
  2. ==> Lade PKGBUILD von kanatest aus dem AUR herunter...
  3. x .AURINFO
  4. x .SRCINFO
  5. x PKGBUILD
  6. x kanatest.install
  7. balwierz commented on 2014-06-13 21:32
  8. Adopted; removed unused .desktop file; updated to rev 88
  9.  
  10. p90 commented on 2014-09-24 06:38
  11. I think this is missing some dependencies at build time.
  12. It failed at first because I did not have svn and automake installed (which was easy to fix but still should be in the pkg file in the first place)
  13. and now fails with:
  14.  
  15. checking which GTK+ version to compile against... 2.0
  16. ./configure: line 3886: syntax error near unexpected token `GTK,'
  17. ./configure: line 3886: `PKG_CHECK_MODULES(GTK, gtk+-$GTK_API_VERSION = $GTK_REQUIRED)'
  18.  
  19. So my guess is I am missing the right GTK files for this?
  20.  
  21. p90 commented on 2014-09-25 13:00
  22. Found a solution.
  23. I apparently have to run "aclocal" before I try to compile this package.
  24. No idea why but it works now.
  25.  
  26. awh commented on 2014-12-20 22:36
  27. Needs to depend on svn.
  28.  
  29. p90 commented on 2016-05-25 14:41
  30. Hi,
  31.  
  32. cannot build this anymore:
  33.  
  34. make[2]: Für das Ziel „install-exec-am“ ist nichts zu tun.
  35. for i in de.mo el.mo es.mo fi.mo fr.mo hu.mo it.mo pl.mo pt.mo ru.mo zh_CN.mo; do \
  36. lang=`echo $i | sed 's/\.mo$//'`; \
  37. /bin/sh /tmp/yaourt-tmp-p91/aur-kanatest/src/build/install-sh -d /tmp/yaourt-tmp-p91/aur-kanatest/pkg/kanatest/usr/share/locale/$lang/LC_MESSAGES; \
  38. /usr/bin/install -c -m 644 $i /tmp/yaourt-tmp-p91/aur-kanatest/pkg/kanatest/usr/share/locale/$lang/LC_MESSAGES/kanatest.mo; \
  39. done
  40. /usr/bin/install: der Aufruf von stat für 'de.mo' ist nicht möglich: Datei oder Verzeichnis nicht gefunden
  41. /usr/bin/install: der Aufruf von stat für 'el.mo' ist nicht möglich: Datei oder Verzeichnis nicht gefunden
  42. /usr/bin/install: der Aufruf von stat für 'es.mo' ist nicht möglich: Datei oder Verzeichnis nicht gefunden
  43. /usr/bin/install: der Aufruf von stat für 'fi.mo' ist nicht möglich: Datei oder Verzeichnis nicht gefunden
  44. /usr/bin/install: der Aufruf von stat für 'fr.mo' ist nicht möglich: Datei oder Verzeichnis nicht gefunden
  45. /usr/bin/install: der Aufruf von stat für 'hu.mo' ist nicht möglich: Datei oder Verzeichnis nicht gefunden
  46. /usr/bin/install: der Aufruf von stat für 'it.mo' ist nicht möglich: Datei oder Verzeichnis nicht gefunden
  47. /usr/bin/install: der Aufruf von stat für 'pl.mo' ist nicht möglich: Datei oder Verzeichnis nicht gefunden
  48. /usr/bin/install: der Aufruf von stat für 'pt.mo' ist nicht möglich: Datei oder Verzeichnis nicht gefunden
  49. /usr/bin/install: der Aufruf von stat für 'ru.mo' ist nicht möglich: Datei oder Verzeichnis nicht gefunden
  50. /usr/bin/install: der Aufruf von stat für 'zh_CN.mo' ist nicht möglich: Datei oder Verzeichnis nicht gefunden
  51. Makefile:452: die Regel für Ziel „install-data-local“ scheiterte
  52. make[2]: *** [install-data-local] Fehler 1
  53. make[2]: Verzeichnis „/tmp/yaourt-tmp-p91/aur-kanatest/src/build/po“ wird verlassen
  54. Makefile:331: die Regel für Ziel „install-am“ scheiterte
  55. make[1]: *** [install-am] Fehler 2
  56. make[1]: Verzeichnis „/tmp/yaourt-tmp-p91/aur-kanatest/src/build/po“ wird verlassen
  57. Makefile:398: die Regel für Ziel „install-recursive“ scheiterte
  58. make: *** [install-recursive] Fehler 1
  59.  
  60. kanatest 0.4.10-2 (2015-07-06 17:13)
  61. (Nicht unterstütztes Paket: Potenziell gefährlich!)
  62. ==> Von kanatest benötigt:
  63. - gtk2 (bereits installiert)
  64. - libxml2 (bereits installiert)
  65.  
  66.  
  67. ==> Mit dem Erstellen von kanatest fortfahren?[J/n]
  68. ==> -----------------------------------------------
  69. ==>
  70. ==> Erstelle und installiere Paket
  71. ==> Erstelle Paket: kanatest 0.4.10-2 (So 29. Mai 12:26:43 CEST 2016)
  72. ==> Prüfe Laufzeit-Abhängigkeiten...
  73. ==> Prüfe Buildtime-Abhängigkeiten...
  74. ==> Empfange Quellen...
  75. ==> Entpacke Quellen...
  76. ==> Beginne build()...
  77. A kanatest/src
  78. A kanatest/data
  79. A kanatest/data/maemo
  80. A kanatest/data/maemo/icons
  81. A kanatest/data/maemo/icons/scalable
  82. A kanatest/data/maemo/icons/26x26
  83. A kanatest/data/maemo/icons/40x40
  84. A kanatest/data/pixmaps
  85. A kanatest/data/icons
  86. A kanatest/data/icons/22x22
  87. A kanatest/data/icons/48x48
  88. A kanatest/data/icons/32x32
  89. A kanatest/data/icons/24x24
  90. A kanatest/data/maemo/icons/40x40/kanatest.png
  91. A kanatest/data/kanatest.desktop
  92. A kanatest/ChangeLog
  93. A kanatest/src/options.h
  94. A kanatest/data/icons/22x22/Makefile.am
  95. A kanatest/data/icons/32x32/Makefile.am
  96. A kanatest/data/icons/24x24/kanatest.png
  97. A kanatest/COPYING
  98. A kanatest/data/icons/16x16
  99. A kanatest/data/icons/scalable
  100. A kanatest/data/maemo/kanatest.desktop
  101. A kanatest/data/maemo/icons/scalable/Makefile.am
  102. A kanatest/data/maemo/icons/26x26/Makefile.am
  103. A kanatest/data/maemo/icons/40x40/Makefile.am
  104. A kanatest/src/chart.c
  105. A kanatest/src/stats.h
  106. A kanatest/po
  107. A kanatest/src/gui_utils.c
  108. A kanatest/data/pixmaps/kanatest.png
  109. A kanatest/data/icons/22x22/kanatest.png
  110. A kanatest/data/icons/16x16/kanatest.png
  111. A kanatest/data/icons/48x48/kanatest.png
  112. A kanatest/data/icons/24x24/Makefile.am
  113. A kanatest/data/icons/16x16/Makefile.am
  114. A kanatest/data/icons/Makefile.am
  115. A kanatest/autogen.sh
  116. A kanatest/po/Makefile.in.in
  117. A kanatest/po/pl.po
  118. A kanatest/data/icons/scalable/kanatest.svg
  119. A kanatest/TRANSLATORS
  120. A kanatest/po/Makefile.am
  121. A kanatest/po/POTFILES.in
  122. A kanatest/po/it.po
  123. A kanatest/debian
  124. A kanatest/po/el.po
  125. A kanatest/po/fi.po
  126. A kanatest/po/pt.po
  127. A kanatest/po/zh_CN.po
  128. A kanatest/po/es.po
  129. A kanatest/po/fr.po
  130. A kanatest/debian/kanatest.install
  131. A kanatest/po/de.po
  132. A kanatest/debian/control
  133. A kanatest/debian/dirs
  134. A kanatest/debian/changelog
  135. A kanatest/AUTHORS
  136. A kanatest/debian/postinst
  137. A kanatest/debian/copyright
  138. A kanatest/configure.ac
  139. A kanatest/src/graphics.h
  140. A kanatest/src/chart.h
  141. A kanatest/src/gui_utils.h
  142. A kanatest/src/about.c
  143. A kanatest/src/stock_icons_data.h
  144. A kanatest/src/stock_icons.c
  145. A kanatest/src/prefs.c
  146. A kanatest/src/about.h
  147. A kanatest/src/test.c
  148. A kanatest/src/stock_icons.h
  149. A kanatest/src/main.c
  150. A kanatest/src/i18n.h
  151. A kanatest/src/gui.c
  152. A kanatest/src/prefs.h
  153. A kanatest/src/test.h
  154. A kanatest/src/Makefile.am
  155. A kanatest/src/gui.h
  156. A kanatest/src/main.h
  157. A kanatest/src/options.c
  158. A kanatest/src/stats.c
  159. A kanatest/Makefile.am
  160. A kanatest/data/maemo/org.clayo.kanatest.service
  161. A kanatest/data/maemo/icons/scalable/kanatest.png
  162. A kanatest/data/maemo/icons/26x26/kanatest.png
  163. A kanatest/data/pixmaps/Makefile.am
  164. A kanatest/data/Makefile.am
  165. A kanatest/data/icons/48x48/Makefile.am
  166. A kanatest/data/icons/32x32/kanatest.png
  167. A kanatest/data/icons/kanatest.ico
  168. A kanatest/data/icons/scalable/Makefile.am
  169. A kanatest/README
  170. A kanatest/po/hu.po
  171. A kanatest/po/kanatest.pot
  172. A kanatest/po/ru.po
  173. A kanatest/debian/rules
  174. A kanatest/debian/compat
  175. A kanatest/debian/docs
  176. Ausgecheckt, Revision 88.
  177. checking for autoconf >= 2.61... found
  178. checking for automake >= 1.8.5... Unescaped left brace in regex is deprecated, passed through in regex; marked by <-- HERE in m/\${ <-- HERE ([^ \t=:+{}]+)}/ at /usr/bin/automake line 3936.
  179. found
  180. checking for configure.ac... found
  181. checking for Makefile.am... found
  182. generate configure script... Unescaped left brace in regex is deprecated, passed through in regex; marked by <-- HERE in m/\${ <-- HERE ([^ \t=:+{}]+)}/ at /usr/bin/automake line 3936.
  183. configure.ac:11: installing './compile'
  184. configure.ac:6: installing './install-sh'
  185. configure.ac:6: installing './missing'
  186. po/Makefile.am:2: warning: wildcard ../src/*.c ../src/*.h: non-POSIX variable name
  187. po/Makefile.am:2: (probably a GNU make extension)
  188. po/Makefile.am:20: warning: '%'-style pattern rules are a GNU make extension
  189. po/Makefile.am:23: warning: '%'-style pattern rules are a GNU make extension
  190. src/Makefile.am:2: warning: ':='-style assignments are not portable
  191. src/Makefile.am:2: warning: shell if test -e .svn; then echo -DREV=\"`LC_ALL=C svn info | sed -n '/^Rev/p'| sed -e 's/^Revision:\ //'`\"; fi;: non-POSIX variable name
  192. src/Makefile.am:2: (probably a GNU make extension)
  193. src/Makefile.am: installing './depcomp'
  194. done
  195. checking for a BSD-compatible install... /usr/bin/install -c
  196. checking whether build environment is sane... yes
  197. checking for a thread-safe mkdir -p... /usr/bin/mkdir -p
  198. checking for gawk... gawk
  199. checking whether make sets $(MAKE)... yes
  200. checking whether make supports nested variables... yes
  201. checking for gcc... gcc
  202. checking whether the C compiler works... yes
  203. checking for C compiler default output file name... a.out
  204. checking for suffix of executables...
  205. checking whether we are cross compiling... no
  206. checking for suffix of object files... o
  207. checking whether we are using the GNU C compiler... yes
  208. checking whether gcc accepts -g... yes
  209. checking for gcc option to accept ISO C89... none needed
  210. checking whether gcc understands -c and -o together... yes
  211. checking for style of include used by make... GNU
  212. checking dependency style of gcc... gcc3
  213. checking which GTK+ version to compile against... 2.0
  214. checking for pkg-config... /usr/bin/pkg-config
  215. checking pkg-config is at least version 0.9.0... yes
  216. checking for GTK... yes
  217. checking for xml2-config... yes
  218. checking for xmlNewDoc in -lxml2... yes
  219. checking how to run the C preprocessor... gcc -E
  220. checking for grep that handles long lines and -e... /usr/bin/grep
  221. checking for egrep... /usr/bin/grep -E
  222. checking for ANSI C header files... yes
  223. checking for sys/types.h... yes
  224. checking for sys/stat.h... yes
  225. checking for stdlib.h... yes
  226. checking for string.h... yes
  227. checking for memory.h... yes
  228. checking for strings.h... yes
  229. checking for inttypes.h... yes
  230. checking for stdint.h... yes
  231. checking for unistd.h... yes
  232. checking libintl.h usability... yes
  233. checking libintl.h presence... yes
  234. checking for libintl.h... yes
  235. checking for stdlib.h... (cached) yes
  236. checking for string.h... (cached) yes
  237. checking sys/time.h usability... yes
  238. checking sys/time.h presence... yes
  239. checking for sys/time.h... yes
  240. checking for unistd.h... (cached) yes
  241. checking locale.h usability... yes
  242. checking locale.h presence... yes
  243. checking for locale.h... yes
  244. checking limits.h usability... yes
  245. checking limits.h presence... yes
  246. checking for limits.h... yes
  247. checking for an ANSI C-conforming const... yes
  248. checking whether time.h and sys/time.h may both be included... yes
  249. checking whether struct tm is in sys/time.h or time.h... time.h
  250. checking whether lstat correctly handles trailing slash... yes
  251. checking whether stat accepts an empty string... no
  252. checking for gettimeofday... yes
  253. checking for strrchr... yes
  254. checking that generated files are newer than configure... done
  255. configure: creating ./config.status
  256. config.status: creating Makefile
  257. config.status: creating src/Makefile
  258. config.status: creating po/Makefile
  259. config.status: creating data/Makefile
  260. config.status: creating data/icons/Makefile
  261. config.status: creating data/icons/16x16/Makefile
  262. config.status: creating data/icons/22x22/Makefile
  263. config.status: creating data/icons/24x24/Makefile
  264. config.status: creating data/icons/32x32/Makefile
  265. config.status: creating data/icons/48x48/Makefile
  266. config.status: creating data/icons/scalable/Makefile
  267. config.status: creating data/pixmaps/Makefile
  268. config.status: creating config.h
  269. config.status: executing depfiles commands
  270.  
  271. Configuration:
  272.  
  273. Maemo support: no
  274. Debug enabled: no
  275.  
  276. make all-recursive
  277. make[1]: Verzeichnis „/tmp/yaourt-tmp-p91/aur-kanatest/src/build“ wird betreten
  278. Making all in src
  279. make[2]: Verzeichnis „/tmp/yaourt-tmp-p91/aur-kanatest/src/build/src“ wird betreten
  280. gcc -DHAVE_CONFIG_H -I. -I.. -Wall -DLOCALEDIR=\"/usr/share/locale\" -DGDK_PIXBUF_DISABLE_DEPRECATED -DGDK_DISABLE_DEPRECATED -pthread -I/usr/include/gtk-2.0 -I/usr/lib/gtk-2.0/include -I/usr/include/pango-1.0 -I/usr/include/atk-1.0 -I/usr/include/cairo -I/usr/include/pixman-1 -I/usr/include/libdrm -I/usr/include/gdk-pixbuf-2.0 -I/usr/include/libpng16 -I/usr/include/pango-1.0 -I/usr/include/freetype2 -I/usr/include/libpng16 -I/usr/include/harfbuzz -I/usr/include/glib-2.0 -I/usr/lib/glib-2.0/include -I/usr/include/freetype2 -I/usr/include/libpng16 -I/usr/include/harfbuzz -I/usr/include/glib-2.0 -I/usr/lib/glib-2.0/include -I/usr/include/libxml2 -Wall -D_GNU_SOURCE -MT kanatest-about.o -MD -MP -MF .deps/kanatest-about.Tpo -c -o kanatest-about.o `test -f 'about.c' || echo './'`about.c
  281. mv -f .deps/kanatest-about.Tpo .deps/kanatest-about.Po
  282. gcc -DHAVE_CONFIG_H -I. -I.. -Wall -DLOCALEDIR=\"/usr/share/locale\" -DGDK_PIXBUF_DISABLE_DEPRECATED -DGDK_DISABLE_DEPRECATED -pthread -I/usr/include/gtk-2.0 -I/usr/lib/gtk-2.0/include -I/usr/include/pango-1.0 -I/usr/include/atk-1.0 -I/usr/include/cairo -I/usr/include/pixman-1 -I/usr/include/libdrm -I/usr/include/gdk-pixbuf-2.0 -I/usr/include/libpng16 -I/usr/include/pango-1.0 -I/usr/include/freetype2 -I/usr/include/libpng16 -I/usr/include/harfbuzz -I/usr/include/glib-2.0 -I/usr/lib/glib-2.0/include -I/usr/include/freetype2 -I/usr/include/libpng16 -I/usr/include/harfbuzz -I/usr/include/glib-2.0 -I/usr/lib/glib-2.0/include -I/usr/include/libxml2 -Wall -D_GNU_SOURCE -MT kanatest-chart.o -MD -MP -MF .deps/kanatest-chart.Tpo -c -o kanatest-chart.o `test -f 'chart.c' || echo './'`chart.c
  283. mv -f .deps/kanatest-chart.Tpo .deps/kanatest-chart.Po
  284. gcc -DHAVE_CONFIG_H -I. -I.. -Wall -DLOCALEDIR=\"/usr/share/locale\" -DGDK_PIXBUF_DISABLE_DEPRECATED -DGDK_DISABLE_DEPRECATED -pthread -I/usr/include/gtk-2.0 -I/usr/lib/gtk-2.0/include -I/usr/include/pango-1.0 -I/usr/include/atk-1.0 -I/usr/include/cairo -I/usr/include/pixman-1 -I/usr/include/libdrm -I/usr/include/gdk-pixbuf-2.0 -I/usr/include/libpng16 -I/usr/include/pango-1.0 -I/usr/include/freetype2 -I/usr/include/libpng16 -I/usr/include/harfbuzz -I/usr/include/glib-2.0 -I/usr/lib/glib-2.0/include -I/usr/include/freetype2 -I/usr/include/libpng16 -I/usr/include/harfbuzz -I/usr/include/glib-2.0 -I/usr/lib/glib-2.0/include -I/usr/include/libxml2 -Wall -D_GNU_SOURCE -MT kanatest-gui.o -MD -MP -MF .deps/kanatest-gui.Tpo -c -o kanatest-gui.o `test -f 'gui.c' || echo './'`gui.c
  285. gui.c: In Funktion »gui_create_window«:
  286. gui.c:813:20: Warnung: Implizite Deklaration der Funktion »gdk_pixbuf_new_from_inline« [-Wimplicit-function-declaration]
  287. appGUI->icon = gdk_pixbuf_new_from_inline (-1, kanatest_icon, FALSE, NULL);
  288. ^~~~~~~~~~~~~~~~~~~~~~~~~~
  289. gui.c:813:18: Warnung: Zuweisung erzeugt Zeiger von Ganzzahl ohne Typkonvertierung [-Wint-conversion]
  290. appGUI->icon = gdk_pixbuf_new_from_inline (-1, kanatest_icon, FALSE, NULL);
  291. ^
  292. gui.c:833:18: Warnung: Zuweisung erzeugt Zeiger von Ganzzahl ohne Typkonvertierung [-Wint-conversion]
  293. appGUI->logo = gdk_pixbuf_new_from_inline (-1, kanatest_logo, FALSE, NULL);
  294. ^
  295. mv -f .deps/kanatest-gui.Tpo .deps/kanatest-gui.Po
  296. gcc -DHAVE_CONFIG_H -I. -I.. -Wall -DLOCALEDIR=\"/usr/share/locale\" -DGDK_PIXBUF_DISABLE_DEPRECATED -DGDK_DISABLE_DEPRECATED -pthread -I/usr/include/gtk-2.0 -I/usr/lib/gtk-2.0/include -I/usr/include/pango-1.0 -I/usr/include/atk-1.0 -I/usr/include/cairo -I/usr/include/pixman-1 -I/usr/include/libdrm -I/usr/include/gdk-pixbuf-2.0 -I/usr/include/libpng16 -I/usr/include/pango-1.0 -I/usr/include/freetype2 -I/usr/include/libpng16 -I/usr/include/harfbuzz -I/usr/include/glib-2.0 -I/usr/lib/glib-2.0/include -I/usr/include/freetype2 -I/usr/include/libpng16 -I/usr/include/harfbuzz -I/usr/include/glib-2.0 -I/usr/lib/glib-2.0/include -I/usr/include/libxml2 -Wall -D_GNU_SOURCE -MT kanatest-gui_utils.o -MD -MP -MF .deps/kanatest-gui_utils.Tpo -c -o kanatest-gui_utils.o `test -f 'gui_utils.c' || echo './'`gui_utils.c
  297. mv -f .deps/kanatest-gui_utils.Tpo .deps/kanatest-gui_utils.Po
  298. gcc -DHAVE_CONFIG_H -I. -I.. -Wall -DLOCALEDIR=\"/usr/share/locale\" -DGDK_PIXBUF_DISABLE_DEPRECATED -DGDK_DISABLE_DEPRECATED -pthread -I/usr/include/gtk-2.0 -I/usr/lib/gtk-2.0/include -I/usr/include/pango-1.0 -I/usr/include/atk-1.0 -I/usr/include/cairo -I/usr/include/pixman-1 -I/usr/include/libdrm -I/usr/include/gdk-pixbuf-2.0 -I/usr/include/libpng16 -I/usr/include/pango-1.0 -I/usr/include/freetype2 -I/usr/include/libpng16 -I/usr/include/harfbuzz -I/usr/include/glib-2.0 -I/usr/lib/glib-2.0/include -I/usr/include/freetype2 -I/usr/include/libpng16 -I/usr/include/harfbuzz -I/usr/include/glib-2.0 -I/usr/lib/glib-2.0/include -I/usr/include/libxml2 -Wall -D_GNU_SOURCE -MT kanatest-main.o -MD -MP -MF .deps/kanatest-main.Tpo -c -o kanatest-main.o `test -f 'main.c' || echo './'`main.c
  299. mv -f .deps/kanatest-main.Tpo .deps/kanatest-main.Po
  300. gcc -DHAVE_CONFIG_H -I. -I.. -Wall -DLOCALEDIR=\"/usr/share/locale\" -DGDK_PIXBUF_DISABLE_DEPRECATED -DGDK_DISABLE_DEPRECATED -pthread -I/usr/include/gtk-2.0 -I/usr/lib/gtk-2.0/include -I/usr/include/pango-1.0 -I/usr/include/atk-1.0 -I/usr/include/cairo -I/usr/include/pixman-1 -I/usr/include/libdrm -I/usr/include/gdk-pixbuf-2.0 -I/usr/include/libpng16 -I/usr/include/pango-1.0 -I/usr/include/freetype2 -I/usr/include/libpng16 -I/usr/include/harfbuzz -I/usr/include/glib-2.0 -I/usr/lib/glib-2.0/include -I/usr/include/freetype2 -I/usr/include/libpng16 -I/usr/include/harfbuzz -I/usr/include/glib-2.0 -I/usr/lib/glib-2.0/include -I/usr/include/libxml2 -Wall -D_GNU_SOURCE -MT kanatest-options.o -MD -MP -MF .deps/kanatest-options.Tpo -c -o kanatest-options.o `test -f 'options.c' || echo './'`options.c
  301. mv -f .deps/kanatest-options.Tpo .deps/kanatest-options.Po
  302. gcc -DHAVE_CONFIG_H -I. -I.. -Wall -DLOCALEDIR=\"/usr/share/locale\" -DGDK_PIXBUF_DISABLE_DEPRECATED -DGDK_DISABLE_DEPRECATED -pthread -I/usr/include/gtk-2.0 -I/usr/lib/gtk-2.0/include -I/usr/include/pango-1.0 -I/usr/include/atk-1.0 -I/usr/include/cairo -I/usr/include/pixman-1 -I/usr/include/libdrm -I/usr/include/gdk-pixbuf-2.0 -I/usr/include/libpng16 -I/usr/include/pango-1.0 -I/usr/include/freetype2 -I/usr/include/libpng16 -I/usr/include/harfbuzz -I/usr/include/glib-2.0 -I/usr/lib/glib-2.0/include -I/usr/include/freetype2 -I/usr/include/libpng16 -I/usr/include/harfbuzz -I/usr/include/glib-2.0 -I/usr/lib/glib-2.0/include -I/usr/include/libxml2 -Wall -D_GNU_SOURCE -MT kanatest-prefs.o -MD -MP -MF .deps/kanatest-prefs.Tpo -c -o kanatest-prefs.o `test -f 'prefs.c' || echo './'`prefs.c
  303. mv -f .deps/kanatest-prefs.Tpo .deps/kanatest-prefs.Po
  304. gcc -DHAVE_CONFIG_H -I. -I.. -Wall -DLOCALEDIR=\"/usr/share/locale\" -DGDK_PIXBUF_DISABLE_DEPRECATED -DGDK_DISABLE_DEPRECATED -pthread -I/usr/include/gtk-2.0 -I/usr/lib/gtk-2.0/include -I/usr/include/pango-1.0 -I/usr/include/atk-1.0 -I/usr/include/cairo -I/usr/include/pixman-1 -I/usr/include/libdrm -I/usr/include/gdk-pixbuf-2.0 -I/usr/include/libpng16 -I/usr/include/pango-1.0 -I/usr/include/freetype2 -I/usr/include/libpng16 -I/usr/include/harfbuzz -I/usr/include/glib-2.0 -I/usr/lib/glib-2.0/include -I/usr/include/freetype2 -I/usr/include/libpng16 -I/usr/include/harfbuzz -I/usr/include/glib-2.0 -I/usr/lib/glib-2.0/include -I/usr/include/libxml2 -Wall -D_GNU_SOURCE -MT kanatest-stats.o -MD -MP -MF .deps/kanatest-stats.Tpo -c -o kanatest-stats.o `test -f 'stats.c' || echo './'`stats.c
  305. mv -f .deps/kanatest-stats.Tpo .deps/kanatest-stats.Po
  306. gcc -DHAVE_CONFIG_H -I. -I.. -Wall -DLOCALEDIR=\"/usr/share/locale\" -DGDK_PIXBUF_DISABLE_DEPRECATED -DGDK_DISABLE_DEPRECATED -pthread -I/usr/include/gtk-2.0 -I/usr/lib/gtk-2.0/include -I/usr/include/pango-1.0 -I/usr/include/atk-1.0 -I/usr/include/cairo -I/usr/include/pixman-1 -I/usr/include/libdrm -I/usr/include/gdk-pixbuf-2.0 -I/usr/include/libpng16 -I/usr/include/pango-1.0 -I/usr/include/freetype2 -I/usr/include/libpng16 -I/usr/include/harfbuzz -I/usr/include/glib-2.0 -I/usr/lib/glib-2.0/include -I/usr/include/freetype2 -I/usr/include/libpng16 -I/usr/include/harfbuzz -I/usr/include/glib-2.0 -I/usr/lib/glib-2.0/include -I/usr/include/libxml2 -Wall -D_GNU_SOURCE -MT kanatest-stock_icons.o -MD -MP -MF .deps/kanatest-stock_icons.Tpo -c -o kanatest-stock_icons.o `test -f 'stock_icons.c' || echo './'`stock_icons.c
  307. stock_icons.c: In Funktion »kanatest_register_stock_icons«:
  308. stock_icons.c:58:18: Warnung: Implizite Deklaration der Funktion »gdk_pixbuf_new_from_inline« [-Wimplicit-function-declaration]
  309. pixbuf = gdk_pixbuf_new_from_inline(-1, kanatest_stock_item_data[i], FALSE, NULL);
  310. ^~~~~~~~~~~~~~~~~~~~~~~~~~
  311. stock_icons.c:58:16: Warnung: Zuweisung erzeugt Zeiger von Ganzzahl ohne Typkonvertierung [-Wint-conversion]
  312. pixbuf = gdk_pixbuf_new_from_inline(-1, kanatest_stock_item_data[i], FALSE, NULL);
  313. ^
  314. mv -f .deps/kanatest-stock_icons.Tpo .deps/kanatest-stock_icons.Po
  315. gcc -DHAVE_CONFIG_H -I. -I.. -Wall -DLOCALEDIR=\"/usr/share/locale\" -DGDK_PIXBUF_DISABLE_DEPRECATED -DGDK_DISABLE_DEPRECATED -pthread -I/usr/include/gtk-2.0 -I/usr/lib/gtk-2.0/include -I/usr/include/pango-1.0 -I/usr/include/atk-1.0 -I/usr/include/cairo -I/usr/include/pixman-1 -I/usr/include/libdrm -I/usr/include/gdk-pixbuf-2.0 -I/usr/include/libpng16 -I/usr/include/pango-1.0 -I/usr/include/freetype2 -I/usr/include/libpng16 -I/usr/include/harfbuzz -I/usr/include/glib-2.0 -I/usr/lib/glib-2.0/include -I/usr/include/freetype2 -I/usr/include/libpng16 -I/usr/include/harfbuzz -I/usr/include/glib-2.0 -I/usr/lib/glib-2.0/include -I/usr/include/libxml2 -Wall -D_GNU_SOURCE -MT kanatest-test.o -MD -MP -MF .deps/kanatest-test.Tpo -c -o kanatest-test.o `test -f 'test.c' || echo './'`test.c
  316. mv -f .deps/kanatest-test.Tpo .deps/kanatest-test.Po
  317. gcc -Wall -D_GNU_SOURCE -Wl,-O1,--sort-common,--as-needed,-z,relro -o kanatest kanatest-about.o kanatest-chart.o kanatest-gui.o kanatest-gui_utils.o kanatest-main.o kanatest-options.o kanatest-prefs.o kanatest-stats.o kanatest-stock_icons.o kanatest-test.o -lgtk-x11-2.0 -lgdk-x11-2.0 -lpangocairo-1.0 -latk-1.0 -lcairo -lgdk_pixbuf-2.0 -lgio-2.0 -lpangoft2-1.0 -lpango-1.0 -lgobject-2.0 -lglib-2.0 -lfontconfig -lfreetype -lxml2 -lz -llzma -lm -ldl
  318. make[2]: Verzeichnis „/tmp/yaourt-tmp-p91/aur-kanatest/src/build/src“ wird verlassen
  319. Making all in po
  320. make[2]: Verzeichnis „/tmp/yaourt-tmp-p91/aur-kanatest/src/build/po“ wird betreten
  321. make[2]: Verzeichnis „/tmp/yaourt-tmp-p91/aur-kanatest/src/build/po“ wird verlassen
  322. Making all in data
  323. make[2]: Verzeichnis „/tmp/yaourt-tmp-p91/aur-kanatest/src/build/data“ wird betreten
  324. Making all in icons
  325. make[3]: Verzeichnis „/tmp/yaourt-tmp-p91/aur-kanatest/src/build/data/icons“ wird betreten
  326. Making all in 16x16
  327. make[4]: Verzeichnis „/tmp/yaourt-tmp-p91/aur-kanatest/src/build/data/icons/16x16“ wird betreten
  328. make[4]: Für das Ziel „all“ ist nichts zu tun.
  329. make[4]: Verzeichnis „/tmp/yaourt-tmp-p91/aur-kanatest/src/build/data/icons/16x16“ wird verlassen
  330. Making all in 22x22
  331. make[4]: Verzeichnis „/tmp/yaourt-tmp-p91/aur-kanatest/src/build/data/icons/22x22“ wird betreten
  332. make[4]: Für das Ziel „all“ ist nichts zu tun.
  333. make[4]: Verzeichnis „/tmp/yaourt-tmp-p91/aur-kanatest/src/build/data/icons/22x22“ wird verlassen
  334. Making all in 24x24
  335. make[4]: Verzeichnis „/tmp/yaourt-tmp-p91/aur-kanatest/src/build/data/icons/24x24“ wird betreten
  336. make[4]: Für das Ziel „all“ ist nichts zu tun.
  337. make[4]: Verzeichnis „/tmp/yaourt-tmp-p91/aur-kanatest/src/build/data/icons/24x24“ wird verlassen
  338. Making all in 32x32
  339. make[4]: Verzeichnis „/tmp/yaourt-tmp-p91/aur-kanatest/src/build/data/icons/32x32“ wird betreten
  340. make[4]: Für das Ziel „all“ ist nichts zu tun.
  341. make[4]: Verzeichnis „/tmp/yaourt-tmp-p91/aur-kanatest/src/build/data/icons/32x32“ wird verlassen
  342. Making all in 48x48
  343. make[4]: Verzeichnis „/tmp/yaourt-tmp-p91/aur-kanatest/src/build/data/icons/48x48“ wird betreten
  344. make[4]: Für das Ziel „all“ ist nichts zu tun.
  345. make[4]: Verzeichnis „/tmp/yaourt-tmp-p91/aur-kanatest/src/build/data/icons/48x48“ wird verlassen
  346. Making all in scalable
  347. make[4]: Verzeichnis „/tmp/yaourt-tmp-p91/aur-kanatest/src/build/data/icons/scalable“ wird betreten
  348. make[4]: Für das Ziel „all“ ist nichts zu tun.
  349. make[4]: Verzeichnis „/tmp/yaourt-tmp-p91/aur-kanatest/src/build/data/icons/scalable“ wird verlassen
  350. make[4]: Verzeichnis „/tmp/yaourt-tmp-p91/aur-kanatest/src/build/data/icons“ wird betreten
  351. make[4]: Für das Ziel „all-am“ ist nichts zu tun.
  352. make[4]: Verzeichnis „/tmp/yaourt-tmp-p91/aur-kanatest/src/build/data/icons“ wird verlassen
  353. make[3]: Verzeichnis „/tmp/yaourt-tmp-p91/aur-kanatest/src/build/data/icons“ wird verlassen
  354. Making all in pixmaps
  355. make[3]: Verzeichnis „/tmp/yaourt-tmp-p91/aur-kanatest/src/build/data/pixmaps“ wird betreten
  356. make[3]: Für das Ziel „all“ ist nichts zu tun.
  357. make[3]: Verzeichnis „/tmp/yaourt-tmp-p91/aur-kanatest/src/build/data/pixmaps“ wird verlassen
  358. make[3]: Verzeichnis „/tmp/yaourt-tmp-p91/aur-kanatest/src/build/data“ wird betreten
  359. make[3]: Für das Ziel „all-am“ ist nichts zu tun.
  360. make[3]: Verzeichnis „/tmp/yaourt-tmp-p91/aur-kanatest/src/build/data“ wird verlassen
  361. make[2]: Verzeichnis „/tmp/yaourt-tmp-p91/aur-kanatest/src/build/data“ wird verlassen
  362. make[2]: Verzeichnis „/tmp/yaourt-tmp-p91/aur-kanatest/src/build“ wird betreten
  363. make[2]: Verzeichnis „/tmp/yaourt-tmp-p91/aur-kanatest/src/build“ wird verlassen
  364. make[1]: Verzeichnis „/tmp/yaourt-tmp-p91/aur-kanatest/src/build“ wird verlassen
  365. ==> Betrete fakeroot Umgebung...
  366. ==> Beginne package()...
  367. Making install in src
  368. make[1]: Verzeichnis „/tmp/yaourt-tmp-p91/aur-kanatest/src/build/src“ wird betreten
  369. make[2]: Verzeichnis „/tmp/yaourt-tmp-p91/aur-kanatest/src/build/src“ wird betreten
  370. /usr/bin/mkdir -p '/tmp/yaourt-tmp-p91/aur-kanatest/pkg/kanatest/usr/bin'
  371. /usr/bin/install -c kanatest '/tmp/yaourt-tmp-p91/aur-kanatest/pkg/kanatest/usr/bin'
  372. make[2]: Für das Ziel „install-data-am“ ist nichts zu tun.
  373. make[2]: Verzeichnis „/tmp/yaourt-tmp-p91/aur-kanatest/src/build/src“ wird verlassen
  374. make[1]: Verzeichnis „/tmp/yaourt-tmp-p91/aur-kanatest/src/build/src“ wird verlassen
  375. Making install in po
  376. make[1]: Verzeichnis „/tmp/yaourt-tmp-p91/aur-kanatest/src/build/po“ wird betreten
  377. make[2]: Verzeichnis „/tmp/yaourt-tmp-p91/aur-kanatest/src/build/po“ wird betreten
  378. make[2]: Für das Ziel „install-exec-am“ ist nichts zu tun.
  379. for i in de.mo el.mo es.mo fi.mo fr.mo hu.mo it.mo pl.mo pt.mo ru.mo zh_CN.mo; do \
  380. lang=`echo $i | sed 's/\.mo$//'`; \
  381. /bin/sh /tmp/yaourt-tmp-p91/aur-kanatest/src/build/install-sh -d /tmp/yaourt-tmp-p91/aur-kanatest/pkg/kanatest/usr/share/locale/$lang/LC_MESSAGES; \
  382. /usr/bin/install -c -m 644 $i /tmp/yaourt-tmp-p91/aur-kanatest/pkg/kanatest/usr/share/locale/$lang/LC_MESSAGES/kanatest.mo; \
  383. done
  384. /usr/bin/install: der Aufruf von stat für 'de.mo' ist nicht möglich: Datei oder Verzeichnis nicht gefunden
  385. /usr/bin/install: der Aufruf von stat für 'el.mo' ist nicht möglich: Datei oder Verzeichnis nicht gefunden
  386. /usr/bin/install: der Aufruf von stat für 'es.mo' ist nicht möglich: Datei oder Verzeichnis nicht gefunden
  387. /usr/bin/install: der Aufruf von stat für 'fi.mo' ist nicht möglich: Datei oder Verzeichnis nicht gefunden
  388. /usr/bin/install: der Aufruf von stat für 'fr.mo' ist nicht möglich: Datei oder Verzeichnis nicht gefunden
  389. /usr/bin/install: der Aufruf von stat für 'hu.mo' ist nicht möglich: Datei oder Verzeichnis nicht gefunden
  390. /usr/bin/install: der Aufruf von stat für 'it.mo' ist nicht möglich: Datei oder Verzeichnis nicht gefunden
  391. /usr/bin/install: der Aufruf von stat für 'pl.mo' ist nicht möglich: Datei oder Verzeichnis nicht gefunden
  392. /usr/bin/install: der Aufruf von stat für 'pt.mo' ist nicht möglich: Datei oder Verzeichnis nicht gefunden
  393. /usr/bin/install: der Aufruf von stat für 'ru.mo' ist nicht möglich: Datei oder Verzeichnis nicht gefunden
  394. /usr/bin/install: der Aufruf von stat für 'zh_CN.mo' ist nicht möglich: Datei oder Verzeichnis nicht gefunden
  395. Makefile:452: die Regel für Ziel „install-data-local“ scheiterte
  396. make[2]: *** [install-data-local] Fehler 1
  397. make[2]: Verzeichnis „/tmp/yaourt-tmp-p91/aur-kanatest/src/build/po“ wird verlassen
  398. Makefile:331: die Regel für Ziel „install-am“ scheiterte
  399. make[1]: *** [install-am] Fehler 2
  400. make[1]: Verzeichnis „/tmp/yaourt-tmp-p91/aur-kanatest/src/build/po“ wird verlassen
  401. Makefile:398: die Regel für Ziel „install-recursive“ scheiterte
  402. make: *** [install-recursive] Fehler 1
  403. ==> FEHLER: Ein Fehler geschah in package().
  404. Breche ab...
  405. ==> FEHLER:Makepkg konnte kanatest nicht erstellen.
  406. ==> Erstellen von kanatest neu starten?[j/N]
  407. ==> ----------------------------------------
  408. ==>
RAW Paste Data