Advertisement
Guest User

Untitled

a guest
Jun 24th, 2020
46
Never
Not a member of Pastebin yet? Sign Up, it unlocks many cool features!
  1. CommandInvokationFailure: Gradle build failed.
  2. /Applications/Unity/Hub/Editor/2018.4.22f1/PlaybackEngines/AndroidPlayer/Tools/OpenJDK/MacOS/bin/java -classpath "/Applications/Unity/Hub/Editor/2018.4.22f1/PlaybackEngines/AndroidPlayer/Tools/gradle/lib/gradle-launcher-5.1.1.jar" org.gradle.launcher.GradleMain "-Dorg.gradle.jvmargs=-Xmx4096m" "assembleDebug"
  3.  
  4. stderr[
  5. D8: Type com.google.firebase.iid.zzbb is referenced as an interface from `com.google.firebase.messaging.zzf`.
  6. com.android.builder.dexing.DexArchiveBuilderException: com.android.builder.dexing.DexArchiveBuilderException: Failed to process /Users/Kaleksandr/.gradle/caches/transforms-2/files-2.1/86382daecdda2f1385c26f0ca516409e/jars/classes.jar
  7. at sun.reflect.NativeConstructorAccessorImpl.newInstance0(Native Method)
  8. at sun.reflect.NativeConstructorAccessorImpl.newInstance(NativeConstructorAccessorImpl.java:62)
  9. at sun.reflect.DelegatingConstructorAccessorImpl.newInstance(DelegatingConstructorAccessorImpl.java:45)
  10. at java.lang.reflect.Constructor.newInstance(Constructor.java:423)
  11. at java.util.concurrent.ForkJoinTask.getThrowableException(ForkJoinTask.java:593)
  12. at java.util.concurrent.ForkJoinTask.reportException(ForkJoinTask.java:677)
  13. at java.util.concurrent.ForkJoinTask.join(ForkJoinTask.java:720)
  14. at com.android.ide.common.internal.WaitableExecutor.waitForTasksWithQuickFail(WaitableExecutor.java:146)
  15. at com.android.build.gradle.internal.transforms.DexArchiveBuilderTransform.transform(DexArchiveBuilderTransform.java:405)
  16. at com.android.build.gradle.internal.pipeline.TransformTask$2.call(TransformTask.java:239)
  17. at com.android.build.gradle.internal.pipeline.TransformTask$2.call(TransformTask.java:235)
  18. at com.android.builder.profile.ThreadRecorder.record(ThreadRecorder.java:102)
  19. at com.android.build.gradle.internal.pipeline.TransformTask.transform(TransformTask.java:230)
  20. at sun.reflect.NativeMethodAccessorImpl.invoke0(Native Method)
  21. at sun.reflect.NativeMethodAccessorImpl.invoke(NativeMethodAccessorImpl.java:62)
  22. at sun.reflect.DelegatingMethodAccessorImpl.invoke(DelegatingMethodAccessorImpl.java:43)
  23. at java.lang.reflect.Method.invoke(Method.java:498)
  24. at org.gradle.internal.reflect.JavaMethod.invoke(JavaMethod.java:73)
  25. at org.gradle.api.internal.project.taskfactory.IncrementalTaskAction.doExecute(IncrementalTaskAction.java:47)
  26. at org.gradle.api.internal.project.taskfactory.StandardTaskAction.execute(StandardTaskAction.java:41)
  27. at org.gradle.api.internal.project.taskfactory.StandardTaskAction.execute(StandardTaskAction.java:28)
  28. at org.gradle.api.internal.tasks.execution.ExecuteActionsTaskExecuter$2.run(ExecuteActionsTaskExecuter.java:284)
  29. at org.gradle.internal.operations.DefaultBuildOperationExecutor$RunnableBuildOperationWorker.execute(DefaultBuildOperationExecutor.java:301)
  30. at org.gradle.internal.operations.DefaultBuildOperationExecutor$RunnableBuildOperationWorker.execute(DefaultBuildOperationExecutor.java:293)
  31. at org.gradle.internal.operations.DefaultBuildOperationExecutor.execute(DefaultBuildOperationExecutor.java:175)
  32. at org.gradle.internal.operations.DefaultBuildOperationExecutor.run(DefaultBuildOperationExecutor.java:91)
  33. at org.gradle.internal.operations.DelegatingBuildOperationExecutor.run(DelegatingBuildOperationExecutor.java:31)
  34. at org.gradle.api.internal.tasks.execution.ExecuteActionsTaskExecuter.executeAction(ExecuteActionsTaskExecuter.java:273)
  35. at org.gradle.api.internal.tasks.execution.ExecuteActionsTaskExecuter.executeActions(ExecuteActionsTaskExecuter.java:258)
  36. at org.gradle.api.internal.tasks.execution.ExecuteActionsTaskExecuter.access$200(ExecuteActionsTaskExecuter.java:67)
  37. at org.gradle.api.internal.tasks.execution.ExecuteActionsTaskExecuter$TaskExecution.execute(ExecuteActionsTaskExecuter.java:145)
  38. at org.gradle.internal.execution.impl.steps.ExecuteStep.execute(ExecuteStep.java:49)
  39. at org.gradle.internal.execution.impl.steps.CancelExecutionStep.execute(CancelExecutionStep.java:34)
  40. at org.gradle.internal.execution.impl.steps.TimeoutStep.executeWithoutTimeout(TimeoutStep.java:69)
  41. at org.gradle.internal.execution.impl.steps.TimeoutStep.execute(TimeoutStep.java:49)
  42. at org.gradle.internal.execution.impl.steps.CatchExceptionStep.execute(CatchExceptionStep.java:33)
  43. at org.gradle.internal.execution.impl.steps.CreateOutputsStep.execute(CreateOutputsStep.java:50)
  44. at org.gradle.internal.execution.impl.steps.SnapshotOutputStep.execute(SnapshotOutputStep.java:43)
  45. at org.gradle.internal.execution.impl.steps.SnapshotOutputStep.execute(SnapshotOutputStep.java:29)
  46. at org.gradle.internal.execution.impl.steps.CacheStep.executeWithoutCache(CacheStep.java:134)
  47. at org.gradle.internal.execution.impl.steps.CacheStep.lambda$execute$3(CacheStep.java:83)
  48. at java.util.Optional.orElseGet(Optional.java:267)
  49. at org.gradle.internal.execution.impl.steps.CacheStep.execute(CacheStep.java:82)
  50. at org.gradle.internal.execution.impl.steps.CacheStep.execute(CacheStep.java:36)
  51. at org.gradle.internal.execution.impl.steps.PrepareCachingStep.execute(PrepareCachingStep.java:33)
  52. at org.gradle.internal.execution.impl.steps.StoreSnapshotsStep.execute(StoreSnapshotsStep.java:38)
  53. at org.gradle.internal.execution.impl.steps.StoreSnapshotsStep.execute(StoreSnapshotsStep.java:23)
  54. at org.gradle.internal.execution.impl.steps.SkipUpToDateStep.executeBecause(SkipUpToDateStep.java:96)
  55. at org.gradle.internal.execution.impl.steps.SkipUpToDateStep.lambda$execute$1(SkipUpToDateStep.java:91)
  56. at java.util.Optional.orElseGet(Optional.java:267)
  57. at org.gradle.internal.execution.impl.steps.SkipUpToDateStep.execute(SkipUpToDateStep.java:91)
  58. at org.gradle.internal.execution.impl.steps.SkipUpToDateStep.execute(SkipUpToDateStep.java:36)
  59. at org.gradle.internal.execution.impl.DefaultWorkExecutor.execute(DefaultWorkExecutor.java:34)
  60. at org.gradle.api.internal.tasks.execution.ExecuteActionsTaskExecuter.execute(ExecuteActionsTaskExecuter.java:91)
  61. at org.gradle.api.internal.tasks.execution.ResolveTaskOutputCachingStateExecuter.execute(ResolveTaskOutputCachingStateExecuter.java:91)
  62. at org.gradle.api.internal.tasks.execution.ValidatingTaskExecuter.execute(ValidatingTaskExecuter.java:57)
  63. at org.gradle.api.internal.tasks.execution.SkipEmptySourceFilesTaskExecuter.execute(SkipEmptySourceFilesTaskExecuter.java:119)
  64. at org.gradle.api.internal.tasks.execution.ResolvePreviousStateExecuter.execute(ResolvePreviousStateExecuter.java:43)
  65. at org.gradle.api.internal.tasks.execution.CleanupStaleOutputsExecuter.execute(CleanupStaleOutputsExecuter.java:93)
  66. at org.gradle.api.internal.tasks.execution.FinalizePropertiesTaskExecuter.execute(FinalizePropertiesTaskExecuter.java:45)
  67. at org.gradle.api.internal.tasks.execution.ResolveTaskArtifactStateTaskExecuter.execute(ResolveTaskArtifactStateTaskExecuter.java:94)
  68. at org.gradle.api.internal.tasks.execution.SkipTaskWithNoActionsExecuter.execute(SkipTaskWithNoActionsExecuter.java:56)
  69. at org.gradle.api.internal.tasks.execution.SkipOnlyIfTaskExecuter.execute(SkipOnlyIfTaskExecuter.java:55)
  70. at org.gradle.api.internal.tasks.execution.CatchExceptionTaskExecuter.execute(CatchExceptionTaskExecuter.java:36)
  71. at org.gradle.api.internal.tasks.execution.EventFiringTaskExecuter$1.executeTask(EventFiringTaskExecuter.java:67)
  72. at org.gradle.api.internal.tasks.execution.EventFiringTaskExecuter$1.call(EventFiringTaskExecuter.java:52)
  73. at org.gradle.api.internal.tasks.execution.EventFiringTaskExecuter$1.call(EventFiringTaskExecuter.java:49)
  74. at org.gradle.internal.operations.DefaultBuildOperationExecutor$CallableBuildOperationWorker.execute(DefaultBuildOperationExecutor.java:315)
  75. at org.gradle.internal.operations.DefaultBuildOperationExecutor$CallableBuildOperationWorker.execute(DefaultBuildOperationExecutor.java:305)
  76. at org.gradle.internal.operations.DefaultBuildOperationExecutor.execute(DefaultBuildOperationExecutor.java:175)
  77. at org.gradle.internal.operations.DefaultBuildOperationExecutor.call(DefaultBuildOperationExecutor.java:101)
  78. at org.gradle.internal.operations.DelegatingBuildOperationExecutor.call(DelegatingBuildOperationExecutor.java:36)
  79. at org.gradle.api.internal.tasks.execution.EventFiringTaskExecuter.execute(EventFiringTaskExecuter.java:49)
  80. at org.gradle.execution.plan.LocalTaskNodeExecutor.execute(LocalTaskNodeExecutor.java:43)
  81. at org.gradle.execution.taskgraph.DefaultTaskExecutionGraph$InvokeNodeExecutorsAction.execute(DefaultTaskExecutionGraph.java:355)
  82. at org.gradle.execution.taskgraph.DefaultTaskExecutionGraph$InvokeNodeExecutorsAction.execute(DefaultTaskExecutionGraph.java:343)
  83. at org.gradle.execution.taskgraph.DefaultTaskExecutionGraph$BuildOperationAwareExecutionAction.execute(DefaultTaskExecutionGraph.java:336)
  84. at org.gradle.execution.taskgraph.DefaultTaskExecutionGraph$BuildOperationAwareExecutionAction.execute(DefaultTaskExecutionGraph.java:322)
  85. at org.gradle.execution.plan.DefaultPlanExecutor$ExecutorWorker$1.execute(DefaultPlanExecutor.java:134)
  86. at org.gradle.execution.plan.DefaultPlanExecutor$ExecutorWorker$1.execute(DefaultPlanExecutor.java:129)
  87. at org.gradle.execution.plan.DefaultPlanExecutor$ExecutorWorker.execute(DefaultPlanExecutor.java:202)
  88. at org.gradle.execution.plan.DefaultPlanExecutor$ExecutorWorker.executeNextNode(DefaultPlanExecutor.java:193)
  89. at org.gradle.execution.plan.DefaultPlanExecutor$ExecutorWorker.run(DefaultPlanExecutor.java:129)
  90. at org.gradle.internal.concurrent.ExecutorPolicy$CatchAndRecordFailures.onExecute(ExecutorPolicy.java:63)
  91. at org.gradle.internal.concurrent.ManagedExecutorImpl$1.run(ManagedExecutorImpl.java:46)
  92. at java.util.concurrent.ThreadPoolExecutor.runWorker(ThreadPoolExecutor.java:1149)
  93. at java.util.concurrent.ThreadPoolExecutor$Worker.run(ThreadPoolExecutor.java:624)
  94. at org.gradle.internal.concurrent.ThreadFactoryImpl$ManagedThreadRunnable.run(ThreadFactoryImpl.java:55)
  95. at java.lang.Thread.run(Thread.java:748)
  96. Caused by: com.android.builder.dexing.DexArchiveBuilderException: Failed to process /Users/Kaleksandr/.gradle/caches/transforms-2/files-2.1/86382daecdda2f1385c26f0ca516409e/jars/classes.jar
  97. at com.android.build.gradle.internal.transforms.DexArchiveBuilderTransform.launchProcessing(DexArchiveBuilderTransform.java:900)
  98. at com.android.build.gradle.internal.transforms.DexArchiveBuilderTransform.lambda$convertToDexArchive$6(DexArchiveBuilderTransform.java:825)
  99. at java.util.concurrent.ForkJoinTask$AdaptedCallable.exec(ForkJoinTask.java:1424)
  100. at java.util.concurrent.ForkJoinTask.doExec(ForkJoinTask.java:289)
  101. at java.util.concurrent.ForkJoinPool$WorkQueue.runTask(ForkJoinPool.java:1056)
  102. at java.util.concurrent.ForkJoinPool.runWorker(ForkJoinPool.java:1692)
  103. at java.util.concurrent.ForkJoinWorkerThread.run(ForkJoinWorkerThread.java:157)
  104. Caused by: com.android.builder.dexing.DexArchiveBuilderException: Error while dexing.
  105. at com.android.builder.dexing.D8DexArchiveBuilder.getExceptionToRethrow(D8DexArchiveBuilder.java:124)
  106. at com.android.builder.dexing.D8DexArchiveBuilder.convert(D8DexArchiveBuilder.java:101)
  107. at com.android.build.gradle.internal.transforms.DexArchiveBuilderTransform.launchProcessing(DexArchiveBuilderTransform.java:895)
  108. ... 6 more
  109. Caused by: com.android.tools.r8.CompilationFailedException: Compilation failed to complete
  110. at com.android.tools.r8.utils.ExceptionUtils.withCompilationHandler(ExceptionUtils.java:65)
  111. at com.android.tools.r8.utils.ExceptionUtils.withD8CompilationHandler(ExceptionUtils.java:43)
  112. at com.android.tools.r8.D8.run(D8.java:90)
  113. at com.android.builder.dexing.D8DexArchiveBuilder.convert(D8DexArchiveBuilder.java:99)
  114. ... 7 more
  115. Caused by: com.android.tools.r8.utils.AbortException: Error: Type com.google.firebase.iid.zzbb is referenced as an interface from `com.google.firebase.messaging.zzf`.
  116. at com.android.tools.r8.utils.Reporter.failIfPendingErrors(Reporter.java:116)
  117. at com.android.tools.r8.utils.Reporter.fatalError(Reporter.java:74)
  118. at com.android.tools.r8.utils.ExceptionUtils.withCompilationHandler(ExceptionUtils.java:59)
  119. ... 10 more
  120.  
  121.  
  122. FAILURE: Build failed with an exception.
  123.  
  124. * What went wrong:
  125. Execution failed for task ':transformClassesWithDexBuilderForDebug'.
  126. > com.android.build.api.transform.TransformException: com.android.builder.dexing.DexArchiveBuilderException: com.android.builder.dexing.DexArchiveBuilderException: Failed to process /Users/Kaleksandr/.gradle/caches/transforms-2/files-2.1/86382daecdda2f1385c26f0ca516409e/jars/classes.jar
  127.  
  128. * Try:
  129. Run with --stacktrace option to get the stack trace. Run with --info or --debug option to get more log output. Run with --scan to get full insights.
  130.  
  131. * Get more help at https://help.gradle.org
  132.  
  133. BUILD FAILED in 28s
  134. ]
  135. stdout[
  136. > Task :preBuild UP-TO-DATE
  137. > Task :checkDebugClasspath
  138. > Task :appodeal:preBuild UP-TO-DATE
  139. > Task :appodeal:preDebugBuild UP-TO-DATE
  140. > Task :appodeal:checkDebugManifest
  141. > Task :appodeal:processDebugManifest
  142. > Task :Firebase:preBuild UP-TO-DATE
  143. > Task :Firebase:preDebugBuild UP-TO-DATE
  144. > Task :Firebase:checkDebugManifest
  145. > Task :Firebase:processDebugManifest
  146. > Task :mopub:preBuild UP-TO-DATE
  147. > Task :mopub:preDebugBuild UP-TO-DATE
  148. > Task :mopub:checkDebugManifest
  149. > Task :mopub:processDebugManifest
  150. > Task :OpenCoding:preBuild UP-TO-DATE
  151. > Task :OpenCoding:preDebugBuild UP-TO-DATE
  152. > Task :OpenCoding:checkDebugManifest
  153. > Task :OpenCoding:processDebugManifest
  154. > Task :unity-android-resources:preBuild UP-TO-DATE
  155. > Task :unity-android-resources:preDebugBuild UP-TO-DATE
  156. > Task :unity-android-resources:checkDebugManifest
  157. > Task :unity-android-resources:processDebugManifest
  158. > Task :UTNotificationsRes:preBuild UP-TO-DATE
  159. > Task :UTNotificationsRes:preDebugBuild UP-TO-DATE
  160. > Task :UTNotificationsRes:checkDebugManifest
  161. > Task :UTNotificationsRes:processDebugManifest
  162. > Task :VKLIB:preBuild UP-TO-DATE
  163. > Task :VKLIB:preDebugBuild UP-TO-DATE
  164. > Task :VKLIB:checkDebugManifest
  165. > Task :VKLIB:processDebugManifest
  166. > Task :preDebugBuild
  167. > Task :appodeal:compileDebugAidl NO-SOURCE
  168. > Task :Firebase:compileDebugAidl NO-SOURCE
  169. > Task :mopub:compileDebugAidl NO-SOURCE
  170. > Task :OpenCoding:compileDebugAidl NO-SOURCE
  171. > Task :unity-android-resources:compileDebugAidl NO-SOURCE
  172. > Task :UTNotificationsRes:compileDebugAidl NO-SOURCE
  173. > Task :VKLIB:compileDebugAidl NO-SOURCE
  174. > Task :compileDebugAidl NO-SOURCE
  175. > Task :appodeal:packageDebugRenderscript NO-SOURCE
  176. > Task :Firebase:packageDebugRenderscript NO-SOURCE
  177. > Task :mopub:packageDebugRenderscript NO-SOURCE
  178. > Task :OpenCoding:packageDebugRenderscript NO-SOURCE
  179. > Task :unity-android-resources:packageDebugRenderscript NO-SOURCE
  180. > Task :UTNotificationsRes:packageDebugRenderscript NO-SOURCE
  181. > Task :VKLIB:packageDebugRenderscript NO-SOURCE
  182. > Task :compileDebugRenderscript
  183. > Task :checkDebugManifest
  184. > Task :generateDebugBuildConfig
  185. > Task :prepareLintJar
  186. > Task :mainApkListPersistenceDebug
  187. > Task :generateDebugResValues
  188. > Task :generateDebugResources
  189. > Task :appodeal:compileDebugRenderscript
  190. > Task :appodeal:generateDebugResValues
  191. > Task :appodeal:generateDebugResources
  192. > Task :appodeal:packageDebugResources
  193. > Task :Firebase:compileDebugRenderscript
  194. > Task :Firebase:generateDebugResValues
  195. > Task :Firebase:generateDebugResources
  196. > Task :Firebase:packageDebugResources
  197. > Task :mopub:compileDebugRenderscript
  198. > Task :mopub:generateDebugResValues
  199. > Task :mopub:generateDebugResources
  200. > Task :mopub:packageDebugResources
  201. > Task :OpenCoding:compileDebugRenderscript
  202. > Task :OpenCoding:generateDebugResValues
  203. > Task :OpenCoding:generateDebugResources
  204. > Task :OpenCoding:packageDebugResources
  205. > Task :unity-android-resources:compileDebugRenderscript
  206. > Task :unity-android-resources:generateDebugResValues
  207. > Task :unity-android-resources:generateDebugResources
  208. > Task :unity-android-resources:packageDebugResources
  209. > Task :UTNotificationsRes:compileDebugRenderscript
  210. > Task :UTNotificationsRes:generateDebugResValues
  211. > Task :UTNotificationsRes:generateDebugResources
  212. > Task :UTNotificationsRes:packageDebugResources
  213. > Task :VKLIB:compileDebugRenderscript
  214. > Task :VKLIB:generateDebugResValues
  215. > Task :VKLIB:generateDebugResources
  216. > Task :VKLIB:packageDebugResources
  217. > Task :mergeDebugResources
  218. > Task :createDebugCompatibleScreenManifests
  219. > Task :processDebugManifest
  220. > Task :splitsDiscoveryTaskDebug
  221. > Task :appodeal:generateDebugRFile
  222. > Task :Firebase:generateDebugRFile
  223. > Task :mopub:generateDebugRFile
  224. > Task :OpenCoding:generateDebugRFile
  225. > Tas<message truncated>
Advertisement
RAW Paste Data Copied
Advertisement