Guest User

MacPort - APR-UTIL fail install on OS X Mountian Lion

a guest
Feb 25th, 2012
93
Never
Not a member of Pastebin yet? Sign Up, it unlocks many cool features!
  1. version:1
  2. :debug:main Attempting ln -sf /opt/local/var/macports/build/_opt_local_var_macports_sources_rsync.macports.org_release_tarballs_ports_devel_apr-util/apr-util/work /opt/local/var/macports/sources/rsync.macports.org/release/tarballs/ports/devel/apr-util/work
  3. :debug:main changing euid/egid - current euid: 0 - current egid: 0
  4. :debug:main egid changed to: 501
  5. :debug:main euid changed to: 502
  6. :debug:main Executing org.macports.main (apr-util)
  7. :debug:main Privilege de-escalation not attempted as not running as root.
  8. :debug:archivefetch archivefetch phase started at Sat Feb 25 14:49:36 CET 2012
  9. :msg:archivefetch ---> Fetching archive for apr-util
  10. :debug:archivefetch Executing org.macports.archivefetch (apr-util)
  11. :debug:archivefetch euid/egid changed to: 0/0
  12. :debug:archivefetch chowned /opt/local/var/macports/software/apr-util to macports
  13. :debug:archivefetch euid/egid changed to: 502/501
  14. :debug:archivefetch euid/egid changed to: 0/0
  15. :debug:archivefetch chowned /opt/local/var/macports/incoming to macports
  16. :debug:archivefetch euid/egid changed to: 502/501
  17. :info:archivefetch ---> apr-util-1.4.1_0.darwin_12.x86_64.tbz2 doesn't seem to exist in /opt/local/var/macports/software/apr-util
  18. :msg:archivefetch ---> Attempting to fetch apr-util-1.4.1_0.darwin_12.x86_64.tbz2 from http://packages.macports.org/apr-util
  19. :debug:archivefetch Fetching archive failed:: The requested URL returned error: 404
  20. :debug:archivefetch Privilege de-escalation not attempted as not running as root.
  21. :debug:fetch fetch phase started at Sat Feb 25 14:49:37 CET 2012
  22. :notice:fetch ---> Fetching apr-util
  23. :debug:fetch euid/egid changed to: 0/0
  24. :debug:fetch chowned /opt/local/var/macports/distfiles/apr-util to macports
  25. :debug:fetch euid/egid changed to: 502/501
  26. :debug:fetch Executing org.macports.fetch (apr-util)
  27. :debug:fetch Privilege de-escalation not attempted as not running as root.
  28. :debug:checksum checksum phase started at Sat Feb 25 14:49:37 CET 2012
  29. :notice:checksum ---> Verifying checksum(s) for apr-util
  30. :debug:checksum Executing org.macports.checksum (apr-util)
  31. :info:checksum ---> Checksumming apr-util-1.4.1.tar.bz2
  32. :debug:checksum Correct (md5) checksum for apr-util-1.4.1.tar.bz2
  33. :debug:checksum Correct (sha1) checksum for apr-util-1.4.1.tar.bz2
  34. :debug:checksum Correct (rmd160) checksum for apr-util-1.4.1.tar.bz2
  35. :debug:checksum Privilege de-escalation not attempted as not running as root.
  36. :debug:extract extract phase started at Sat Feb 25 14:49:37 CET 2012
  37. :notice:extract ---> Extracting apr-util
  38. :debug:extract setting option extract.cmd to /usr/bin/bzip2
  39. :debug:extract Executing org.macports.extract (apr-util)
  40. :info:extract ---> Extracting apr-util-1.4.1.tar.bz2
  41. :debug:extract setting option extract.args to '/opt/local/var/macports/distfiles/apr-util/apr-util-1.4.1.tar.bz2'
  42. :debug:extract Environment: CPATH='/opt/local/include' CC_PRINT_OPTIONS_FILE='/opt/local/var/macports/build/_opt_local_var_macports_sources_rsync.macports.org_release_tarballs_ports_devel_apr-util/apr-util/work/.CC_PRINT_OPTIONS' LIBRARY_PATH='/opt/local/lib' CC_PRINT_OPTIONS='YES' MACOSX_DEPLOYMENT_TARGET='10.8' GI_SCANNER_DISABLE_CACHE='1'
  43. :debug:extract Assembled command: 'cd "/opt/local/var/macports/build/_opt_local_var_macports_sources_rsync.macports.org_release_tarballs_ports_devel_apr-util/apr-util/work" && /usr/bin/bzip2 -dc '/opt/local/var/macports/distfiles/apr-util/apr-util-1.4.1.tar.bz2' | /usr/bin/gnutar --no-same-owner -xf -'
  44. :debug:extract Executing command line: cd "/opt/local/var/macports/build/_opt_local_var_macports_sources_rsync.macports.org_release_tarballs_ports_devel_apr-util/apr-util/work" && /usr/bin/bzip2 -dc '/opt/local/var/macports/distfiles/apr-util/apr-util-1.4.1.tar.bz2' | /usr/bin/gnutar --no-same-owner -xf -
  45. :debug:extract euid/egid changed to: 0/0
  46. :debug:extract chowned /opt/local/var/macports/build/_opt_local_var_macports_sources_rsync.macports.org_release_tarballs_ports_devel_apr-util/apr-util/work to macports
  47. :debug:extract euid/egid changed to: 502/501
  48. :debug:extract Privilege de-escalation not attempted as not running as root.
  49. :debug:patch patch phase started at Sat Feb 25 14:49:37 CET 2012
  50. :debug:patch Executing org.macports.patch (apr-util)
  51. :debug:patch Privilege de-escalation not attempted as not running as root.
  52. :debug:configure configure phase started at Sat Feb 25 14:49:37 CET 2012
  53. :notice:configure ---> Configuring apr-util
  54. :debug:configure Using compiler 'Mac OS X clang'
  55. :debug:configure Executing proc-pre-org.macports.configure-configure-0
  56. :debug:configure euid/egid changed to: 0/0
  57. :debug:configure chowned /opt/local/var/macports/build/_opt_local_var_macports_sources_rsync.macports.org_release_tarballs_ports_devel_apr-util/apr-util/work/apr-util-1.4.1/apr-util.pc.in to macports
  58. :debug:configure euid/egid changed to: 502/501
  59. :debug:configure euid/egid changed to: 0/0
  60. :debug:configure setting attributes on /opt/local/var/macports/build/_opt_local_var_macports_sources_rsync.macports.org_release_tarballs_ports_devel_apr-util/apr-util/work/apr-util-1.4.1/apr-util.pc.in
  61. :debug:configure euid/egid changed to: 502/501
  62. :debug:configure Executing org.macports.configure (apr-util)
  63. :debug:configure Environment: CPATH='/opt/local/include' CFLAGS='-pipe -O2 -arch x86_64' CPPFLAGS='-I/opt/local/include' CXXFLAGS='-pipe -O2 -arch x86_64' LIBRARY_PATH='/opt/local/lib' MACOSX_DEPLOYMENT_TARGET='10.8' CXX='/usr/bin/clang++' CC_PRINT_OPTIONS_FILE='/opt/local/var/macports/build/_opt_local_var_macports_sources_rsync.macports.org_release_tarballs_ports_devel_apr-util/apr-util/work/.CC_PRINT_OPTIONS' F90FLAGS='-pipe -O2 -m64' LDFLAGS='-L/opt/local/lib -arch x86_64' OBJC='/usr/bin/clang' FCFLAGS='-pipe -O2 -m64' GI_SCANNER_DISABLE_CACHE='1' INSTALL='/usr/bin/install -c' OBJCFLAGS='-pipe -O2 -arch x86_64' FFLAGS='-pipe -O2 -m64' CC_PRINT_OPTIONS='YES' CC='/usr/bin/clang'
  64. :debug:configure Assembled command: 'cd "/opt/local/var/macports/build/_opt_local_var_macports_sources_rsync.macports.org_release_tarballs_ports_devel_apr-util/apr-util/work/apr-util-1.4.1" && ./configure --prefix=/opt/local --with-apr=/opt/local/bin/apr-1-config --with-expat=/opt/local --with-iconv=/opt/local --with-berkeley-db=/opt/local/include:/opt/local/lib/db46 --without-mysql --without-pgsql --with-sqlite3=/opt/local'
  65. :debug:configure Executing command line: cd "/opt/local/var/macports/build/_opt_local_var_macports_sources_rsync.macports.org_release_tarballs_ports_devel_apr-util/apr-util/work/apr-util-1.4.1" && ./configure --prefix=/opt/local --with-apr=/opt/local/bin/apr-1-config --with-expat=/opt/local --with-iconv=/opt/local --with-berkeley-db=/opt/local/include:/opt/local/lib/db46 --without-mysql --without-pgsql --with-sqlite3=/opt/local
  66. :info:configure checking build system type... x86_64-apple-darwin12.0.0
  67. :info:configure checking host system type... x86_64-apple-darwin12.0.0
  68. :info:configure checking target system type... x86_64-apple-darwin12.0.0
  69. :info:configure checking for a BSD-compatible install... /usr/bin/install -c
  70. :info:configure checking for working mkdir -p... yes
  71. :info:configure APR-util Version: 1.4.1
  72. :info:configure checking for chosen layout... apr-util
  73. :info:configure checking for gcc... /usr/bin/clang
  74. :info:configure checking whether the C compiler works... yes
  75. :info:configure checking for C compiler default output file name... a.out
  76. :info:configure checking for suffix of executables...
  77. :info:configure checking whether we are cross compiling... no
  78. :info:configure checking for suffix of object files... o
  79. :info:configure checking whether we are using the GNU C compiler... yes
  80. :info:configure checking whether /usr/bin/clang accepts -g... yes
  81. :info:configure checking for /usr/bin/clang option to accept ISO C89... none needed
  82. :info:configure Applying apr-util hints file rules for x86_64-apple-darwin12.0.0
  83. :info:configure checking for APR... yes
  84. :info:configure setting CPP to "/usr/bin/clang -E"
  85. :info:configure adding "-DDARWIN" to CPPFLAGS
  86. :info:configure adding "-DSIGPROCMASK_SETS_THREAD_MASK" to CPPFLAGS
  87. :info:configure adding "-no-cpp-precomp" to CPPFLAGS
  88. :info:configure checking how to run the C preprocessor... /usr/bin/clang -E
  89. :info:configure checking for grep that handles long lines and -e... /usr/bin/grep
  90. :info:configure checking for egrep... /usr/bin/grep -E
  91. :info:configure checking for ANSI C header files... yes
  92. :info:configure checking for sys/types.h... yes
  93. :info:configure checking for sys/stat.h... yes
  94. :info:configure checking for stdlib.h... yes
  95. :info:configure checking for string.h... yes
  96. :info:configure checking for memory.h... yes
  97. :info:configure checking for strings.h... yes
  98. :info:configure checking for inttypes.h... yes
  99. :info:configure checking for stdint.h... yes
  100. :info:configure checking for unistd.h... yes
  101. :info:configure checking for ldap support...
  102. :info:configure checking for Berkeley DB 5.1 in /opt/local/include and /opt/local/lib/db46...
  103. :info:configure checking db51/db.h usability... no
  104. :info:configure checking db51/db.h presence... no
  105. :info:configure checking for db51/db.h... no
  106. :info:configure checking db5/db.h usability... no
  107. :info:configure checking db5/db.h presence... no
  108. :info:configure checking for db5/db.h... no
  109. :info:configure checking db.h usability... yes
  110. :info:configure checking db.h presence... yes
  111. :info:configure checking for db.h... yes
  112. :info:configure checking for -ldb-5.1... no
  113. :info:configure checking db51/db.h usability... no
  114. :info:configure checking db51/db.h presence... no
  115. :info:configure checking for db51/db.h... no
  116. :info:configure checking db5/db.h usability... no
  117. :info:configure checking db5/db.h presence... no
  118. :info:configure checking for db5/db.h... no
  119. :info:configure checking db.h usability... yes
  120. :info:configure checking db.h presence... yes
  121. :info:configure checking for db.h... yes
  122. :info:configure checking for -ldb5-5.1... no
  123. :info:configure checking db51/db.h usability... no
  124. :info:configure checking db51/db.h presence... no
  125. :info:configure checking for db51/db.h... no
  126. :info:configure checking db5/db.h usability... no
  127. :info:configure checking db5/db.h presence... no
  128. :info:configure checking for db5/db.h... no
  129. :info:configure checking db.h usability... yes
  130. :info:configure checking db.h presence... yes
  131. :info:configure checking for db.h... yes
  132. :info:configure checking for -ldb51... no
  133. :info:configure checking db51/db.h usability... no
  134. :info:configure checking db51/db.h presence... no
  135. :info:configure checking for db51/db.h... no
  136. :info:configure checking db5/db.h usability... no
  137. :info:configure checking db5/db.h presence... no
  138. :info:configure checking for db5/db.h... no
  139. :info:configure checking db.h usability... yes
  140. :info:configure checking db.h presence... yes
  141. :info:configure checking for db.h... yes
  142. :info:configure checking for -ldb5... no
  143. :info:configure checking db51/db.h usability... no
  144. :info:configure checking db51/db.h presence... no
  145. :info:configure checking for db51/db.h... no
  146. :info:configure checking db5/db.h usability... no
  147. :info:configure checking db5/db.h presence... no
  148. :info:configure checking for db5/db.h... no
  149. :info:configure checking db.h usability... yes
  150. :info:configure checking db.h presence... yes
  151. :info:configure checking for db.h... yes
  152. :info:configure checking for -ldb... no
  153. :info:configure checking for Berkeley DB 5.0 in /opt/local/include and /opt/local/lib/db46...
  154. :info:configure checking db50/db.h usability... no
  155. :info:configure checking db50/db.h presence... no
  156. :info:configure checking for db50/db.h... no
  157. :info:configure checking db5/db.h usability... no
  158. :info:configure checking db5/db.h presence... no
  159. :info:configure checking for db5/db.h... no
  160. :info:configure checking db.h usability... yes
  161. :info:configure checking db.h presence... yes
  162. :info:configure checking for db.h... yes
  163. :info:configure checking for -ldb-5.0... no
  164. :info:configure checking db50/db.h usability... no
  165. :info:configure checking db50/db.h presence... no
  166. :info:configure checking for db50/db.h... no
  167. :info:configure checking db5/db.h usability... no
  168. :info:configure checking db5/db.h presence... no
  169. :info:configure checking for db5/db.h... no
  170. :info:configure checking db.h usability... yes
  171. :info:configure checking db.h presence... yes
  172. :info:configure checking for db.h... yes
  173. :info:configure checking for -ldb5-5.0... no
  174. :info:configure checking db50/db.h usability... no
  175. :info:configure checking db50/db.h presence... no
  176. :info:configure checking for db50/db.h... no
  177. :info:configure checking db5/db.h usability... no
  178. :info:configure checking db5/db.h presence... no
  179. :info:configure checking for db5/db.h... no
  180. :info:configure checking db.h usability... yes
  181. :info:configure checking db.h presence... yes
  182. :info:configure checking for db.h... yes
  183. :info:configure checking for -ldb50... no
  184. :info:configure checking db50/db.h usability... no
  185. :info:configure checking db50/db.h presence... no
  186. :info:configure checking for db50/db.h... no
  187. :info:configure checking db5/db.h usability... no
  188. :info:configure checking db5/db.h presence... no
  189. :info:configure checking for db5/db.h... no
  190. :info:configure checking db.h usability... yes
  191. :info:configure checking db.h presence... yes
  192. :info:configure checking for db.h... yes
  193. :info:configure checking for -ldb5... no
  194. :info:configure checking db50/db.h usability... no
  195. :info:configure checking db50/db.h presence... no
  196. :info:configure checking for db50/db.h... no
  197. :info:configure checking db5/db.h usability... no
  198. :info:configure checking db5/db.h presence... no
  199. :info:configure checking for db5/db.h... no
  200. :info:configure checking db.h usability... yes
  201. :info:configure checking db.h presence... yes
  202. :info:configure checking for db.h... yes
  203. :info:configure checking for -ldb... no
  204. :info:configure checking for Berkeley DB 4.8 in /opt/local/include and /opt/local/lib/db46...
  205. :info:configure checking db48/db.h usability... no
  206. :info:configure checking db48/db.h presence... no
  207. :info:configure checking for db48/db.h... no
  208. :info:configure checking db4/db.h usability... no
  209. :info:configure checking db4/db.h presence... no
  210. :info:configure checking for db4/db.h... no
  211. :info:configure checking db.h usability... yes
  212. :info:configure checking db.h presence... yes
  213. :info:configure checking for db.h... yes
  214. :info:configure checking for -ldb-4.8... no
  215. :info:configure checking db48/db.h usability... no
  216. :info:configure checking db48/db.h presence... no
  217. :info:configure checking for db48/db.h... no
  218. :info:configure checking db4/db.h usability... no
  219. :info:configure checking db4/db.h presence... no
  220. :info:configure checking for db4/db.h... no
  221. :info:configure checking db.h usability... yes
  222. :info:configure checking db.h presence... yes
  223. :info:configure checking for db.h... yes
  224. :info:configure checking for -ldb4-4.8... no
  225. :info:configure checking db48/db.h usability... no
  226. :info:configure checking db48/db.h presence... no
  227. :info:configure checking for db48/db.h... no
  228. :info:configure checking db4/db.h usability... no
  229. :info:configure checking db4/db.h presence... no
  230. :info:configure checking for db4/db.h... no
  231. :info:configure checking db.h usability... yes
  232. :info:configure checking db.h presence... yes
  233. :info:configure checking for db.h... yes
  234. :info:configure checking for -ldb48... no
  235. :info:configure checking db48/db.h usability... no
  236. :info:configure checking db48/db.h presence... no
  237. :info:configure checking for db48/db.h... no
  238. :info:configure checking db4/db.h usability... no
  239. :info:configure checking db4/db.h presence... no
  240. :info:configure checking for db4/db.h... no
  241. :info:configure checking db.h usability... yes
  242. :info:configure checking db.h presence... yes
  243. :info:configure checking for db.h... yes
  244. :info:configure checking for -ldb4... no
  245. :info:configure checking db48/db.h usability... no
  246. :info:configure checking db48/db.h presence... no
  247. :info:configure checking for db48/db.h... no
  248. :info:configure checking db4/db.h usability... no
  249. :info:configure checking db4/db.h presence... no
  250. :info:configure checking for db4/db.h... no
  251. :info:configure checking db.h usability... yes
  252. :info:configure checking db.h presence... yes
  253. :info:configure checking for db.h... yes
  254. :info:configure checking for -ldb... no
  255. :info:configure checking for Berkeley DB 4.7 in /opt/local/include and /opt/local/lib/db46...
  256. :info:configure checking db47/db.h usability... no
  257. :info:configure checking db47/db.h presence... no
  258. :info:configure checking for db47/db.h... no
  259. :info:configure checking db4/db.h usability... no
  260. :info:configure checking db4/db.h presence... no
  261. :info:configure checking for db4/db.h... no
  262. :info:configure checking db.h usability... yes
  263. :info:configure checking db.h presence... yes
  264. :info:configure checking for db.h... yes
  265. :info:configure checking for -ldb-4.7... no
  266. :info:configure checking db47/db.h usability... no
  267. :info:configure checking db47/db.h presence... no
  268. :info:configure checking for db47/db.h... no
  269. :info:configure checking db4/db.h usability... no
  270. :info:configure checking db4/db.h presence... no
  271. :info:configure checking for db4/db.h... no
  272. :info:configure checking db.h usability... yes
  273. :info:configure checking db.h presence... yes
  274. :info:configure checking for db.h... yes
  275. :info:configure checking for -ldb4-4.7... no
  276. :info:configure checking db47/db.h usability... no
  277. :info:configure checking db47/db.h presence... no
  278. :info:configure checking for db47/db.h... no
  279. :info:configure checking db4/db.h usability... no
  280. :info:configure checking db4/db.h presence... no
  281. :info:configure checking for db4/db.h... no
  282. :info:configure checking db.h usability... yes
  283. :info:configure checking db.h presence... yes
  284. :info:configure checking for db.h... yes
  285. :info:configure checking for -ldb47... no
  286. :info:configure checking db47/db.h usability... no
  287. :info:configure checking db47/db.h presence... no
  288. :info:configure checking for db47/db.h... no
  289. :info:configure checking db4/db.h usability... no
  290. :info:configure checking db4/db.h presence... no
  291. :info:configure checking for db4/db.h... no
  292. :info:configure checking db.h usability... yes
  293. :info:configure checking db.h presence... yes
  294. :info:configure checking for db.h... yes
  295. :info:configure checking for -ldb4... no
  296. :info:configure checking db47/db.h usability... no
  297. :info:configure checking db47/db.h presence... no
  298. :info:configure checking for db47/db.h... no
  299. :info:configure checking db4/db.h usability... no
  300. :info:configure checking db4/db.h presence... no
  301. :info:configure checking for db4/db.h... no
  302. :info:configure checking db.h usability... yes
  303. :info:configure checking db.h presence... yes
  304. :info:configure checking for db.h... yes
  305. :info:configure checking for -ldb... no
  306. :info:configure checking for Berkeley DB 4.6 in /opt/local/include and /opt/local/lib/db46...
  307. :info:configure checking db46/db.h usability... yes
  308. :info:configure checking db46/db.h presence... yes
  309. :info:configure checking for db46/db.h... yes
  310. :info:configure checking for -ldb-4.6... yes
  311. :info:configure setting APRUTIL_INCLUDES to "-I/opt/local/include"
  312. :info:configure setting APRUTIL_LDFLAGS to "-L/opt/local/lib/db46"
  313. :info:configure checking for Berkeley DB... found db4
  314. :info:configure checking for default DBM... sdbm (default)
  315. :info:configure configure: checking for sqlite3 in /opt/local
  316. :info:configure checking sqlite3.h usability... yes
  317. :info:configure checking sqlite3.h presence... yes
  318. :info:configure checking for sqlite3.h... yes
  319. :info:configure checking for sqlite3_open in -lsqlite3... yes
  320. :info:configure adding "-I/opt/local/include" to APRUTIL_PRIV_INCLUDES
  321. :info:configure checking sqlite.h usability... no
  322. :info:configure checking sqlite.h presence... no
  323. :info:configure checking for sqlite.h... no
  324. :info:configure checking sybdb.h usability... no
  325. :info:configure checking sybdb.h presence... no
  326. :info:configure checking for sybdb.h... no
  327. :info:configure checking freetds/sybdb.h usability... no
  328. :info:configure checking freetds/sybdb.h presence... no
  329. :info:configure checking for freetds/sybdb.h... no
  330. :info:configure checking for odbc_config... no
  331. :info:configure checking sql.h usability... yes
  332. :info:configure checking sql.h presence... yes
  333. :info:configure checking for sql.h... yes
  334. :info:configure checking for SQLAllocHandle in -lodbc... yes
  335. :info:configure adding "-L/opt/local/lib" to APRUTIL_LDFLAGS
  336. :info:configure checking Expat 1.95.x... yes
  337. :info:configure setting APRUTIL_EXPORT_LIBS to "-lexpat"
  338. :info:configure setting APRUTIL_LIBS to "-lexpat"
  339. :info:configure checking iconv.h usability... yes
  340. :info:configure checking iconv.h presence... yes
  341. :info:configure checking for iconv.h... yes
  342. :info:configure setting LIBS to "-liconv"
  343. :info:configure adding "-liconv" to APRUTIL_LIBS
  344. :info:configure adding "-liconv" to APRUTIL_EXPORT_LIBS
  345. :info:configure nulling LIBS
  346. :info:configure removed "-I/opt/local/include" from CPPFLAGS
  347. :info:configure removed "-L/opt/local/lib" from LDFLAGS
  348. :info:configure checking for type of inbuf parameter to iconv... char **
  349. :info:configure checking for iconv.h... (cached) yes
  350. :info:configure checking langinfo.h usability... yes
  351. :info:configure checking langinfo.h presence... yes
  352. :info:configure checking for langinfo.h... yes
  353. :info:configure checking for nl_langinfo... yes
  354. :info:configure checking for CODESET in langinfo.h... yes
  355. :info:configure checking whether APR has DSO support... yes
  356. :info:configure checking for library containing crypt... none required
  357. :info:configure checking if system crypt() function is threadsafe... no
  358. :info:configure checking for crypt_r... no
  359. :info:configure adding "/opt/local/lib/libapr-1.la" to APRUTIL_LIBS
  360. :info:configure adding "-lpthread" to APRUTIL_LIBS
  361. :info:configure configure: creating ./config.status
  362. :info:configure config.status: creating Makefile
  363. :info:configure config.status: creating export_vars.sh
  364. :info:configure config.status: creating build/pkg/pkginfo
  365. :info:configure config.status: creating apr-util.pc
  366. :info:configure config.status: creating apu-1-config
  367. :info:configure config.status: creating include/private/apu_select_dbm.h
  368. :info:configure config.status: creating include/apr_ldap.h
  369. :info:configure config.status: creating include/apu.h
  370. :info:configure config.status: creating include/apu_want.h
  371. :info:configure config.status: creating test/Makefile
  372. :info:configure config.status: creating include/private/apu_config.h
  373. :info:configure config.status: executing default commands
  374. :debug:configure Privilege de-escalation not attempted as not running as root.
  375. :debug:build build phase started at Sat Feb 25 14:49:51 CET 2012
  376. :notice:build ---> Building apr-util
  377. :debug:build Executing org.macports.build (apr-util)
  378. :debug:build Environment: CPATH='/opt/local/include' CC_PRINT_OPTIONS_FILE='/opt/local/var/macports/build/_opt_local_var_macports_sources_rsync.macports.org_release_tarballs_ports_devel_apr-util/apr-util/work/.CC_PRINT_OPTIONS' LIBRARY_PATH='/opt/local/lib' CC_PRINT_OPTIONS='YES' MACOSX_DEPLOYMENT_TARGET='10.8' GI_SCANNER_DISABLE_CACHE='1'
  379. :debug:build Assembled command: 'cd "/opt/local/var/macports/build/_opt_local_var_macports_sources_rsync.macports.org_release_tarballs_ports_devel_apr-util/apr-util/work/apr-util-1.4.1" && /usr/bin/make -j4 -w all'
  380. :debug:build Executing command line: cd "/opt/local/var/macports/build/_opt_local_var_macports_sources_rsync.macports.org_release_tarballs_ports_devel_apr-util/apr-util/work/apr-util-1.4.1" && /usr/bin/make -j4 -w all
  381. :info:build make: Entering directory `/opt/local/var/macports/build/_opt_local_var_macports_sources_rsync.macports.org_release_tarballs_ports_devel_apr-util/apr-util/work/apr-util-1.4.1'
  382. :info:build make[1]: Entering directory `/opt/local/var/macports/build/_opt_local_var_macports_sources_rsync.macports.org_release_tarballs_ports_devel_apr-util/apr-util/work/apr-util-1.4.1'
  383. :info:build awk -f /opt/local/share/apr-1/build/make_exports.awk /opt/local/var/macports/build/_opt_local_var_macports_sources_rsync.macports.org_release_tarballs_ports_devel_apr-util/apr-util/work/apr-util-1.4.1/include/apr_anylock.h /opt/local/var/macports/build/_opt_local_var_macports_sources_rsync.macports.org_release_tarballs_ports_devel_apr-util/apr-util/work/apr-util-1.4.1/include/apr_base64.h /opt/local/var/macports/build/_opt_local_var_macports_sources_rsync.macports.org_release_tarballs_ports_devel_apr-util/apr-util/work/apr-util-1.4.1/include/apr_buckets.h /opt/local/var/macports/build/_opt_local_var_macports_sources_rsync.macports.org_release_tarballs_ports_devel_apr-util/apr-util/work/apr-util-1.4.1/include/apr_crypto.h /opt/local/var/macports/build/_opt_local_var_macports_sources_rsync.macports.org_release_tarballs_ports_devel_apr-util/apr-util/work/apr-util-1.4.1/include/apr_date.h /opt/local/var/macports/build/_opt_local_var_macports_sources_rsync.macports.org_release_tarballs_ports_devel_apr-util/apr-util/work/apr-util-1.4.1/include/apr_dbd.h /opt/local/var/macports/build/_opt_local_var_macports_sources_rsync.macports.org_release_tarballs_ports_devel_apr-util/apr-util/work/apr-util-1.4.1/include/apr_dbm.h /opt/local/var/macports/build/_opt_local_var_macports_sources_rsync.macports.org_release_tarballs_ports_devel_apr-util/apr-util/work/apr-util-1.4.1/include/apr_hooks.h /opt/local/var/macports/build/_opt_local_var_macports_sources_rsync.macports.org_release_tarballs_ports_devel_apr-util/apr-util/work/apr-util-1.4.1/include/apr_ldap_init.h /opt/local/var/macports/build/_opt_local_var_macports_sources_rsync.macports.org_release_tarballs_ports_devel_apr-util/apr-util/work/apr-util-1.4.1/include/apr_ldap_option.h /opt/local/var/macports/build/_opt_local_var_macports_sources_rsync.macports.org_release_tarballs_ports_devel_apr-util/apr-util/work/apr-util-1.4.1/include/apr_ldap_rebind.h /opt/local/var/macports/build/_opt_local_var_macports_sources_rsync.macports.org_release_tarballs_ports_devel_apr-util/apr-util/work/apr-util-1.4.1/include/apr_ldap_url.h /opt/local/var/macports/build/_opt_local_var_macports_sources_rsync.macports.org_release_tarballs_ports_devel_apr-util/apr-util/work/apr-util-1.4.1/include/apr_md4.h /opt/local/var/macports/build/_opt_local_var_macports_sources_rsync.macports.org_release_tarballs_ports_devel_apr-util/apr-util/work/apr-util-1.4.1/include/apr_md5.h /opt/local/var/macports/build/_opt_local_var_macports_sources_rsync.macports.org_release_tarballs_ports_devel_apr-util/apr-util/work/apr-util-1.4.1/include/apr_memcache.h /opt/local/var/macports/build/_opt_local_var_macports_sources_rsync.macports.org_release_tarballs_ports_devel_apr-util/apr-util/work/apr-util-1.4.1/include/apr_optional.h /opt/local/var/macports/build/_opt_local_var_macports_sources_rsync.macports.org_release_tarballs_ports_devel_apr-util/apr-util/work/apr-util-1.4.1/include/apr_optional_hooks.h /opt/local/var/macports/build/_opt_local_var_macports_sources_rsync.macports.org_release_tarballs_ports_devel_apr-util/apr-util/work/apr-util-1.4.1/include/apr_queue.h /opt/local/var/macports/build/_opt_local_var_macports_sources_rsync.macports.org_release_tarballs_ports_devel_apr-util/apr-util/work/apr-util-1.4.1/include/apr_reslist.h /opt/local/var/macports/build/_opt_local_var_macports_sources_rsync.macports.org_release_tarballs_ports_devel_apr-util/apr-util/work/apr-util-1.4.1/include/apr_rmm.h /opt/local/var/macports/build/_opt_local_var_macports_sources_rsync.macports.org_release_tarballs_ports_devel_apr-util/apr-util/work/apr-util-1.4.1/include/apr_sdbm.h /opt/local/var/macports/build/_opt_local_var_macports_sources_rsync.macports.org_release_tarballs_ports_devel_apr-util/apr-util/work/apr-util-1.4.1/include/apr_sha1.h /opt/local/var/macports/build/_opt_local_var_macports_sources_rsync.macports.org_release_tarballs_ports_devel_apr-util/apr-util/work/apr-util-1.4.1/include/apr_strmatch.h /opt/local/var/macports/build/_opt_local_var_macports_sources_rsync.macports.org_release_tarballs_ports_devel_apr-util/apr-util/work/apr-util-1.4.1/include/apr_thread_pool.h /opt/local/var/macports/build/_opt_local_var_macports_sources_rsync.macports.org_release_tarballs_ports_devel_apr-util/apr-util/work/apr-util-1.4.1/include/apr_uri.h /opt/local/var/macports/build/_opt_local_var_macports_sources_rsync.macports.org_release_tarballs_ports_devel_apr-util/apr-util/work/apr-util-1.4.1/include/apr_uuid.h /opt/local/var/macports/build/_opt_local_var_macports_sources_rsync.macports.org_release_tarballs_ports_devel_apr-util/apr-util/work/apr-util-1.4.1/include/apr_xlate.h /opt/local/var/macports/build/_opt_local_var_macports_sources_rsync.macports.org_release_tarballs_ports_devel_apr-util/apr-util/work/apr-util-1.4.1/include/apr_xml.h /opt/local/var/macports/build/_opt_local_var_macports_sources_rsync.macports.org_release_tarballs_ports_devel_apr-util/apr-util/work/apr-util-1.4.1/include/apu_errno.h /opt/local/var/macports/build/_opt_local_var_macports_sources_rsync.macports.org_release_tarballs_ports_devel_apr-util/apr-util/work/apr-util-1.4.1/include/apu_version.h /opt/local/var/macports/build/_opt_local_var_macports_sources_rsync.macports.org_release_tarballs_ports_devel_apr-util/apr-util/work/apr-util-1.4.1/include/private/apr_crypto_internal.h /opt/local/var/macports/build/_opt_local_var_macports_sources_rsync.macports.org_release_tarballs_ports_devel_apr-util/apr-util/work/apr-util-1.4.1/include/private/apr_dbd_internal.h /opt/local/var/macports/build/_opt_local_var_macports_sources_rsync.macports.org_release_tarballs_ports_devel_apr-util/apr-util/work/apr-util-1.4.1/include/private/apr_dbd_odbc_v2.h /opt/local/var/macports/build/_opt_local_var_macports_sources_rsync.macports.org_release_tarballs_ports_devel_apr-util/apr-util/work/apr-util-1.4.1/include/private/apr_dbm_private.h /opt/local/var/macports/build/_opt_local_var_macports_sources_rsync.macports.org_release_tarballs_ports_devel_apr-util/apr-util/work/apr-util-1.4.1/include/private/apu_internal.h > exports.c
  384. :info:build awk -f /opt/local/share/apr-1/build/make_var_export.awk /opt/local/var/macports/build/_opt_local_var_macports_sources_rsync.macports.org_release_tarballs_ports_devel_apr-util/apr-util/work/apr-util-1.4.1/include/apr_anylock.h /opt/local/var/macports/build/_opt_local_var_macports_sources_rsync.macports.org_release_tarballs_ports_devel_apr-util/apr-util/work/apr-util-1.4.1/include/apr_base64.h /opt/local/var/macports/build/_opt_local_var_macports_sources_rsync.macports.org_release_tarballs_ports_devel_apr-util/apr-util/work/apr-util-1.4.1/include/apr_buckets.h /opt/local/var/macports/build/_opt_local_var_macports_sources_rsync.macports.org_release_tarballs_ports_devel_apr-util/apr-util/work/apr-util-1.4.1/include/apr_crypto.h /opt/local/var/macports/build/_opt_local_var_macports_sources_rsync.macports.org_release_tarballs_ports_devel_apr-util/apr-util/work/apr-util-1.4.1/include/apr_date.h /opt/local/var/macports/build/_opt_local_var_macports_sources_rsync.macports.org_release_tarballs_ports_devel_apr-util/apr-util/work/apr-util-1.4.1/include/apr_dbd.h /opt/local/var/macports/build/_opt_local_var_macports_sources_rsync.macports.org_release_tarballs_ports_devel_apr-util/apr-util/work/apr-util-1.4.1/include/apr_dbm.h /opt/local/var/macports/build/_opt_local_var_macports_sources_rsync.macports.org_release_tarballs_ports_devel_apr-util/apr-util/work/apr-util-1.4.1/include/apr_hooks.h /opt/local/var/macports/build/_opt_local_var_macports_sources_rsync.macports.org_release_tarballs_ports_devel_apr-util/apr-util/work/apr-util-1.4.1/include/apr_ldap_init.h /opt/local/var/macports/build/_opt_local_var_macports_sources_rsync.macports.org_release_tarballs_ports_devel_apr-util/apr-util/work/apr-util-1.4.1/include/apr_ldap_option.h /opt/local/var/macports/build/_opt_local_var_macports_sources_rsync.macports.org_release_tarballs_ports_devel_apr-util/apr-util/work/apr-util-1.4.1/include/apr_ldap_rebind.h /opt/local/var/macports/build/_opt_local_var_macports_sources_rsync.macports.org_release_tarballs_ports_devel_apr-util/apr-util/work/apr-util-1.4.1/include/apr_ldap_url.h /opt/local/var/macports/build/_opt_local_var_macports_sources_rsync.macports.org_release_tarballs_ports_devel_apr-util/apr-util/work/apr-util-1.4.1/include/apr_md4.h /opt/local/var/macports/build/_opt_local_var_macports_sources_rsync.macports.org_release_tarballs_ports_devel_apr-util/apr-util/work/apr-util-1.4.1/include/apr_md5.h /opt/local/var/macports/build/_opt_local_var_macports_sources_rsync.macports.org_release_tarballs_ports_devel_apr-util/apr-util/work/apr-util-1.4.1/include/apr_memcache.h /opt/local/var/macports/build/_opt_local_var_macports_sources_rsync.macports.org_release_tarballs_ports_devel_apr-util/apr-util/work/apr-util-1.4.1/include/apr_optional.h /opt/local/var/macports/build/_opt_local_var_macports_sources_rsync.macports.org_release_tarballs_ports_devel_apr-util/apr-util/work/apr-util-1.4.1/include/apr_optional_hooks.h /opt/local/var/macports/build/_opt_local_var_macports_sources_rsync.macports.org_release_tarballs_ports_devel_apr-util/apr-util/work/apr-util-1.4.1/include/apr_queue.h /opt/local/var/macports/build/_opt_local_var_macports_sources_rsync.macports.org_release_tarballs_ports_devel_apr-util/apr-util/work/apr-util-1.4.1/include/apr_reslist.h /opt/local/var/macports/build/_opt_local_var_macports_sources_rsync.macports.org_release_tarballs_ports_devel_apr-util/apr-util/work/apr-util-1.4.1/include/apr_rmm.h /opt/local/var/macports/build/_opt_local_var_macports_sources_rsync.macports.org_release_tarballs_ports_devel_apr-util/apr-util/work/apr-util-1.4.1/include/apr_sdbm.h /opt/local/var/macports/build/_opt_local_var_macports_sources_rsync.macports.org_release_tarballs_ports_devel_apr-util/apr-util/work/apr-util-1.4.1/include/apr_sha1.h /opt/local/var/macports/build/_opt_local_var_macports_sources_rsync.macports.org_release_tarballs_ports_devel_apr-util/apr-util/work/apr-util-1.4.1/include/apr_strmatch.h /opt/local/var/macports/build/_opt_local_var_macports_sources_rsync.macports.org_release_tarballs_ports_devel_apr-util/apr-util/work/apr-util-1.4.1/include/apr_thread_pool.h /opt/local/var/macports/build/_opt_local_var_macports_sources_rsync.macports.org_release_tarballs_ports_devel_apr-util/apr-util/work/apr-util-1.4.1/include/apr_uri.h /opt/local/var/macports/build/_opt_local_var_macports_sources_rsync.macports.org_release_tarballs_ports_devel_apr-util/apr-util/work/apr-util-1.4.1/include/apr_uuid.h /opt/local/var/macports/build/_opt_local_var_macports_sources_rsync.macports.org_release_tarballs_ports_devel_apr-util/apr-util/work/apr-util-1.4.1/include/apr_xlate.h /opt/local/var/macports/build/_opt_local_var_macports_sources_rsync.macports.org_release_tarballs_ports_devel_apr-util/apr-util/work/apr-util-1.4.1/include/apr_xml.h /opt/local/var/macports/build/_opt_local_var_macports_sources_rsync.macports.org_release_tarballs_ports_devel_apr-util/apr-util/work/apr-util-1.4.1/include/apu_errno.h /opt/local/var/macports/build/_opt_local_var_macports_sources_rsync.macports.org_release_tarballs_ports_devel_apr-util/apr-util/work/apr-util-1.4.1/include/apu_version.h /opt/local/var/macports/build/_opt_local_var_macports_sources_rsync.macports.org_release_tarballs_ports_devel_apr-util/apr-util/work/apr-util-1.4.1/include/private/apr_crypto_internal.h /opt/local/var/macports/build/_opt_local_var_macports_sources_rsync.macports.org_release_tarballs_ports_devel_apr-util/apr-util/work/apr-util-1.4.1/include/private/apr_dbd_internal.h /opt/local/var/macports/build/_opt_local_var_macports_sources_rsync.macports.org_release_tarballs_ports_devel_apr-util/apr-util/work/apr-util-1.4.1/include/private/apr_dbd_odbc_v2.h /opt/local/var/macports/build/_opt_local_var_macports_sources_rsync.macports.org_release_tarballs_ports_devel_apr-util/apr-util/work/apr-util-1.4.1/include/private/apr_dbm_private.h /opt/local/var/macports/build/_opt_local_var_macports_sources_rsync.macports.org_release_tarballs_ports_devel_apr-util/apr-util/work/apr-util-1.4.1/include/private/apu_internal.h > export_vars.c
  385. :info:build sed 's,^\(location=\).*$,\1installed,' < apu-1-config > apu-config.out
  386. :info:build /bin/sh /opt/local/share/apr-1/build/libtool --silent --mode=compile /usr/bin/clang -pipe -O2 -arch x86_64 -DHAVE_CONFIG_H -DDARWIN -DSIGPROCMASK_SETS_THREAD_MASK -no-cpp-precomp -I/opt/local/include -I/opt/local/var/macports/build/_opt_local_var_macports_sources_rsync.macports.org_release_tarballs_ports_devel_apr-util/apr-util/work/apr-util-1.4.1/include -I/opt/local/var/macports/build/_opt_local_var_macports_sources_rsync.macports.org_release_tarballs_ports_devel_apr-util/apr-util/work/apr-util-1.4.1/include/private -I/opt/local/include -I/opt/local/include/apr-1 -I/opt/local/include -o buckets/apr_brigade.lo -c buckets/apr_brigade.c && touch buckets/apr_brigade.lo
  387. :info:build /bin/sh /opt/local/share/apr-1/build/libtool --silent --mode=compile /usr/bin/clang -pipe -O2 -arch x86_64 -DHAVE_CONFIG_H -DDARWIN -DSIGPROCMASK_SETS_THREAD_MASK -no-cpp-precomp -I/opt/local/include -I/opt/local/var/macports/build/_opt_local_var_macports_sources_rsync.macports.org_release_tarballs_ports_devel_apr-util/apr-util/work/apr-util-1.4.1/include -I/opt/local/var/macports/build/_opt_local_var_macports_sources_rsync.macports.org_release_tarballs_ports_devel_apr-util/apr-util/work/apr-util-1.4.1/include/private -I/opt/local/include -I/opt/local/include/apr-1 -I/opt/local/include -o buckets/apr_buckets.lo -c buckets/apr_buckets.c && touch buckets/apr_buckets.lo
  388. :info:build /bin/sh /opt/local/share/apr-1/build/libtool --silent --mode=compile /usr/bin/clang -pipe -O2 -arch x86_64 -DHAVE_CONFIG_H -DDARWIN -DSIGPROCMASK_SETS_THREAD_MASK -no-cpp-precomp -I/opt/local/include -I/opt/local/var/macports/build/_opt_local_var_macports_sources_rsync.macports.org_release_tarballs_ports_devel_apr-util/apr-util/work/apr-util-1.4.1/include -I/opt/local/var/macports/build/_opt_local_var_macports_sources_rsync.macports.org_release_tarballs_ports_devel_apr-util/apr-util/work/apr-util-1.4.1/include/private -I/opt/local/include -I/opt/local/include/apr-1 -I/opt/local/include -o buckets/apr_buckets_alloc.lo -c buckets/apr_buckets_alloc.c && touch buckets/apr_buckets_alloc.lo
  389. :info:build /bin/sh /opt/local/share/apr-1/build/libtool --silent --mode=compile /usr/bin/clang -pipe -O2 -arch x86_64 -DHAVE_CONFIG_H -DDARWIN -DSIGPROCMASK_SETS_THREAD_MASK -no-cpp-precomp -I/opt/local/include -I/opt/local/var/macports/build/_opt_local_var_macports_sources_rsync.macports.org_release_tarballs_ports_devel_apr-util/apr-util/work/apr-util-1.4.1/include -I/opt/local/var/macports/build/_opt_local_var_macports_sources_rsync.macports.org_release_tarballs_ports_devel_apr-util/apr-util/work/apr-util-1.4.1/include/private -I/opt/local/include -I/opt/local/include/apr-1 -I/opt/local/include -o buckets/apr_buckets_eos.lo -c buckets/apr_buckets_eos.c && touch buckets/apr_buckets_eos.lo
  390. :info:build mkdir: buckets/.libs: File exists
  391. :info:build clang: warning: argument unused during compilation: '-no-cpp-precomp'
  392. :info:build clang: warning: argument unused during compilation: '-no-cpp-precomp'
  393. :info:build clang: warning: argument unused during compilation: '-no-cpp-precomp'
  394. :info:build clang: warning: argument unused during compilation: '-no-cpp-precomp'
  395. :info:build /bin/sh /opt/local/share/apr-1/build/libtool --silent --mode=compile /usr/bin/clang -pipe -O2 -arch x86_64 -DHAVE_CONFIG_H -DDARWIN -DSIGPROCMASK_SETS_THREAD_MASK -no-cpp-precomp -I/opt/local/include -I/opt/local/var/macports/build/_opt_local_var_macports_sources_rsync.macports.org_release_tarballs_ports_devel_apr-util/apr-util/work/apr-util-1.4.1/include -I/opt/local/var/macports/build/_opt_local_var_macports_sources_rsync.macports.org_release_tarballs_ports_devel_apr-util/apr-util/work/apr-util-1.4.1/include/private -I/opt/local/include -I/opt/local/include/apr-1 -I/opt/local/include -o buckets/apr_buckets_file.lo -c buckets/apr_buckets_file.c && touch buckets/apr_buckets_file.lo
  396. :info:build /bin/sh /opt/local/share/apr-1/build/libtool --silent --mode=compile /usr/bin/clang -pipe -O2 -arch x86_64 -DHAVE_CONFIG_H -DDARWIN -DSIGPROCMASK_SETS_THREAD_MASK -no-cpp-precomp -I/opt/local/include -I/opt/local/var/macports/build/_opt_local_var_macports_sources_rsync.macports.org_release_tarballs_ports_devel_apr-util/apr-util/work/apr-util-1.4.1/include -I/opt/local/var/macports/build/_opt_local_var_macports_sources_rsync.macports.org_release_tarballs_ports_devel_apr-util/apr-util/work/apr-util-1.4.1/include/private -I/opt/local/include -I/opt/local/include/apr-1 -I/opt/local/include -o buckets/apr_buckets_flush.lo -c buckets/apr_buckets_flush.c && touch buckets/apr_buckets_flush.lo
  397. :info:build /bin/sh /opt/local/share/apr-1/build/libtool --silent --mode=compile /usr/bin/clang -pipe -O2 -arch x86_64 -DHAVE_CONFIG_H -DDARWIN -DSIGPROCMASK_SETS_THREAD_MASK -no-cpp-precomp -I/opt/local/include -I/opt/local/var/macports/build/_opt_local_var_macports_sources_rsync.macports.org_release_tarballs_ports_devel_apr-util/apr-util/work/apr-util-1.4.1/include -I/opt/local/var/macports/build/_opt_local_var_macports_sources_rsync.macports.org_release_tarballs_ports_devel_apr-util/apr-util/work/apr-util-1.4.1/include/private -I/opt/local/include -I/opt/local/include/apr-1 -I/opt/local/include -o buckets/apr_buckets_heap.lo -c buckets/apr_buckets_heap.c && touch buckets/apr_buckets_heap.lo
  398. :info:build /bin/sh /opt/local/share/apr-1/build/libtool --silent --mode=compile /usr/bin/clang -pipe -O2 -arch x86_64 -DHAVE_CONFIG_H -DDARWIN -DSIGPROCMASK_SETS_THREAD_MASK -no-cpp-precomp -I/opt/local/include -I/opt/local/var/macports/build/_opt_local_var_macports_sources_rsync.macports.org_release_tarballs_ports_devel_apr-util/apr-util/work/apr-util-1.4.1/include -I/opt/local/var/macports/build/_opt_local_var_macports_sources_rsync.macports.org_release_tarballs_ports_devel_apr-util/apr-util/work/apr-util-1.4.1/include/private -I/opt/local/include -I/opt/local/include/apr-1 -I/opt/local/include -o buckets/apr_buckets_mmap.lo -c buckets/apr_buckets_mmap.c && touch buckets/apr_buckets_mmap.lo
  399. :info:build clang: warning: argument unused during compilation: '-no-cpp-precomp'
  400. :info:build clang: warning: argument unused during compilation: '-no-cpp-precomp'
  401. :info:build clang: warning: argument unused during compilation: '-no-cpp-precomp'
  402. :info:build /bin/sh /opt/local/share/apr-1/build/libtool --silent --mode=compile /usr/bin/clang -pipe -O2 -arch x86_64 -DHAVE_CONFIG_H -DDARWIN -DSIGPROCMASK_SETS_THREAD_MASK -no-cpp-precomp -I/opt/local/include -I/opt/local/var/macports/build/_opt_local_var_macports_sources_rsync.macports.org_release_tarballs_ports_devel_apr-util/apr-util/work/apr-util-1.4.1/include -I/opt/local/var/macports/build/_opt_local_var_macports_sources_rsync.macports.org_release_tarballs_ports_devel_apr-util/apr-util/work/apr-util-1.4.1/include/private -I/opt/local/include -I/opt/local/include/apr-1 -I/opt/local/include -o buckets/apr_buckets_pipe.lo -c buckets/apr_buckets_pipe.c && touch buckets/apr_buckets_pipe.lo
  403. :info:build /bin/sh /opt/local/share/apr-1/build/libtool --silent --mode=compile /usr/bin/clang -pipe -O2 -arch x86_64 -DHAVE_CONFIG_H -DDARWIN -DSIGPROCMASK_SETS_THREAD_MASK -no-cpp-precomp -I/opt/local/include -I/opt/local/var/macports/build/_opt_local_var_macports_sources_rsync.macports.org_release_tarballs_ports_devel_apr-util/apr-util/work/apr-util-1.4.1/include -I/opt/local/var/macports/build/_opt_local_var_macports_sources_rsync.macports.org_release_tarballs_ports_devel_apr-util/apr-util/work/apr-util-1.4.1/include/private -I/opt/local/include -I/opt/local/include/apr-1 -I/opt/local/include -o buckets/apr_buckets_pool.lo -c buckets/apr_buckets_pool.c && touch buckets/apr_buckets_pool.lo
  404. :info:build /bin/sh /opt/local/share/apr-1/build/libtool --silent --mode=compile /usr/bin/clang -pipe -O2 -arch x86_64 -DHAVE_CONFIG_H -DDARWIN -DSIGPROCMASK_SETS_THREAD_MASK -no-cpp-precomp -I/opt/local/include -I/opt/local/var/macports/build/_opt_local_var_macports_sources_rsync.macports.org_release_tarballs_ports_devel_apr-util/apr-util/work/apr-util-1.4.1/include -I/opt/local/var/macports/build/_opt_local_var_macports_sources_rsync.macports.org_release_tarballs_ports_devel_apr-util/apr-util/work/apr-util-1.4.1/include/private -I/opt/local/include -I/opt/local/include/apr-1 -I/opt/local/include -o buckets/apr_buckets_refcount.lo -c buckets/apr_buckets_refcount.c && touch buckets/apr_buckets_refcount.lo
  405. :info:build clang: warning: argument unused during compilation: '-no-cpp-precomp'
  406. :info:build /bin/sh /opt/local/share/apr-1/build/libtool --silent --mode=compile /usr/bin/clang -pipe -O2 -arch x86_64 -DHAVE_CONFIG_H -DDARWIN -DSIGPROCMASK_SETS_THREAD_MASK -no-cpp-precomp -I/opt/local/include -I/opt/local/var/macports/build/_opt_local_var_macports_sources_rsync.macports.org_release_tarballs_ports_devel_apr-util/apr-util/work/apr-util-1.4.1/include -I/opt/local/var/macports/build/_opt_local_var_macports_sources_rsync.macports.org_release_tarballs_ports_devel_apr-util/apr-util/work/apr-util-1.4.1/include/private -I/opt/local/include -I/opt/local/include/apr-1 -I/opt/local/include -o buckets/apr_buckets_simple.lo -c buckets/apr_buckets_simple.c && touch buckets/apr_buckets_simple.lo
  407. :info:build clang: warning: argument unused during compilation: '-no-cpp-precomp'
  408. :info:build clang: warning: argument unused during compilation: '-no-cpp-precomp'
  409. :info:build clang: warning: argument unused during compilation: '-no-cpp-precomp'
  410. :info:build /bin/sh /opt/local/share/apr-1/build/libtool --silent --mode=compile /usr/bin/clang -pipe -O2 -arch x86_64 -DHAVE_CONFIG_H -DDARWIN -DSIGPROCMASK_SETS_THREAD_MASK -no-cpp-precomp -I/opt/local/include -I/opt/local/var/macports/build/_opt_local_var_macports_sources_rsync.macports.org_release_tarballs_ports_devel_apr-util/apr-util/work/apr-util-1.4.1/include -I/opt/local/var/macports/build/_opt_local_var_macports_sources_rsync.macports.org_release_tarballs_ports_devel_apr-util/apr-util/work/apr-util-1.4.1/include/private -I/opt/local/include -I/opt/local/include/apr-1 -I/opt/local/include -o buckets/apr_buckets_socket.lo -c buckets/apr_buckets_socket.c && touch buckets/apr_buckets_socket.lo
  411. :info:build /bin/sh /opt/local/share/apr-1/build/libtool --silent --mode=compile /usr/bin/clang -pipe -O2 -arch x86_64 -DHAVE_CONFIG_H -DDARWIN -DSIGPROCMASK_SETS_THREAD_MASK -no-cpp-precomp -I/opt/local/include -I/opt/local/var/macports/build/_opt_local_var_macports_sources_rsync.macports.org_release_tarballs_ports_devel_apr-util/apr-util/work/apr-util-1.4.1/include -I/opt/local/var/macports/build/_opt_local_var_macports_sources_rsync.macports.org_release_tarballs_ports_devel_apr-util/apr-util/work/apr-util-1.4.1/include/private -I/opt/local/include -I/opt/local/include/apr-1 -I/opt/local/include -o crypto/apr_crypto.lo -c crypto/apr_crypto.c && touch crypto/apr_crypto.lo
  412. :info:build /bin/sh /opt/local/share/apr-1/build/libtool --silent --mode=compile /usr/bin/clang -pipe -O2 -arch x86_64 -DHAVE_CONFIG_H -DDARWIN -DSIGPROCMASK_SETS_THREAD_MASK -no-cpp-precomp -I/opt/local/include -I/opt/local/var/macports/build/_opt_local_var_macports_sources_rsync.macports.org_release_tarballs_ports_devel_apr-util/apr-util/work/apr-util-1.4.1/include -I/opt/local/var/macports/build/_opt_local_var_macports_sources_rsync.macports.org_release_tarballs_ports_devel_apr-util/apr-util/work/apr-util-1.4.1/include/private -I/opt/local/include -I/opt/local/include/apr-1 -I/opt/local/include -o crypto/apr_md4.lo -c crypto/apr_md4.c && touch crypto/apr_md4.lo
  413. :info:build clang: warning: argument unused during compilation: '-no-cpp-precomp'
  414. :info:build /bin/sh /opt/local/share/apr-1/build/libtool --silent --mode=compile /usr/bin/clang -pipe -O2 -arch x86_64 -DHAVE_CONFIG_H -DDARWIN -DSIGPROCMASK_SETS_THREAD_MASK -no-cpp-precomp -I/opt/local/include -I/opt/local/var/macports/build/_opt_local_var_macports_sources_rsync.macports.org_release_tarballs_ports_devel_apr-util/apr-util/work/apr-util-1.4.1/include -I/opt/local/var/macports/build/_opt_local_var_macports_sources_rsync.macports.org_release_tarballs_ports_devel_apr-util/apr-util/work/apr-util-1.4.1/include/private -I/opt/local/include -I/opt/local/include/apr-1 -I/opt/local/include -o crypto/apr_md5.lo -c crypto/apr_md5.c && touch crypto/apr_md5.lo
  415. :info:build clang: warning: argument unused during compilation: '-no-cpp-precomp'
  416. :info:build clang: warning: argument unused during compilation: '-no-cpp-precomp'
  417. :info:build clang: warning: argument unused during compilation: '-no-cpp-precomp'
  418. :info:build /bin/sh /opt/local/share/apr-1/build/libtool --silent --mode=compile /usr/bin/clang -pipe -O2 -arch x86_64 -DHAVE_CONFIG_H -DDARWIN -DSIGPROCMASK_SETS_THREAD_MASK -no-cpp-precomp -I/opt/local/include -I/opt/local/var/macports/build/_opt_local_var_macports_sources_rsync.macports.org_release_tarballs_ports_devel_apr-util/apr-util/work/apr-util-1.4.1/include -I/opt/local/var/macports/build/_opt_local_var_macports_sources_rsync.macports.org_release_tarballs_ports_devel_apr-util/apr-util/work/apr-util-1.4.1/include/private -I/opt/local/include -I/opt/local/include/apr-1 -I/opt/local/include -o crypto/apr_sha1.lo -c crypto/apr_sha1.c && touch crypto/apr_sha1.lo
  419. :info:build /bin/sh /opt/local/share/apr-1/build/libtool --silent --mode=compile /usr/bin/clang -pipe -O2 -arch x86_64 -DHAVE_CONFIG_H -DDARWIN -DSIGPROCMASK_SETS_THREAD_MASK -no-cpp-precomp -I/opt/local/include -I/opt/local/var/macports/build/_opt_local_var_macports_sources_rsync.macports.org_release_tarballs_ports_devel_apr-util/apr-util/work/apr-util-1.4.1/include -I/opt/local/var/macports/build/_opt_local_var_macports_sources_rsync.macports.org_release_tarballs_ports_devel_apr-util/apr-util/work/apr-util-1.4.1/include/private -I/opt/local/include -I/opt/local/include/apr-1 -I/opt/local/include -o crypto/getuuid.lo -c crypto/getuuid.c && touch crypto/getuuid.lo
  420. :info:build clang: warning: argument unused during compilation: '-no-cpp-precomp'
  421. :info:build /bin/sh /opt/local/share/apr-1/build/libtool --silent --mode=compile /usr/bin/clang -pipe -O2 -arch x86_64 -DHAVE_CONFIG_H -DDARWIN -DSIGPROCMASK_SETS_THREAD_MASK -no-cpp-precomp -I/opt/local/include -I/opt/local/var/macports/build/_opt_local_var_macports_sources_rsync.macports.org_release_tarballs_ports_devel_apr-util/apr-util/work/apr-util-1.4.1/include -I/opt/local/var/macports/build/_opt_local_var_macports_sources_rsync.macports.org_release_tarballs_ports_devel_apr-util/apr-util/work/apr-util-1.4.1/include/private -I/opt/local/include -I/opt/local/include/apr-1 -I/opt/local/include -o crypto/uuid.lo -c crypto/uuid.c && touch crypto/uuid.lo
  422. :info:build clang: warning: argument unused during compilation: '-no-cpp-precomp'
  423. :info:build clang: warning: argument unused during compilation: '-no-cpp-precomp'
  424. :info:build clang: warning: argument unused during compilation: '-no-cpp-precomp'
  425. :info:build /bin/sh /opt/local/share/apr-1/build/libtool --silent --mode=compile /usr/bin/clang -pipe -O2 -arch x86_64 -DHAVE_CONFIG_H -DDARWIN -DSIGPROCMASK_SETS_THREAD_MASK -no-cpp-precomp -I/opt/local/include -I/opt/local/var/macports/build/_opt_local_var_macports_sources_rsync.macports.org_release_tarballs_ports_devel_apr-util/apr-util/work/apr-util-1.4.1/include -I/opt/local/var/macports/build/_opt_local_var_macports_sources_rsync.macports.org_release_tarballs_ports_devel_apr-util/apr-util/work/apr-util-1.4.1/include/private -I/opt/local/include -I/opt/local/include/apr-1 -I/opt/local/include -o dbd/apr_dbd.lo -c dbd/apr_dbd.c && touch dbd/apr_dbd.lo
  426. :info:build /bin/sh /opt/local/share/apr-1/build/libtool --silent --mode=compile /usr/bin/clang -pipe -O2 -arch x86_64 -DHAVE_CONFIG_H -DDARWIN -DSIGPROCMASK_SETS_THREAD_MASK -no-cpp-precomp -I/opt/local/include -I/opt/local/var/macports/build/_opt_local_var_macports_sources_rsync.macports.org_release_tarballs_ports_devel_apr-util/apr-util/work/apr-util-1.4.1/include -I/opt/local/var/macports/build/_opt_local_var_macports_sources_rsync.macports.org_release_tarballs_ports_devel_apr-util/apr-util/work/apr-util-1.4.1/include/private -I/opt/local/include -I/opt/local/include/apr-1 -I/opt/local/include -o dbm/apr_dbm.lo -c dbm/apr_dbm.c && touch dbm/apr_dbm.lo
  427. :info:build /bin/sh /opt/local/share/apr-1/build/libtool --silent --mode=compile /usr/bin/clang -pipe -O2 -arch x86_64 -DHAVE_CONFIG_H -DDARWIN -DSIGPROCMASK_SETS_THREAD_MASK -no-cpp-precomp -I/opt/local/include -I/opt/local/var/macports/build/_opt_local_var_macports_sources_rsync.macports.org_release_tarballs_ports_devel_apr-util/apr-util/work/apr-util-1.4.1/include -I/opt/local/var/macports/build/_opt_local_var_macports_sources_rsync.macports.org_release_tarballs_ports_devel_apr-util/apr-util/work/apr-util-1.4.1/include/private -I/opt/local/include -I/opt/local/include/apr-1 -I/opt/local/include -o dbm/apr_dbm_sdbm.lo -c dbm/apr_dbm_sdbm.c && touch dbm/apr_dbm_sdbm.lo
  428. :info:build /bin/sh /opt/local/share/apr-1/build/libtool --silent --mode=compile /usr/bin/clang -pipe -O2 -arch x86_64 -DHAVE_CONFIG_H -DDARWIN -DSIGPROCMASK_SETS_THREAD_MASK -no-cpp-precomp -I/opt/local/include -I/opt/local/var/macports/build/_opt_local_var_macports_sources_rsync.macports.org_release_tarballs_ports_devel_apr-util/apr-util/work/apr-util-1.4.1/include -I/opt/local/var/macports/build/_opt_local_var_macports_sources_rsync.macports.org_release_tarballs_ports_devel_apr-util/apr-util/work/apr-util-1.4.1/include/private -I/opt/local/include -I/opt/local/include/apr-1 -I/opt/local/include -o dbm/sdbm/sdbm.lo -c dbm/sdbm/sdbm.c && touch dbm/sdbm/sdbm.lo
  429. :info:build clang: warning: argument unused during compilation: '-no-cpp-precomp'
  430. :info:build clang: warning: argument unused during compilation: '-no-cpp-precomp'
  431. :info:build clang: warning: argument unused during compilation: '-no-cpp-precomp'
  432. :info:build clang: warning: argument unused during compilation: '-no-cpp-precomp'
  433. :info:build /bin/sh /opt/local/share/apr-1/build/libtool --silent --mode=compile /usr/bin/clang -pipe -O2 -arch x86_64 -DHAVE_CONFIG_H -DDARWIN -DSIGPROCMASK_SETS_THREAD_MASK -no-cpp-precomp -I/opt/local/include -I/opt/local/var/macports/build/_opt_local_var_macports_sources_rsync.macports.org_release_tarballs_ports_devel_apr-util/apr-util/work/apr-util-1.4.1/include -I/opt/local/var/macports/build/_opt_local_var_macports_sources_rsync.macports.org_release_tarballs_ports_devel_apr-util/apr-util/work/apr-util-1.4.1/include/private -I/opt/local/include -I/opt/local/include/apr-1 -I/opt/local/include -o dbm/sdbm/sdbm_hash.lo -c dbm/sdbm/sdbm_hash.c && touch dbm/sdbm/sdbm_hash.lo
  434. :info:build /bin/sh /opt/local/share/apr-1/build/libtool --silent --mode=compile /usr/bin/clang -pipe -O2 -arch x86_64 -DHAVE_CONFIG_H -DDARWIN -DSIGPROCMASK_SETS_THREAD_MASK -no-cpp-precomp -I/opt/local/include -I/opt/local/var/macports/build/_opt_local_var_macports_sources_rsync.macports.org_release_tarballs_ports_devel_apr-util/apr-util/work/apr-util-1.4.1/include -I/opt/local/var/macports/build/_opt_local_var_macports_sources_rsync.macports.org_release_tarballs_ports_devel_apr-util/apr-util/work/apr-util-1.4.1/include/private -I/opt/local/include -I/opt/local/include/apr-1 -I/opt/local/include -o dbm/sdbm/sdbm_lock.lo -c dbm/sdbm/sdbm_lock.c && touch dbm/sdbm/sdbm_lock.lo
  435. :info:build /bin/sh /opt/local/share/apr-1/build/libtool --silent --mode=compile /usr/bin/clang -pipe -O2 -arch x86_64 -DHAVE_CONFIG_H -DDARWIN -DSIGPROCMASK_SETS_THREAD_MASK -no-cpp-precomp -I/opt/local/include -I/opt/local/var/macports/build/_opt_local_var_macports_sources_rsync.macports.org_release_tarballs_ports_devel_apr-util/apr-util/work/apr-util-1.4.1/include -I/opt/local/var/macports/build/_opt_local_var_macports_sources_rsync.macports.org_release_tarballs_ports_devel_apr-util/apr-util/work/apr-util-1.4.1/include/private -I/opt/local/include -I/opt/local/include/apr-1 -I/opt/local/include -o dbm/sdbm/sdbm_pair.lo -c dbm/sdbm/sdbm_pair.c && touch dbm/sdbm/sdbm_pair.lo
  436. :info:build /bin/sh /opt/local/share/apr-1/build/libtool --silent --mode=compile /usr/bin/clang -pipe -O2 -arch x86_64 -DHAVE_CONFIG_H -DDARWIN -DSIGPROCMASK_SETS_THREAD_MASK -no-cpp-precomp -I/opt/local/include -I/opt/local/var/macports/build/_opt_local_var_macports_sources_rsync.macports.org_release_tarballs_ports_devel_apr-util/apr-util/work/apr-util-1.4.1/include -I/opt/local/var/macports/build/_opt_local_var_macports_sources_rsync.macports.org_release_tarballs_ports_devel_apr-util/apr-util/work/apr-util-1.4.1/include/private -I/opt/local/include -I/opt/local/include/apr-1 -I/opt/local/include -o encoding/apr_base64.lo -c encoding/apr_base64.c && touch encoding/apr_base64.lo
  437. :info:build clang: warning: argument unused during compilation: '-no-cpp-precomp'
  438. :info:build clang: warning: argument unused during compilation: '-no-cpp-precomp'
  439. :info:build clang: warning: argument unused during compilation: '-no-cpp-precomp'
  440. :info:build /bin/sh /opt/local/share/apr-1/build/libtool --silent --mode=compile /usr/bin/clang -pipe -O2 -arch x86_64 -DHAVE_CONFIG_H -DDARWIN -DSIGPROCMASK_SETS_THREAD_MASK -no-cpp-precomp -I/opt/local/include -I/opt/local/var/macports/build/_opt_local_var_macports_sources_rsync.macports.org_release_tarballs_ports_devel_apr-util/apr-util/work/apr-util-1.4.1/include -I/opt/local/var/macports/build/_opt_local_var_macports_sources_rsync.macports.org_release_tarballs_ports_devel_apr-util/apr-util/work/apr-util-1.4.1/include/private -I/opt/local/include -I/opt/local/include/apr-1 -I/opt/local/include -o hooks/apr_hooks.lo -c hooks/apr_hooks.c && touch hooks/apr_hooks.lo
  441. :info:build /bin/sh /opt/local/share/apr-1/build/libtool --silent --mode=compile /usr/bin/clang -pipe -O2 -arch x86_64 -DHAVE_CONFIG_H -DDARWIN -DSIGPROCMASK_SETS_THREAD_MASK -no-cpp-precomp -I/opt/local/include -I/opt/local/var/macports/build/_opt_local_var_macports_sources_rsync.macports.org_release_tarballs_ports_devel_apr-util/apr-util/work/apr-util-1.4.1/include -I/opt/local/var/macports/build/_opt_local_var_macports_sources_rsync.macports.org_release_tarballs_ports_devel_apr-util/apr-util/work/apr-util-1.4.1/include/private -I/opt/local/include -I/opt/local/include/apr-1 -I/opt/local/include -o ldap/apr_ldap_stub.lo -c ldap/apr_ldap_stub.c && touch ldap/apr_ldap_stub.lo
  442. :info:build clang: warning: argument unused during compilation: '-no-cpp-precomp'
  443. :info:build /bin/sh /opt/local/share/apr-1/build/libtool --silent --mode=compile /usr/bin/clang -pipe -O2 -arch x86_64 -DHAVE_CONFIG_H -DDARWIN -DSIGPROCMASK_SETS_THREAD_MASK -no-cpp-precomp -I/opt/local/include -I/opt/local/var/macports/build/_opt_local_var_macports_sources_rsync.macports.org_release_tarballs_ports_devel_apr-util/apr-util/work/apr-util-1.4.1/include -I/opt/local/var/macports/build/_opt_local_var_macports_sources_rsync.macports.org_release_tarballs_ports_devel_apr-util/apr-util/work/apr-util-1.4.1/include/private -I/opt/local/include -I/opt/local/include/apr-1 -I/opt/local/include -o ldap/apr_ldap_url.lo -c ldap/apr_ldap_url.c && touch ldap/apr_ldap_url.lo
  444. :info:build /bin/sh /opt/local/share/apr-1/build/libtool --silent --mode=compile /usr/bin/clang -pipe -O2 -arch x86_64 -DHAVE_CONFIG_H -DDARWIN -DSIGPROCMASK_SETS_THREAD_MASK -no-cpp-precomp -I/opt/local/include -I/opt/local/var/macports/build/_opt_local_var_macports_sources_rsync.macports.org_release_tarballs_ports_devel_apr-util/apr-util/work/apr-util-1.4.1/include -I/opt/local/var/macports/build/_opt_local_var_macports_sources_rsync.macports.org_release_tarballs_ports_devel_apr-util/apr-util/work/apr-util-1.4.1/include/private -I/opt/local/include -I/opt/local/include/apr-1 -I/opt/local/include -o memcache/apr_memcache.lo -c memcache/apr_memcache.c && touch memcache/apr_memcache.lo
  445. :info:build clang: warning: argument unused during compilation: '-no-cpp-precomp'
  446. :info:build clang: warning: argument unused during compilation: '-no-cpp-precomp'
  447. :info:build /bin/sh /opt/local/share/apr-1/build/libtool --silent --mode=compile /usr/bin/clang -pipe -O2 -arch x86_64 -DHAVE_CONFIG_H -DDARWIN -DSIGPROCMASK_SETS_THREAD_MASK -no-cpp-precomp -I/opt/local/include -I/opt/local/var/macports/build/_opt_local_var_macports_sources_rsync.macports.org_release_tarballs_ports_devel_apr-util/apr-util/work/apr-util-1.4.1/include -I/opt/local/var/macports/build/_opt_local_var_macports_sources_rsync.macports.org_release_tarballs_ports_devel_apr-util/apr-util/work/apr-util-1.4.1/include/private -I/opt/local/include -I/opt/local/include/apr-1 -I/opt/local/include -o misc/apr_date.lo -c misc/apr_date.c && touch misc/apr_date.lo
  448. :info:build clang: warning: argument unused during compilation: '-no-cpp-precomp'
  449. :info:build clang: warning: argument unused during compilation: '-no-cpp-precomp'
  450. :info:build /bin/sh /opt/local/share/apr-1/build/libtool --silent --mode=compile /usr/bin/clang -pipe -O2 -arch x86_64 -DHAVE_CONFIG_H -DDARWIN -DSIGPROCMASK_SETS_THREAD_MASK -no-cpp-precomp -I/opt/local/include -I/opt/local/var/macports/build/_opt_local_var_macports_sources_rsync.macports.org_release_tarballs_ports_devel_apr-util/apr-util/work/apr-util-1.4.1/include -I/opt/local/var/macports/build/_opt_local_var_macports_sources_rsync.macports.org_release_tarballs_ports_devel_apr-util/apr-util/work/apr-util-1.4.1/include/private -I/opt/local/include -I/opt/local/include/apr-1 -I/opt/local/include -o misc/apr_queue.lo -c misc/apr_queue.c && touch misc/apr_queue.lo
  451. :info:build memcache/apr_memcache.c:793:17: warning: comparison of unsigned expression < 0 is always false [-Wtautological-compare]
  452. :info:build if (len < 0) {
  453. :info:build ~~~ ^ ~
  454. :info:build memcache/apr_memcache.c:1366:28: warning: comparison of unsigned expression >= 0 is always true [-Wtautological-compare]
  455. :info:build if (len >= 0) {
  456. :info:build ~~~ ^ ~
  457. :info:build /bin/sh /opt/local/share/apr-1/build/libtool --silent --mode=compile /usr/bin/clang -pipe -O2 -arch x86_64 -DHAVE_CONFIG_H -DDARWIN -DSIGPROCMASK_SETS_THREAD_MASK -no-cpp-precomp -I/opt/local/include -I/opt/local/var/macports/build/_opt_local_var_macports_sources_rsync.macports.org_release_tarballs_ports_devel_apr-util/apr-util/work/apr-util-1.4.1/include -I/opt/local/var/macports/build/_opt_local_var_macports_sources_rsync.macports.org_release_tarballs_ports_devel_apr-util/apr-util/work/apr-util-1.4.1/include/private -I/opt/local/include -I/opt/local/include/apr-1 -I/opt/local/include -o misc/apr_reslist.lo -c misc/apr_reslist.c && touch misc/apr_reslist.lo
  458. :info:build clang: warning: argument unused during compilation: '-no-cpp-precomp'
  459. :info:build clang: warning: argument unused during compilation: '-no-cpp-precomp'
  460. :info:build clang: warning: argument unused during compilation: '-no-cpp-precomp'
  461. :info:build 2 warnings generated.
  462. :info:build /bin/sh /opt/local/share/apr-1/build/libtool --silent --mode=compile /usr/bin/clang -pipe -O2 -arch x86_64 -DHAVE_CONFIG_H -DDARWIN -DSIGPROCMASK_SETS_THREAD_MASK -no-cpp-precomp -I/opt/local/include -I/opt/local/var/macports/build/_opt_local_var_macports_sources_rsync.macports.org_release_tarballs_ports_devel_apr-util/apr-util/work/apr-util-1.4.1/include -I/opt/local/var/macports/build/_opt_local_var_macports_sources_rsync.macports.org_release_tarballs_ports_devel_apr-util/apr-util/work/apr-util-1.4.1/include/private -I/opt/local/include -I/opt/local/include/apr-1 -I/opt/local/include -o misc/apr_rmm.lo -c misc/apr_rmm.c && touch misc/apr_rmm.lo
  463. :info:build /bin/sh /opt/local/share/apr-1/build/libtool --silent --mode=compile /usr/bin/clang -pipe -O2 -arch x86_64 -DHAVE_CONFIG_H -DDARWIN -DSIGPROCMASK_SETS_THREAD_MASK -no-cpp-precomp -I/opt/local/include -I/opt/local/var/macports/build/_opt_local_var_macports_sources_rsync.macports.org_release_tarballs_ports_devel_apr-util/apr-util/work/apr-util-1.4.1/include -I/opt/local/var/macports/build/_opt_local_var_macports_sources_rsync.macports.org_release_tarballs_ports_devel_apr-util/apr-util/work/apr-util-1.4.1/include/private -I/opt/local/include -I/opt/local/include/apr-1 -I/opt/local/include -o misc/apr_thread_pool.lo -c misc/apr_thread_pool.c && touch misc/apr_thread_pool.lo
  464. :info:build /bin/sh /opt/local/share/apr-1/build/libtool --silent --mode=compile /usr/bin/clang -pipe -O2 -arch x86_64 -DHAVE_CONFIG_H -DDARWIN -DSIGPROCMASK_SETS_THREAD_MASK -no-cpp-precomp -I/opt/local/include -I/opt/local/var/macports/build/_opt_local_var_macports_sources_rsync.macports.org_release_tarballs_ports_devel_apr-util/apr-util/work/apr-util-1.4.1/include -I/opt/local/var/macports/build/_opt_local_var_macports_sources_rsync.macports.org_release_tarballs_ports_devel_apr-util/apr-util/work/apr-util-1.4.1/include/private -I/opt/local/include -I/opt/local/include/apr-1 -I/opt/local/include -o misc/apu_dso.lo -c misc/apu_dso.c && touch misc/apu_dso.lo
  465. :info:build clang: warning: argument unused during compilation: '-no-cpp-precomp'
  466. :info:build /bin/sh /opt/local/share/apr-1/build/libtool --silent --mode=compile /usr/bin/clang -pipe -O2 -arch x86_64 -DHAVE_CONFIG_H -DDARWIN -DSIGPROCMASK_SETS_THREAD_MASK -no-cpp-precomp -I/opt/local/include -I/opt/local/var/macports/build/_opt_local_var_macports_sources_rsync.macports.org_release_tarballs_ports_devel_apr-util/apr-util/work/apr-util-1.4.1/include -I/opt/local/var/macports/build/_opt_local_var_macports_sources_rsync.macports.org_release_tarballs_ports_devel_apr-util/apr-util/work/apr-util-1.4.1/include/private -I/opt/local/include -I/opt/local/include/apr-1 -I/opt/local/include -o misc/apu_version.lo -c misc/apu_version.c && touch misc/apu_version.lo
  467. :info:build clang: warning: argument unused during compilation: '-no-cpp-precomp'
  468. :info:build clang: warning: argument unused during compilation: '-no-cpp-precomp'
  469. :info:build /bin/sh /opt/local/share/apr-1/build/libtool --silent --mode=compile /usr/bin/clang -pipe -O2 -arch x86_64 -DHAVE_CONFIG_H -DDARWIN -DSIGPROCMASK_SETS_THREAD_MASK -no-cpp-precomp -I/opt/local/include -I/opt/local/var/macports/build/_opt_local_var_macports_sources_rsync.macports.org_release_tarballs_ports_devel_apr-util/apr-util/work/apr-util-1.4.1/include -I/opt/local/var/macports/build/_opt_local_var_macports_sources_rsync.macports.org_release_tarballs_ports_devel_apr-util/apr-util/work/apr-util-1.4.1/include/private -I/opt/local/include -I/opt/local/include/apr-1 -I/opt/local/include -o strmatch/apr_strmatch.lo -c strmatch/apr_strmatch.c && touch strmatch/apr_strmatch.lo
  470. :info:build /bin/sh /opt/local/share/apr-1/build/libtool --silent --mode=compile /usr/bin/clang -pipe -O2 -arch x86_64 -DHAVE_CONFIG_H -DDARWIN -DSIGPROCMASK_SETS_THREAD_MASK -no-cpp-precomp -I/opt/local/include -I/opt/local/var/macports/build/_opt_local_var_macports_sources_rsync.macports.org_release_tarballs_ports_devel_apr-util/apr-util/work/apr-util-1.4.1/include -I/opt/local/var/macports/build/_opt_local_var_macports_sources_rsync.macports.org_release_tarballs_ports_devel_apr-util/apr-util/work/apr-util-1.4.1/include/private -I/opt/local/include -I/opt/local/include/apr-1 -I/opt/local/include -o uri/apr_uri.lo -c uri/apr_uri.c && touch uri/apr_uri.lo
  471. :info:build clang: warning: argument unused during compilation: '-no-cpp-precomp'
  472. :info:build /bin/sh /opt/local/share/apr-1/build/libtool --silent --mode=compile /usr/bin/clang -pipe -O2 -arch x86_64 -DHAVE_CONFIG_H -DDARWIN -DSIGPROCMASK_SETS_THREAD_MASK -no-cpp-precomp -I/opt/local/include -I/opt/local/var/macports/build/_opt_local_var_macports_sources_rsync.macports.org_release_tarballs_ports_devel_apr-util/apr-util/work/apr-util-1.4.1/include -I/opt/local/var/macports/build/_opt_local_var_macports_sources_rsync.macports.org_release_tarballs_ports_devel_apr-util/apr-util/work/apr-util-1.4.1/include/private -I/opt/local/include -I/opt/local/include/apr-1 -I/opt/local/include -o xlate/xlate.lo -c xlate/xlate.c && touch xlate/xlate.lo
  473. :info:build /bin/sh /opt/local/share/apr-1/build/libtool --silent --mode=compile /usr/bin/clang -pipe -O2 -arch x86_64 -DHAVE_CONFIG_H -DDARWIN -DSIGPROCMASK_SETS_THREAD_MASK -no-cpp-precomp -I/opt/local/include -I/opt/local/var/macports/build/_opt_local_var_macports_sources_rsync.macports.org_release_tarballs_ports_devel_apr-util/apr-util/work/apr-util-1.4.1/include -I/opt/local/var/macports/build/_opt_local_var_macports_sources_rsync.macports.org_release_tarballs_ports_devel_apr-util/apr-util/work/apr-util-1.4.1/include/private -I/opt/local/include -I/opt/local/include/apr-1 -I/opt/local/include -o xml/apr_xml.lo -c xml/apr_xml.c && touch xml/apr_xml.lo
  474. :info:build clang: warning: argument unused during compilation: '-no-cpp-precomp'
  475. :info:build clang: warning: argument unused during compilation: '-no-cpp-precomp'
  476. :info:build clang: warning: argument unused during compilation: '-no-cpp-precomp'
  477. :info:build /usr/bin/clang -E -DHAVE_CONFIG_H -DDARWIN -DSIGPROCMASK_SETS_THREAD_MASK -no-cpp-precomp -I/opt/local/include -I/opt/local/var/macports/build/_opt_local_var_macports_sources_rsync.macports.org_release_tarballs_ports_devel_apr-util/apr-util/work/apr-util-1.4.1/include -I/opt/local/var/macports/build/_opt_local_var_macports_sources_rsync.macports.org_release_tarballs_ports_devel_apr-util/apr-util/work/apr-util-1.4.1/include/private -I/opt/local/include -I/opt/local/include/apr-1 -I/opt/local/include exports.c | grep "ap_hack_" | sed -e 's/^.*[)]\(.*\);$/\1/' >> aprutil.exp
  478. :info:build clang: warning: argument unused during compilation: '-no-cpp-precomp'
  479. :info:build /usr/bin/clang -E -DHAVE_CONFIG_H -DDARWIN -DSIGPROCMASK_SETS_THREAD_MASK -no-cpp-precomp -I/opt/local/include -I/opt/local/var/macports/build/_opt_local_var_macports_sources_rsync.macports.org_release_tarballs_ports_devel_apr-util/apr-util/work/apr-util-1.4.1/include -I/opt/local/var/macports/build/_opt_local_var_macports_sources_rsync.macports.org_release_tarballs_ports_devel_apr-util/apr-util/work/apr-util-1.4.1/include/private -I/opt/local/include -I/opt/local/include/apr-1 -I/opt/local/include export_vars.c | sed -e 's/^\#[^!]*//' | sed -e '/^$/d' >> aprutil.exp
  480. :info:build clang: warning: argument unused during compilation: '-no-cpp-precomp'
  481. :info:build /bin/sh /opt/local/share/apr-1/build/libtool --silent --mode=compile /usr/bin/clang -pipe -O2 -arch x86_64 -DHAVE_CONFIG_H -DDARWIN -DSIGPROCMASK_SETS_THREAD_MASK -no-cpp-precomp -I/opt/local/include -I/opt/local/var/macports/build/_opt_local_var_macports_sources_rsync.macports.org_release_tarballs_ports_devel_apr-util/apr-util/work/apr-util-1.4.1/include -I/opt/local/var/macports/build/_opt_local_var_macports_sources_rsync.macports.org_release_tarballs_ports_devel_apr-util/apr-util/work/apr-util-1.4.1/include/private -I/opt/local/include -I/opt/local/include/apr-1 -I/opt/local/include -o dbd/apr_dbd_sqlite3.lo -c dbd/apr_dbd_sqlite3.c && touch dbd/apr_dbd_sqlite3.lo
  482. :info:build /bin/sh /opt/local/share/apr-1/build/libtool --silent --mode=compile /usr/bin/clang -pipe -O2 -arch x86_64 -DHAVE_CONFIG_H -DDARWIN -DSIGPROCMASK_SETS_THREAD_MASK -no-cpp-precomp -I/opt/local/include -I/opt/local/var/macports/build/_opt_local_var_macports_sources_rsync.macports.org_release_tarballs_ports_devel_apr-util/apr-util/work/apr-util-1.4.1/include -I/opt/local/var/macports/build/_opt_local_var_macports_sources_rsync.macports.org_release_tarballs_ports_devel_apr-util/apr-util/work/apr-util-1.4.1/include/private -I/opt/local/include -I/opt/local/include/apr-1 -I/opt/local/include -o dbd/apr_dbd_odbc.lo -c dbd/apr_dbd_odbc.c && touch dbd/apr_dbd_odbc.lo
  483. :info:build clang: warning: argument unused during compilation: '-no-cpp-precomp'
  484. :info:build /bin/sh /opt/local/share/apr-1/build/libtool --silent --mode=compile /usr/bin/clang -pipe -O2 -arch x86_64 -DHAVE_CONFIG_H -DDARWIN -DSIGPROCMASK_SETS_THREAD_MASK -no-cpp-precomp -I/opt/local/include -I/opt/local/var/macports/build/_opt_local_var_macports_sources_rsync.macports.org_release_tarballs_ports_devel_apr-util/apr-util/work/apr-util-1.4.1/include -I/opt/local/var/macports/build/_opt_local_var_macports_sources_rsync.macports.org_release_tarballs_ports_devel_apr-util/apr-util/work/apr-util-1.4.1/include/private -I/opt/local/include -I/opt/local/include/apr-1 -I/opt/local/include -o dbm/apr_dbm_berkeleydb.lo -c dbm/apr_dbm_berkeleydb.c && touch dbm/apr_dbm_berkeleydb.lo
  485. :info:build clang: warning: argument unused during compilation: '-no-cpp-precomp'
  486. :info:build clang: warning: argument unused during compilation: '-no-cpp-precomp'
  487. :info:build dbd/apr_dbd_odbc.c:1363:17: warning: comparison of unsigned enum expression < 0 is always false [-Wtautological-compare]
  488. :info:build if (dbdtype < 0 || dbdtype >= NUM_APR_DBD_TYPES) {
  489. :info:build ~~~~~~~ ^ ~
  490. :info:build clang: warning: argument unused during compilation: '-no-cpp-precomp'
  491. :info:build /bin/sh /opt/local/share/apr-1/build/libtool --silent --mode=link /usr/bin/clang -pipe -O2 -arch x86_64 -DHAVE_CONFIG_H -DDARWIN -DSIGPROCMASK_SETS_THREAD_MASK -no-cpp-precomp -I/opt/local/include -I/opt/local/var/macports/build/_opt_local_var_macports_sources_rsync.macports.org_release_tarballs_ports_devel_apr-util/apr-util/work/apr-util-1.4.1/include -I/opt/local/var/macports/build/_opt_local_var_macports_sources_rsync.macports.org_release_tarballs_ports_devel_apr-util/apr-util/work/apr-util-1.4.1/include/private -I/opt/local/include -I/opt/local/include/apr-1 -I/opt/local/include -version-info 4:1:4 -L/opt/local/lib -arch x86_64 -o libaprutil-1.la -rpath /opt/local/lib buckets/apr_brigade.lo buckets/apr_buckets.lo buckets/apr_buckets_alloc.lo buckets/apr_buckets_eos.lo buckets/apr_buckets_file.lo buckets/apr_buckets_flush.lo buckets/apr_buckets_heap.lo buckets/apr_buckets_mmap.lo buckets/apr_buckets_pipe.lo buckets/apr_buckets_pool.lo buckets/apr_buckets_refcount.lo buckets/apr_buckets_simple.lo buckets/apr_buckets_socket.lo crypto/apr_crypto.lo crypto/apr_md4.lo crypto/apr_md5.lo crypto/apr_sha1.lo crypto/getuuid.lo crypto/uuid.lo dbd/apr_dbd.lo dbm/apr_dbm.lo dbm/apr_dbm_sdbm.lo dbm/sdbm/sdbm.lo dbm/sdbm/sdbm_hash.lo dbm/sdbm/sdbm_lock.lo dbm/sdbm/sdbm_pair.lo encoding/apr_base64.lo hooks/apr_hooks.lo ldap/apr_ldap_stub.lo ldap/apr_ldap_url.lo memcache/apr_memcache.lo misc/apr_date.lo misc/apr_queue.lo misc/apr_reslist.lo misc/apr_rmm.lo misc/apr_thread_pool.lo misc/apu_dso.lo misc/apu_version.lo strmatch/apr_strmatch.lo uri/apr_uri.lo xlate/xlate.lo xml/apr_xml.lo -lpthread -L/opt/local/lib/db46 -L/opt/local/lib -lexpat -liconv /opt/local/lib/libapr-1.la -lpthread
  492. :info:build /bin/sh /opt/local/share/apr-1/build/libtool --silent --mode=link /usr/bin/clang -pipe -O2 -arch x86_64 -L/opt/local/lib -arch x86_64 -L/opt/local/lib/db46 -L/opt/local/lib -release 1 -module -rpath /opt/local/lib/apr-util-1 -o dbm/apr_dbm_db.la dbm/apr_dbm_berkeleydb.lo -ldb-4.6
  493. :info:build 1 warning generated.
  494. :info:build /bin/sh /opt/local/share/apr-1/build/libtool --silent --mode=link /usr/bin/clang -pipe -O2 -arch x86_64 -L/opt/local/lib -arch x86_64 -L/opt/local/lib/db46 -L/opt/local/lib -release 1 -module -rpath /opt/local/lib/apr-util-1 -o dbd/apr_dbd_sqlite3.la dbd/apr_dbd_sqlite3.lo -L/opt/local/lib -lsqlite3
  495. :info:build warning: no debug symbols in executable (-arch x86_64)
  496. :info:build /bin/sh /opt/local/share/apr-1/build/libtool --silent --mode=link /usr/bin/clang -pipe -O2 -arch x86_64 -L/opt/local/lib -arch x86_64 -L/opt/local/lib/db46 -L/opt/local/lib -release 1 -module -rpath /opt/local/lib/apr-util-1 -o dbd/apr_dbd_odbc.la dbd/apr_dbd_odbc.lo -lodbc
  497. :info:build warning: no debug symbols in executable (-arch x86_64)
  498. :info:build clang: error: unable to execute command: Segmentation fault: 11
  499. :info:build clang: error: linker command failed due to signal 2 (use -v to see invocation)
  500. :info:build clang: note: diagnostic msg: Please submit a bug report to http://developer.apple.com/bugreporter/ and include command line arguments and all diagnostic information.
  501. :info:build clang: note: diagnostic msg: Error generating preprocessed source(s) - cannot generate preprocessed source with multiple -arch options.
  502. :info:build make[1]: *** [dbd/apr_dbd_sqlite3.la] Error 254
  503. :info:build make[1]: *** Waiting for unfinished jobs....
  504. :info:build warning: no debug symbols in executable (-arch x86_64)
  505. :info:build /usr/bin/ranlib: file: .libs/libaprutil-1.a(apr_crypto.o) has no symbols
  506. :info:build /usr/bin/ranlib: file: .libs/libaprutil-1.a(apr_ldap_stub.o) has no symbols
  507. :info:build /usr/bin/ranlib: file: .libs/libaprutil-1.a(apr_ldap_url.o) has no symbols
  508. :info:build ranlib: file: .libs/libaprutil-1.a(apr_crypto.o) has no symbols
  509. :info:build ranlib: file: .libs/libaprutil-1.a(apr_ldap_stub.o) has no symbols
  510. :info:build ranlib: file: .libs/libaprutil-1.a(apr_ldap_url.o) has no symbols
  511. :info:build make[1]: Leaving directory `/opt/local/var/macports/build/_opt_local_var_macports_sources_rsync.macports.org_release_tarballs_ports_devel_apr-util/apr-util/work/apr-util-1.4.1'
  512. :info:build make: *** [all-recursive] Error 1
  513. :info:build make: Leaving directory `/opt/local/var/macports/build/_opt_local_var_macports_sources_rsync.macports.org_release_tarballs_ports_devel_apr-util/apr-util/work/apr-util-1.4.1'
  514. :info:build shell command " cd "/opt/local/var/macports/build/_opt_local_var_macports_sources_rsync.macports.org_release_tarballs_ports_devel_apr-util/apr-util/work/apr-util-1.4.1" && /usr/bin/make -j4 -w all " returned error 2
  515. :error:build Target org.macports.build returned: shell command failed (see log for details)
  516. :debug:build Backtrace: shell command failed (see log for details)
  517. while executing
  518. "command_exec build"
  519. (procedure "portbuild::build_main" line 8)
  520. invoked from within
  521. "$procedure $targetname"
  522. :info:build Warning: the following items did not execute (for apr-util): org.macports.activate org.macports.build org.macports.destroot org.macports.install
  523. :error:build Failed to install apr-util
  524. :debug:build couldn't open "/System/Library/Frameworks/Tcl.framework/Versions/8.5/Resources/tclIndex": no such file or directory
  525. while executing
  526. "open [file join $dir tclIndex]"
  527. :notice:build Log for apr-util is at: /opt/local/var/macports/logs/_opt_local_var_macports_sources_rsync.macports.org_release_tarballs_ports_devel_apr-util/apr-util/main.log
RAW Paste Data

Adblocker detected! Please consider disabling it...

We've detected AdBlock Plus or some other adblocking software preventing Pastebin.com from fully loading.

We don't have any obnoxious sound, or popup ads, we actively block these annoying types of ads!

Please add Pastebin.com to your ad blocker whitelist or disable your adblocking software.

×