serenia

Untitled

Jul 29th, 2019
361
0
Never
Not a member of Pastebin yet? Sign Up, it unlocks many cool features!
text 98.05 KB | None | 0 0
  1. Makefile:34: warning: overriding recipe for target 'pre_install'
  2. Rules.mk:102: warning: ignoring old recipe for target 'pre_install'
  3. echo "PWD = /home/alexander/test/payton_1.4.1.SR1_gpl/payton/src"
  4. PWD = /home/alexander/test/payton_1.4.1.SR1_gpl/payton/src
  5. echo "NOW = "
  6. NOW =
  7. if [ -f host_tools/Makefile.cyt ]; then \
  8. make -C host_tools -f Makefile.cyt; \
  9. else \
  10. make -C host_tools; \
  11. fi
  12. make[1]: Entering directory '/home/alexander/test/payton_1.4.1.SR1_gpl/payton/src/host_tools'
  13. Makefile:24: warning: overriding recipe for target 'install'
  14. /home/alexander/test/payton_1.4.1.SR1_gpl/payton/src/Rules.mk:110: warning: ignoring old recipe for target 'install'
  15. echo "PWD = /home/alexander/test/payton_1.4.1.SR1_gpl/payton/src"
  16. PWD = /home/alexander/test/payton_1.4.1.SR1_gpl/payton/src
  17. echo "NOW = "
  18. NOW =
  19. if [ -f gpl_src/Makefile.cyt ]; then \
  20. make -C gpl_src -f Makefile.cyt; \
  21. else \
  22. make -C gpl_src; \
  23. fi
  24. make[2]: Entering directory '/home/alexander/test/payton_1.4.1.SR1_gpl/payton/src/host_tools/gpl_src'
  25. Makefile:40: warning: overriding recipe for target '_subdir_installfakeroot'
  26. /home/alexander/test/payton_1.4.1.SR1_gpl/payton/src/Rules.mk:82: warning: ignoring old recipe for target '_subdir_installfakeroot'
  27. Makefile:40: warning: overriding recipe for target '_subdir_installmakedevs'
  28. /home/alexander/test/payton_1.4.1.SR1_gpl/payton/src/Rules.mk:82: warning: ignoring old recipe for target '_subdir_installmakedevs'
  29. Makefile:40: warning: overriding recipe for target '_subdir_installsqlzma'
  30. /home/alexander/test/payton_1.4.1.SR1_gpl/payton/src/Rules.mk:82: warning: ignoring old recipe for target '_subdir_installsqlzma'
  31. Makefile:40: warning: overriding recipe for target '_subdir_installsquashfs3.4'
  32. /home/alexander/test/payton_1.4.1.SR1_gpl/payton/src/Rules.mk:82: warning: ignoring old recipe for target '_subdir_installsquashfs3.4'
  33. Makefile:40: warning: overriding recipe for target '_subdir_installuboot-mkimage'
  34. /home/alexander/test/payton_1.4.1.SR1_gpl/payton/src/Rules.mk:82: warning: ignoring old recipe for target '_subdir_installuboot-mkimage'
  35. echo "PWD = /home/alexander/test/payton_1.4.1.SR1_gpl/payton/src/host_tools"
  36. PWD = /home/alexander/test/payton_1.4.1.SR1_gpl/payton/src/host_tools
  37. echo "NOW = host_tools"
  38. NOW = host_tools
  39. if [ -f fakeroot/Makefile.cyt ]; then \
  40. make -C fakeroot -f Makefile.cyt; \
  41. else \
  42. make -C fakeroot; \
  43. fi
  44. make[3]: Entering directory '/home/alexander/test/payton_1.4.1.SR1_gpl/payton/src/host_tools/gpl_src/pkgs/fakeroot-1.9.5'
  45. make[3]: Nothing to be done for 'all'.
  46. make[3]: Leaving directory '/home/alexander/test/payton_1.4.1.SR1_gpl/payton/src/host_tools/gpl_src/pkgs/fakeroot-1.9.5'
  47. if [ -f makedevs/Makefile.cyt ]; then \
  48. make -C makedevs -f Makefile.cyt; \
  49. else \
  50. make -C makedevs; \
  51. fi
  52. make[3]: Entering directory '/home/alexander/test/payton_1.4.1.SR1_gpl/payton/src/host_tools/gpl_src/pkgs/makedevs-0.0.01b'
  53. if [ -e /home/alexander/test/payton_1.4.1.SR1_gpl/payton/src/host_tools/makedevs ]; then \
  54. /bin/rm -f /home/alexander/test/payton_1.4.1.SR1_gpl/payton/src/host_tools/makedevs; \
  55. fi
  56. install -m 755 makedevs /home/alexander/test/payton_1.4.1.SR1_gpl/payton/src/host_tools/makedevs
  57. touch -c /home/alexander/test/payton_1.4.1.SR1_gpl/payton/src/host_tools/makedevs
  58. make[3]: Leaving directory '/home/alexander/test/payton_1.4.1.SR1_gpl/payton/src/host_tools/gpl_src/pkgs/makedevs-0.0.01b'
  59. if [ -f sqlzma/Makefile.cyt ]; then \
  60. make -C sqlzma -f Makefile.cyt; \
  61. else \
  62. make -C sqlzma; \
  63. fi
  64. make[3]: Entering directory '/home/alexander/test/payton_1.4.1.SR1_gpl/payton/src/host_tools/gpl_src/pkgs/sqlzma-3.4-457'
  65. make all
  66. make[4]: Entering directory '/home/alexander/test/payton_1.4.1.SR1_gpl/payton/src/host_tools/gpl_src/pkgs/sqlzma-3.4-457'
  67. make -C /home/alexander/test/payton_1.4.1.SR1_gpl/payton/src/host_tools/gpl_src/pkgs/sqlzma-3.4-457/lzma457/C/Compress/Lzma -f sqlzma.mk all
  68. make[5]: Entering directory '/home/alexander/test/payton_1.4.1.SR1_gpl/payton/src/host_tools/gpl_src/pkgs/sqlzma-3.4-457/lzma457/C/Compress/Lzma'
  69. make[5]: Nothing to be done for 'all'.
  70. make[5]: Leaving directory '/home/alexander/test/payton_1.4.1.SR1_gpl/payton/src/host_tools/gpl_src/pkgs/sqlzma-3.4-457/lzma457/C/Compress/Lzma'
  71. make -C /home/alexander/test/payton_1.4.1.SR1_gpl/payton/src/host_tools/gpl_src/pkgs/sqlzma-3.4-457/lzma457/CPP/7zip/Compress/LZMA_Alone -f sqlzma.mk all
  72. make[5]: Entering directory '/home/alexander/test/payton_1.4.1.SR1_gpl/payton/src/host_tools/gpl_src/pkgs/sqlzma-3.4-457/lzma457/CPP/7zip/Compress/LZMA_Alone'
  73. make[5]: Nothing to be done for 'all'.
  74. make[5]: Leaving directory '/home/alexander/test/payton_1.4.1.SR1_gpl/payton/src/host_tools/gpl_src/pkgs/sqlzma-3.4-457/lzma457/CPP/7zip/Compress/LZMA_Alone'
  75. #make -C /home/alexander/test/payton_1.4.1.SR1_gpl/payton/src/host_tools/gpl_src/pkgs/sqlzma-3.4-457/squashfs3.4/squashfs-tools all
  76. make[4]: Leaving directory '/home/alexander/test/payton_1.4.1.SR1_gpl/payton/src/host_tools/gpl_src/pkgs/sqlzma-3.4-457'
  77. #install -m 755 squashfs3.4/squashfs-tools/mksquashfs ../../..
  78. make[3]: Leaving directory '/home/alexander/test/payton_1.4.1.SR1_gpl/payton/src/host_tools/gpl_src/pkgs/sqlzma-3.4-457'
  79. if [ -f squashfs3.4/Makefile.cyt ]; then \
  80. make -C squashfs3.4 -f Makefile.cyt; \
  81. else \
  82. make -C squashfs3.4; \
  83. fi
  84. make[3]: Entering directory '/home/alexander/test/payton_1.4.1.SR1_gpl/payton/src/host_tools/gpl_src/pkgs/squashfs3.4'
  85. make -C squashfs-tools all Sqlzma=/home/alexander/test/payton_1.4.1.SR1_gpl/payton/src/host_tools/gpl_src/sqlzma
  86. make[4]: Entering directory '/home/alexander/test/payton_1.4.1.SR1_gpl/payton/src/host_tools/gpl_src/pkgs/squashfs3.4/squashfs-tools'
  87. make[4]: Nothing to be done for 'all'.
  88. make[4]: Leaving directory '/home/alexander/test/payton_1.4.1.SR1_gpl/payton/src/host_tools/gpl_src/pkgs/squashfs3.4/squashfs-tools'
  89. install -m 755 squashfs-tools/mksquashfs /home/alexander/test/payton_1.4.1.SR1_gpl/payton/src/host_tools/
  90. make[3]: Leaving directory '/home/alexander/test/payton_1.4.1.SR1_gpl/payton/src/host_tools/gpl_src/pkgs/squashfs3.4'
  91. if [ -f uboot-mkimage/Makefile.cyt ]; then \
  92. make -C uboot-mkimage -f Makefile.cyt; \
  93. else \
  94. make -C uboot-mkimage; \
  95. fi
  96. make[3]: Entering directory '/home/alexander/test/payton_1.4.1.SR1_gpl/payton/src/host_tools/gpl_src/pkgs/uboot-mkimage-0.4'
  97. gcc -O -I. -DTEXT_BASE=0x00F00000 -DUSE_HOSTCC -o /home/alexander/test/payton_1.4.1.SR1_gpl/payton/src/host_tools/mkimage mkimage.o crc32.o
  98. strip /home/alexander/test/payton_1.4.1.SR1_gpl/payton/src/host_tools/mkimage
  99. make[3]: Leaving directory '/home/alexander/test/payton_1.4.1.SR1_gpl/payton/src/host_tools/gpl_src/pkgs/uboot-mkimage-0.4'
  100. make[2]: Leaving directory '/home/alexander/test/payton_1.4.1.SR1_gpl/payton/src/host_tools/gpl_src'
  101. make[1]: Leaving directory '/home/alexander/test/payton_1.4.1.SR1_gpl/payton/src/host_tools'
  102. if [ -f router/Makefile.cyt ]; then \
  103. make -C router -f Makefile.cyt; \
  104. else \
  105. make -C router; \
  106. fi
  107. make[1]: Entering directory '/home/alexander/test/payton_1.4.1.SR1_gpl/payton/src/router'
  108. echo "PWD = /home/alexander/test/payton_1.4.1.SR1_gpl/payton/src"
  109. PWD = /home/alexander/test/payton_1.4.1.SR1_gpl/payton/src
  110. echo "NOW = "
  111. NOW =
  112. if [ -f ../linux/Makefile.cyt ]; then \
  113. make -C ../linux -f Makefile.cyt; \
  114. else \
  115. make -C ../linux; \
  116. fi
  117. make[2]: Entering directory '/home/alexander/test/payton_1.4.1.SR1_gpl/payton/src/linux'
  118. echo "PWD = /home/alexander/test/payton_1.4.1.SR1_gpl/payton/src/router"
  119. PWD = /home/alexander/test/payton_1.4.1.SR1_gpl/payton/src/router
  120. echo "NOW = linux"
  121. NOW = linux
  122. if [ -f linux/Makefile.cyt ]; then \
  123. make -C linux -f Makefile.cyt; \
  124. else \
  125. make -C linux; \
  126. fi
  127. make[3]: Entering directory '/home/alexander/test/payton_1.4.1.SR1_gpl/payton/src/linux/pkgs/dspg_pnx8181/linux-2.6.26.5'
  128. PATH=/opt/emlix/pnx8181/bin:/opt/emlix/pnx8181/bin:/opt/emlix/pnx8181/bin:/opt/emlix/e2-2.2/bin:/usr/local/bin:/usr/bin:/bin:/usr/local/games:/usr/games make zImage modules V=1 CONFIG_LOCALVERSION_AUTO=n
  129. make[4]: Entering directory '/home/alexander/test/payton_1.4.1.SR1_gpl/payton/src/linux/pkgs/dspg_pnx8181/linux-2.6.26.5'
  130. set -e; :; mkdir -p include/linux/; (echo \#define LINUX_VERSION_CODE 132634; echo '#define KERNEL_VERSION(a,b,c) (((a) << 16) + ((b) << 8) + (c))';) < /home/alexander/test/payton_1.4.1.SR1_gpl/payton/src/linux/pkgs/dspg_pnx8181/linux-2.6.26.5/Makefile > include/linux/version.h.tmp; if [ -r include/linux/version.h ] && cmp -s include/linux/version.h include/linux/version.h.tmp; then rm -f include/linux/version.h.tmp; else :; mv -f include/linux/version.h.tmp include/linux/version.h; fi
  131. make -f scripts/Makefile.build obj=arch/arm/tools include/asm-arm/mach-types.h
  132. make[5]: 'include/asm-arm/mach-types.h' is up to date.
  133. rm -f include/config/kernel.release
  134. echo 2.6.26.5 > include/config/kernel.release
  135. set -e; :; mkdir -p include/linux/; if [ `echo -n "2.6.26.5" | wc -c ` -gt 64 ]; then echo '"2.6.26.5" exceeds 64 characters' >&2; exit 1; fi; (echo \#define UTS_RELEASE \"2.6.26.5\";) < include/config/kernel.release > include/linux/utsrelease.h.tmp; if [ -r include/linux/utsrelease.h ] && cmp -s include/linux/utsrelease.h include/linux/utsrelease.h.tmp; then rm -f include/linux/utsrelease.h.tmp; else :; mv -f include/linux/utsrelease.h.tmp include/linux/utsrelease.h; fi
  136. set -e; asmlink=`readlink include/asm | cut -d '-' -f 2`; \
  137. if [ -L include/asm ]; then \
  138. if [ "$asmlink" != "arm" ]; then \
  139. echo "ERROR: the symlink include/asm points to asm-$asmlink but asm-arm was expected"; \
  140. echo " set ARCH or save .config and run 'make mrproper' to fix it"; \
  141. exit 1; \
  142. fi; \
  143. else \
  144. echo ' SYMLINK include/asm -> include/asm-arm'; \
  145. if [ ! -d include ]; then \
  146. mkdir -p include; \
  147. fi; \
  148. ln -fsn asm-arm include/asm; \
  149. fi
  150. mkdir -p .tmp_versions ; rm -f .tmp_versions/*
  151. make -f scripts/Makefile.build obj=scripts/basic
  152. (cat /dev/null; ) > scripts/basic/modules.order
  153. make -f scripts/Makefile.build obj=.
  154. (cat /dev/null; ) > modules.order
  155. mkdir -p kernel/
  156. mkdir -p arch/arm/kernel/
  157. make -f scripts/Makefile.build obj=. missing-syscalls
  158. /bin/bash scripts/checksyscalls.sh /opt/emlix/pnx8181/bin/arm-linux-gnueabi-gcc -Wp,-MD,./.missing-syscalls.d -nostdinc -isystem /opt/emlix/pnx8181/bin/../lib/gcc/arm-linux-gnueabi/4.1.2/include -D__KERNEL__ -Iinclude -include include/linux/autoconf.h -mlittle-endian -Wall -Wundef -Wstrict-prototypes -Wno-trigraphs -fno-strict-aliasing -fno-common -Werror-implicit-function-declaration -Os -fno-stack-protector -marm -fno-omit-frame-pointer -mapcs -mno-sched-prolog -mabi=aapcs-linux -mno-thumb-interwork -D__LINUX_ARM_ARCH__=5 -march=armv5te -mtune=arm9tdmi -msoft-float -Uarm -fno-omit-frame-pointer -fno-optimize-sibling-calls -march=armv5te -DCY_CHECK_DNAT_MARK_AND_DO_MASQUERADE_SUPPORT=1 -Wdeclaration-after-statement -Wno-pointer-sign -D"KBUILD_STR(s)=#s" -D"KBUILD_BASENAME=KBUILD_STR(missing_syscalls)" -D"KBUILD_MODNAME=KBUILD_STR(missing_syscalls)"
  159. <stdin>:1097:2: warning: #warning syscall fadvise64 not implemented
  160. <stdin>:1265:2: warning: #warning syscall migrate_pages not implemented
  161. <stdin>:1321:2: warning: #warning syscall pselect6 not implemented
  162. <stdin>:1325:2: warning: #warning syscall ppoll not implemented
  163. <stdin>:1365:2: warning: #warning syscall epoll_pwait not implemented
  164. make -f scripts/Makefile.build obj=scripts
  165. make -f scripts/Makefile.build obj=scripts/mod
  166. (cat /dev/null; ) > scripts/mod/modules.order
  167. (cat /dev/null; ) > scripts/modules.order
  168. make -f scripts/Makefile.build obj=init
  169. /bin/bash /home/alexander/test/payton_1.4.1.SR1_gpl/payton/src/linux/pkgs/dspg_pnx8181/linux-2.6.26.5/scripts/mkcompile_h include/linux/compile.h \
  170. "arm" "" "y" "/opt/emlix/pnx8181/bin/arm-linux-gnueabi-gcc -Wall -Wundef -Wstrict-prototypes -Wno-trigraphs -fno-strict-aliasing -fno-common -Werror-implicit-function-declaration -Os -fno-stack-protector -marm -fno-omit-frame-pointer -mapcs -mno-sched-prolog -mabi=aapcs-linux -mno-thumb-interwork -D__LINUX_ARM_ARCH__=5 -march=armv5te -mtune=arm9tdmi -msoft-float -Uarm -fno-omit-frame-pointer -fno-optimize-sibling-calls -march=armv5te -DCY_CHECK_DNAT_MARK_AND_DO_MASQUERADE_SUPPORT=1 -Wdeclaration-after-statement -Wno-pointer-sign"
  171. (cat /dev/null; ) > init/modules.order
  172. make -f scripts/Makefile.build obj=usr
  173. (cat /dev/null; ) > usr/modules.order
  174. make -f scripts/Makefile.build obj=arch/arm/kernel
  175. (cat /dev/null; ) > arch/arm/kernel/modules.order
  176. make -f scripts/Makefile.build obj=arch/arm/mm
  177. (cat /dev/null; ) > arch/arm/mm/modules.order
  178. make -f scripts/Makefile.build obj=arch/arm/common
  179. (cat /dev/null; ) > arch/arm/common/modules.order
  180. make -f scripts/Makefile.build obj=arch/arm/mach-pnx8181
  181. (cat /dev/null; ) > arch/arm/mach-pnx8181/modules.order
  182. make -f scripts/Makefile.build obj=kernel
  183. make -f scripts/Makefile.build obj=kernel/irq
  184. (cat /dev/null; ) > kernel/irq/modules.order
  185. make -f scripts/Makefile.build obj=kernel/time
  186. (cat /dev/null; ) > kernel/time/modules.order
  187. (cat /dev/null; cat kernel/time/modules.order; cat kernel/irq/modules.order;) > kernel/modules.order
  188. make -f scripts/Makefile.build obj=mm
  189. (cat /dev/null; ) > mm/modules.order
  190. make -f scripts/Makefile.build obj=fs
  191. make -f scripts/Makefile.build obj=fs/configfs
  192. (cat /dev/null; ) > fs/configfs/modules.order
  193. make -f scripts/Makefile.build obj=fs/debugfs
  194. (cat /dev/null; ) > fs/debugfs/modules.order
  195. make -f scripts/Makefile.build obj=fs/devpts
  196. (cat /dev/null; ) > fs/devpts/modules.order
  197. make -f scripts/Makefile.build obj=fs/jffs2
  198. (cat /dev/null; ) > fs/jffs2/modules.order
  199. make -f scripts/Makefile.build obj=fs/lockd
  200. (cat /dev/null; ) > fs/lockd/modules.order
  201. make -f scripts/Makefile.build obj=fs/nfs
  202. (cat /dev/null; ) > fs/nfs/modules.order
  203. make -f scripts/Makefile.build obj=fs/nfs_common
  204. (cat /dev/null; ) > fs/nfs_common/modules.order
  205. make -f scripts/Makefile.build obj=fs/nls
  206. (cat /dev/null; ) > fs/nls/modules.order
  207. make -f scripts/Makefile.build obj=fs/partitions
  208. (cat /dev/null; ) > fs/partitions/modules.order
  209. make -f scripts/Makefile.build obj=fs/proc
  210. (cat /dev/null; ) > fs/proc/modules.order
  211. make -f scripts/Makefile.build obj=fs/ramfs
  212. (cat /dev/null; ) > fs/ramfs/modules.order
  213. make -f scripts/Makefile.build obj=fs/squashfs
  214. (cat /dev/null; ) > fs/squashfs/modules.order
  215. make -f scripts/Makefile.build obj=fs/sysfs
  216. (cat /dev/null; ) > fs/sysfs/modules.order
  217. (cat /dev/null; cat fs/nfs_common/modules.order; cat fs/proc/modules.order; cat fs/partitions/modules.order; cat fs/sysfs/modules.order; cat fs/configfs/modules.order; cat fs/devpts/modules.order; cat fs/squashfs/modules.order; cat fs/ramfs/modules.order; cat fs/nfs/modules.order; cat fs/lockd/modules.order; cat fs/nls/modules.order; cat fs/jffs2/modules.order; cat fs/debugfs/modules.order;) > fs/modules.order
  218. make -f scripts/Makefile.build obj=ipc
  219. (cat /dev/null; ) > ipc/modules.order
  220. make -f scripts/Makefile.build obj=security
  221. (cat /dev/null; ) > security/modules.order
  222. make -f scripts/Makefile.build obj=crypto
  223. (cat /dev/null; echo kernel/crypto/crypto_hash.ko; echo kernel/crypto/hmac.ko; echo kernel/crypto/md4.ko; echo kernel/crypto/sha256_generic.ko; echo kernel/crypto/sha512_generic.ko; echo kernel/crypto/cbc.ko; echo kernel/crypto/pcbc.ko; echo kernel/crypto/des_generic.ko; echo kernel/crypto/blowfish.ko; echo kernel/crypto/twofish.ko; echo kernel/crypto/twofish_common.ko; echo kernel/crypto/aes_generic.ko; echo kernel/crypto/cast6.ko; echo kernel/crypto/tea.ko; echo kernel/crypto/crc32c.ko;) > crypto/modules.order
  224. make -f scripts/Makefile.build obj=block
  225. (cat /dev/null; ) > block/modules.order
  226. make -f scripts/Makefile.build obj=drivers
  227. make -f scripts/Makefile.build obj=drivers/auxdisplay
  228. (cat /dev/null; ) > drivers/auxdisplay/modules.order
  229. make -f scripts/Makefile.build obj=drivers/base
  230. make -f scripts/Makefile.build obj=drivers/base/power
  231. (cat /dev/null; ) > drivers/base/power/modules.order
  232. (cat /dev/null; cat drivers/base/power/modules.order;) > drivers/base/modules.order
  233. make -f scripts/Makefile.build obj=drivers/block
  234. (cat /dev/null; echo kernel/drivers/block/loop.ko; echo kernel/drivers/block/nbd.ko; echo kernel/drivers/block/cryptoloop.ko;) > drivers/block/modules.order
  235. make -f scripts/Makefile.build obj=drivers/cdrom
  236. (cat /dev/null; ) > drivers/cdrom/modules.order
  237. make -f scripts/Makefile.build obj=drivers/char
  238. make -f scripts/Makefile.build obj=drivers/char/hw_random
  239. (cat /dev/null; echo kernel/drivers/char/hw_random/rng-core.ko;) > drivers/char/hw_random/modules.order
  240. (cat /dev/null; cat drivers/char/hw_random/modules.order;) > drivers/char/modules.order
  241. make -f scripts/Makefile.build obj=drivers/connector
  242. (cat /dev/null; ) > drivers/connector/modules.order
  243. make -f scripts/Makefile.build obj=drivers/cordless
  244. (cat /dev/null; ) > drivers/cordless/modules.order
  245. make -f scripts/Makefile.build obj=drivers/crypto
  246. (cat /dev/null; ) > drivers/crypto/modules.order
  247. make -f scripts/Makefile.build obj=drivers/firmware
  248. (cat /dev/null; ) > drivers/firmware/modules.order
  249. make -f scripts/Makefile.build obj=drivers/hid
  250. (cat /dev/null; ) > drivers/hid/modules.order
  251. make -f scripts/Makefile.build obj=drivers/i2c
  252. make -f scripts/Makefile.build obj=drivers/i2c/algos
  253. (cat /dev/null; ) > drivers/i2c/algos/modules.order
  254. make -f scripts/Makefile.build obj=drivers/i2c/busses
  255. (cat /dev/null; ) > drivers/i2c/busses/modules.order
  256. make -f scripts/Makefile.build obj=drivers/i2c/chips
  257. (cat /dev/null; ) > drivers/i2c/chips/modules.order
  258. (cat /dev/null; cat drivers/i2c/busses/modules.order; cat drivers/i2c/chips/modules.order; cat drivers/i2c/algos/modules.order;) > drivers/i2c/modules.order
  259. make -f scripts/Makefile.build obj=drivers/ieee1394
  260. (cat /dev/null; ) > drivers/ieee1394/modules.order
  261. make -f scripts/Makefile.build obj=drivers/input
  262. (cat /dev/null; ) > drivers/input/modules.order
  263. make -f scripts/Makefile.build obj=drivers/leds
  264. (cat /dev/null; ) > drivers/leds/modules.order
  265. make -f scripts/Makefile.build obj=drivers/lguest
  266. (cat /dev/null; ) > drivers/lguest/modules.order
  267. make -f scripts/Makefile.build obj=drivers/macintosh
  268. (cat /dev/null; ) > drivers/macintosh/modules.order
  269. make -f scripts/Makefile.build obj=drivers/media
  270. make -f scripts/Makefile.build obj=drivers/media/common
  271. make -f scripts/Makefile.build obj=drivers/media/common/tuners
  272. (cat /dev/null; ) > drivers/media/common/tuners/modules.order
  273. (cat /dev/null; cat drivers/media/common/tuners/modules.order;) > drivers/media/common/modules.order
  274. make -f scripts/Makefile.build obj=drivers/media/video
  275. (cat /dev/null; ) > drivers/media/video/modules.order
  276. (cat /dev/null; cat drivers/media/common/modules.order; cat drivers/media/video/modules.order;) > drivers/media/modules.order
  277. make -f scripts/Makefile.build obj=drivers/mfd
  278. (cat /dev/null; ) > drivers/mfd/modules.order
  279. make -f scripts/Makefile.build obj=drivers/misc
  280. (cat /dev/null; ) > drivers/misc/modules.order
  281. make -f scripts/Makefile.build obj=drivers/mtd
  282. make -f scripts/Makefile.build obj=drivers/mtd/chips
  283. (cat /dev/null; ) > drivers/mtd/chips/modules.order
  284. make -f scripts/Makefile.build obj=drivers/mtd/devices
  285. (cat /dev/null; ) > drivers/mtd/devices/modules.order
  286. make -f scripts/Makefile.build obj=drivers/mtd/maps
  287. (cat /dev/null; ) > drivers/mtd/maps/modules.order
  288. make -f scripts/Makefile.build obj=drivers/mtd/nand
  289. (cat /dev/null; ) > drivers/mtd/nand/modules.order
  290. make -f scripts/Makefile.build obj=drivers/mtd/onenand
  291. (cat /dev/null; ) > drivers/mtd/onenand/modules.order
  292. (cat /dev/null; cat drivers/mtd/chips/modules.order; cat drivers/mtd/maps/modules.order; cat drivers/mtd/devices/modules.order; cat drivers/mtd/nand/modules.order; cat drivers/mtd/onenand/modules.order;) > drivers/mtd/modules.order
  293. make -f scripts/Makefile.build obj=drivers/net
  294. make -f scripts/Makefile.build obj=drivers/net/arm
  295. (cat /dev/null; ) > drivers/net/arm/modules.order
  296. make -f scripts/Makefile.build obj=drivers/net/ip3912
  297. (cat /dev/null; ) > drivers/net/ip3912/modules.order
  298. make -f scripts/Makefile.build obj=drivers/net/phy
  299. (cat /dev/null; ) > drivers/net/phy/modules.order
  300. make -f scripts/Makefile.build obj=drivers/net/wireless
  301. (cat /dev/null; ) > drivers/net/wireless/modules.order
  302. (cat /dev/null; cat drivers/net/phy/modules.order; cat drivers/net/arm/modules.order; cat drivers/net/wireless/modules.order; cat drivers/net/ip3912/modules.order;) > drivers/net/modules.order
  303. make -f scripts/Makefile.build obj=drivers/rtc
  304. (cat /dev/null; ) > drivers/rtc/modules.order
  305. make -f scripts/Makefile.build obj=drivers/serial
  306. (cat /dev/null; ) > drivers/serial/modules.order
  307. make -f scripts/Makefile.build obj=drivers/slic
  308. (cat /dev/null; ) > drivers/slic/modules.order
  309. make -f scripts/Makefile.build obj=drivers/spi
  310. (cat /dev/null; ) > drivers/spi/modules.order
  311. make -f scripts/Makefile.build obj=drivers/video
  312. make -f scripts/Makefile.build obj=drivers/video/backlight
  313. (cat /dev/null; ) > drivers/video/backlight/modules.order
  314. make -f scripts/Makefile.build obj=drivers/video/console
  315. (cat /dev/null; ) > drivers/video/console/modules.order
  316. make -f scripts/Makefile.build obj=drivers/video/display
  317. (cat /dev/null; ) > drivers/video/display/modules.order
  318. (cat /dev/null; cat drivers/video/console/modules.order; cat drivers/video/backlight/modules.order; cat drivers/video/display/modules.order;) > drivers/video/modules.order
  319. make -f scripts/Makefile.build obj=drivers/watchdog
  320. (cat /dev/null; ) > drivers/watchdog/modules.order
  321. (cat /dev/null; cat drivers/video/modules.order; cat drivers/char/modules.order; cat drivers/connector/modules.order; cat drivers/serial/modules.order; cat drivers/base/modules.order; cat drivers/block/modules.order; cat drivers/misc/modules.order; cat drivers/mfd/modules.order; cat drivers/net/modules.order; cat drivers/media/modules.order; cat drivers/macintosh/modules.order; cat drivers/ieee1394/modules.order; cat drivers/cdrom/modules.order; cat drivers/auxdisplay/modules.order; cat drivers/mtd/modules.order; cat drivers/spi/modules.order; cat drivers/input/modules.order; cat drivers/rtc/modules.order; cat drivers/i2c/modules.order; cat drivers/watchdog/modules.order; cat drivers/lguest/modules.order; cat drivers/leds/modules.order; cat drivers/firmware/modules.order; cat drivers/crypto/modules.order; cat drivers/hid/modules.order; cat drivers/cordless/modules.order; cat drivers/slic/modules.order;) > drivers/modules.order
  322. make -f scripts/Makefile.build obj=sound
  323. (cat /dev/null; ) > sound/modules.order
  324. make -f scripts/Makefile.build obj=arch/arm/oprofile
  325. (cat /dev/null; echo kernel/arch/arm/oprofile/oprofile.ko;) > arch/arm/oprofile/modules.order
  326. make -f scripts/Makefile.build obj=net
  327. make -f scripts/Makefile.build obj=net/802
  328. (cat /dev/null; ) > net/802/modules.order
  329. make -f scripts/Makefile.build obj=net/8021q
  330. (cat /dev/null; ) > net/8021q/modules.order
  331. make -f scripts/Makefile.build obj=net/bridge
  332. make -f scripts/Makefile.build obj=net/bridge/netfilter
  333. (cat /dev/null; ) > net/bridge/netfilter/modules.order
  334. (cat /dev/null; cat net/bridge/netfilter/modules.order;) > net/bridge/modules.order
  335. make -f scripts/Makefile.build obj=net/core
  336. (cat /dev/null; ) > net/core/modules.order
  337. make -f scripts/Makefile.build obj=net/ethernet
  338. (cat /dev/null; ) > net/ethernet/modules.order
  339. make -f scripts/Makefile.build obj=net/ipv4
  340. make -f scripts/Makefile.build obj=net/ipv4/netfilter
  341. (cat /dev/null; echo kernel/net/ipv4/netfilter/nf_nat_h323.ko; echo kernel/net/ipv4/netfilter/nf_nat_irc.ko; echo kernel/net/ipv4/netfilter/nf_nat_sip.ko; echo kernel/net/ipv4/netfilter/nf_nat_rtsp.ko;) > net/ipv4/netfilter/modules.order
  342. (cat /dev/null; cat net/ipv4/netfilter/modules.order; echo kernel/net/ipv4/ipip.ko; echo kernel/net/ipv4/tunnel4.ko;) > net/ipv4/modules.order
  343. make -f scripts/Makefile.build obj=net/key
  344. (cat /dev/null; echo kernel/net/key/af_key.ko;) > net/key/modules.order
  345. make -f scripts/Makefile.build obj=net/llc
  346. (cat /dev/null; ) > net/llc/modules.order
  347. make -f scripts/Makefile.build obj=net/netfilter
  348. (cat /dev/null; echo kernel/net/netfilter/nf_conntrack_h323.ko; echo kernel/net/netfilter/nf_conntrack_irc.ko; echo kernel/net/netfilter/nf_conntrack_sip.ko; echo kernel/net/netfilter/nf_conntrack_rtsp.ko;) > net/netfilter/modules.order
  349. make -f scripts/Makefile.build obj=net/netlink
  350. (cat /dev/null; ) > net/netlink/modules.order
  351. make -f scripts/Makefile.build obj=net/packet
  352. (cat /dev/null; ) > net/packet/modules.order
  353. make -f scripts/Makefile.build obj=net/sched
  354. (cat /dev/null; ) > net/sched/modules.order
  355. make -f scripts/Makefile.build obj=net/sunrpc
  356. (cat /dev/null; ) > net/sunrpc/modules.order
  357. make -f scripts/Makefile.build obj=net/unix
  358. (cat /dev/null; ) > net/unix/modules.order
  359. make -f scripts/Makefile.build obj=net/wireless
  360. (cat /dev/null; ) > net/wireless/modules.order
  361. make -f scripts/Makefile.build obj=net/xfrm
  362. (cat /dev/null; ) > net/xfrm/modules.order
  363. (cat /dev/null; cat net/core/modules.order; cat net/llc/modules.order; cat net/ethernet/modules.order; cat net/802/modules.order; cat net/sched/modules.order; cat net/netlink/modules.order; cat net/netfilter/modules.order; cat net/ipv4/modules.order; cat net/xfrm/modules.order; cat net/unix/modules.order; cat net/packet/modules.order; cat net/sched/modules.order; cat net/bridge/modules.order; cat net/sunrpc/modules.order; cat net/8021q/modules.order; cat net/wireless/modules.order; cat net/key/modules.order;) > net/modules.order
  364. make -f scripts/Makefile.build obj=arch/arm/lib
  365. (cat /dev/null; ) > arch/arm/lib/modules.order
  366. make -f scripts/Makefile.build obj=lib
  367. make -f scripts/Makefile.build obj=lib/zlib_deflate
  368. (cat /dev/null; ) > lib/zlib_deflate/modules.order
  369. make -f scripts/Makefile.build obj=lib/zlib_inflate
  370. (cat /dev/null; ) > lib/zlib_inflate/modules.order
  371. (cat /dev/null; cat lib/zlib_inflate/modules.order; cat lib/zlib_deflate/modules.order; echo kernel/lib/libcrc32c.ko;) > lib/modules.order
  372. rm -f .old_version
  373. make -f scripts/Makefile.build obj=arch/arm/boot MACHINE=arch/arm/mach-pnx8181/ arch/arm/boot/zImage
  374. Kernel: arch/arm/boot/Image is ready
  375. make -f scripts/Makefile.build obj=arch/arm/boot/compressed arch/arm/boot/compressed/vmlinux
  376. Kernel: arch/arm/boot/zImage is ready
  377. awk '!x[$0]++' /home/alexander/test/payton_1.4.1.SR1_gpl/payton/src/linux/pkgs/dspg_pnx8181/linux-2.6.26.5/init/modules.order /home/alexander/test/payton_1.4.1.SR1_gpl/payton/src/linux/pkgs/dspg_pnx8181/linux-2.6.26.5/usr/modules.order /home/alexander/test/payton_1.4.1.SR1_gpl/payton/src/linux/pkgs/dspg_pnx8181/linux-2.6.26.5/arch/arm/kernel/modules.order /home/alexander/test/payton_1.4.1.SR1_gpl/payton/src/linux/pkgs/dspg_pnx8181/linux-2.6.26.5/arch/arm/mm/modules.order /home/alexander/test/payton_1.4.1.SR1_gpl/payton/src/linux/pkgs/dspg_pnx8181/linux-2.6.26.5/arch/arm/common/modules.order /home/alexander/test/payton_1.4.1.SR1_gpl/payton/src/linux/pkgs/dspg_pnx8181/linux-2.6.26.5/arch/arm/mach-pnx8181/modules.order /home/alexander/test/payton_1.4.1.SR1_gpl/payton/src/linux/pkgs/dspg_pnx8181/linux-2.6.26.5/kernel/modules.order /home/alexander/test/payton_1.4.1.SR1_gpl/payton/src/linux/pkgs/dspg_pnx8181/linux-2.6.26.5/mm/modules.order /home/alexander/test/payton_1.4.1.SR1_gpl/payton/src/linux/pkgs/dspg_pnx8181/linux-2.6.26.5/fs/modules.order /home/alexander/test/payton_1.4.1.SR1_gpl/payton/src/linux/pkgs/dspg_pnx8181/linux-2.6.26.5/ipc/modules.order /home/alexander/test/payton_1.4.1.SR1_gpl/payton/src/linux/pkgs/dspg_pnx8181/linux-2.6.26.5/security/modules.order /home/alexander/test/payton_1.4.1.SR1_gpl/payton/src/linux/pkgs/dspg_pnx8181/linux-2.6.26.5/crypto/modules.order /home/alexander/test/payton_1.4.1.SR1_gpl/payton/src/linux/pkgs/dspg_pnx8181/linux-2.6.26.5/block/modules.order /home/alexander/test/payton_1.4.1.SR1_gpl/payton/src/linux/pkgs/dspg_pnx8181/linux-2.6.26.5/drivers/modules.order /home/alexander/test/payton_1.4.1.SR1_gpl/payton/src/linux/pkgs/dspg_pnx8181/linux-2.6.26.5/sound/modules.order /home/alexander/test/payton_1.4.1.SR1_gpl/payton/src/linux/pkgs/dspg_pnx8181/linux-2.6.26.5/arch/arm/oprofile/modules.order /home/alexander/test/payton_1.4.1.SR1_gpl/payton/src/linux/pkgs/dspg_pnx8181/linux-2.6.26.5/net/modules.order /home/alexander/test/payton_1.4.1.SR1_gpl/payton/src/linux/pkgs/dspg_pnx8181/linux-2.6.26.5/arch/arm/lib/modules.order /home/alexander/test/payton_1.4.1.SR1_gpl/payton/src/linux/pkgs/dspg_pnx8181/linux-2.6.26.5/lib/modules.order > /home/alexander/test/payton_1.4.1.SR1_gpl/payton/src/linux/pkgs/dspg_pnx8181/linux-2.6.26.5/modules.order
  378. Building modules, stage 2.
  379. make -f /home/alexander/test/payton_1.4.1.SR1_gpl/payton/src/linux/pkgs/dspg_pnx8181/linux-2.6.26.5/scripts/Makefile.modpost
  380. scripts/mod/modpost -o /home/alexander/test/payton_1.4.1.SR1_gpl/payton/src/linux/pkgs/dspg_pnx8181/linux-2.6.26.5/Module.symvers -S -c -s
  381. make[4]: Leaving directory '/home/alexander/test/payton_1.4.1.SR1_gpl/payton/src/linux/pkgs/dspg_pnx8181/linux-2.6.26.5'
  382. cp arch/arm/boot/zImage ram_zimage.bin
  383. PATH=/opt/emlix/pnx8181/bin:/home/alexander/test/payton_1.4.1.SR1_gpl/payton/src/host_tools:/opt/emlix/pnx8181/bin:/opt/emlix/pnx8181/bin:/opt/emlix/e2-2.2/bin:/usr/local/bin:/usr/bin:/bin:/usr/local/games:/usr/games make uImage modules V=1 CONFIG_LOCALVERSION_AUTO=n
  384. make[4]: Entering directory '/home/alexander/test/payton_1.4.1.SR1_gpl/payton/src/linux/pkgs/dspg_pnx8181/linux-2.6.26.5'
  385. set -e; :; mkdir -p include/linux/; (echo \#define LINUX_VERSION_CODE 132634; echo '#define KERNEL_VERSION(a,b,c) (((a) << 16) + ((b) << 8) + (c))';) < /home/alexander/test/payton_1.4.1.SR1_gpl/payton/src/linux/pkgs/dspg_pnx8181/linux-2.6.26.5/Makefile > include/linux/version.h.tmp; if [ -r include/linux/version.h ] && cmp -s include/linux/version.h include/linux/version.h.tmp; then rm -f include/linux/version.h.tmp; else :; mv -f include/linux/version.h.tmp include/linux/version.h; fi
  386. make -f scripts/Makefile.build obj=arch/arm/tools include/asm-arm/mach-types.h
  387. make[5]: 'include/asm-arm/mach-types.h' is up to date.
  388. rm -f include/config/kernel.release
  389. echo 2.6.26.5 > include/config/kernel.release
  390. set -e; :; mkdir -p include/linux/; if [ `echo -n "2.6.26.5" | wc -c ` -gt 64 ]; then echo '"2.6.26.5" exceeds 64 characters' >&2; exit 1; fi; (echo \#define UTS_RELEASE \"2.6.26.5\";) < include/config/kernel.release > include/linux/utsrelease.h.tmp; if [ -r include/linux/utsrelease.h ] && cmp -s include/linux/utsrelease.h include/linux/utsrelease.h.tmp; then rm -f include/linux/utsrelease.h.tmp; else :; mv -f include/linux/utsrelease.h.tmp include/linux/utsrelease.h; fi
  391. set -e; asmlink=`readlink include/asm | cut -d '-' -f 2`; \
  392. if [ -L include/asm ]; then \
  393. if [ "$asmlink" != "arm" ]; then \
  394. echo "ERROR: the symlink include/asm points to asm-$asmlink but asm-arm was expected"; \
  395. echo " set ARCH or save .config and run 'make mrproper' to fix it"; \
  396. exit 1; \
  397. fi; \
  398. else \
  399. echo ' SYMLINK include/asm -> include/asm-arm'; \
  400. if [ ! -d include ]; then \
  401. mkdir -p include; \
  402. fi; \
  403. ln -fsn asm-arm include/asm; \
  404. fi
  405. mkdir -p .tmp_versions ; rm -f .tmp_versions/*
  406. make -f scripts/Makefile.build obj=scripts/basic
  407. (cat /dev/null; ) > scripts/basic/modules.order
  408. make -f scripts/Makefile.build obj=.
  409. (cat /dev/null; ) > modules.order
  410. mkdir -p kernel/
  411. mkdir -p arch/arm/kernel/
  412. make -f scripts/Makefile.build obj=. missing-syscalls
  413. /bin/bash scripts/checksyscalls.sh /opt/emlix/pnx8181/bin/arm-linux-gnueabi-gcc -Wp,-MD,./.missing-syscalls.d -nostdinc -isystem /opt/emlix/pnx8181/bin/../lib/gcc/arm-linux-gnueabi/4.1.2/include -D__KERNEL__ -Iinclude -include include/linux/autoconf.h -mlittle-endian -Wall -Wundef -Wstrict-prototypes -Wno-trigraphs -fno-strict-aliasing -fno-common -Werror-implicit-function-declaration -Os -fno-stack-protector -marm -fno-omit-frame-pointer -mapcs -mno-sched-prolog -mabi=aapcs-linux -mno-thumb-interwork -D__LINUX_ARM_ARCH__=5 -march=armv5te -mtune=arm9tdmi -msoft-float -Uarm -fno-omit-frame-pointer -fno-optimize-sibling-calls -march=armv5te -DCY_CHECK_DNAT_MARK_AND_DO_MASQUERADE_SUPPORT=1 -Wdeclaration-after-statement -Wno-pointer-sign -D"KBUILD_STR(s)=#s" -D"KBUILD_BASENAME=KBUILD_STR(missing_syscalls)" -D"KBUILD_MODNAME=KBUILD_STR(missing_syscalls)"
  414. <stdin>:1097:2: warning: #warning syscall fadvise64 not implemented
  415. <stdin>:1265:2: warning: #warning syscall migrate_pages not implemented
  416. <stdin>:1321:2: warning: #warning syscall pselect6 not implemented
  417. <stdin>:1325:2: warning: #warning syscall ppoll not implemented
  418. <stdin>:1365:2: warning: #warning syscall epoll_pwait not implemented
  419. make -f scripts/Makefile.build obj=scripts
  420. make -f scripts/Makefile.build obj=scripts/mod
  421. (cat /dev/null; ) > scripts/mod/modules.order
  422. (cat /dev/null; ) > scripts/modules.order
  423. make -f scripts/Makefile.build obj=init
  424. /bin/bash /home/alexander/test/payton_1.4.1.SR1_gpl/payton/src/linux/pkgs/dspg_pnx8181/linux-2.6.26.5/scripts/mkcompile_h include/linux/compile.h \
  425. "arm" "" "y" "/opt/emlix/pnx8181/bin/arm-linux-gnueabi-gcc -Wall -Wundef -Wstrict-prototypes -Wno-trigraphs -fno-strict-aliasing -fno-common -Werror-implicit-function-declaration -Os -fno-stack-protector -marm -fno-omit-frame-pointer -mapcs -mno-sched-prolog -mabi=aapcs-linux -mno-thumb-interwork -D__LINUX_ARM_ARCH__=5 -march=armv5te -mtune=arm9tdmi -msoft-float -Uarm -fno-omit-frame-pointer -fno-optimize-sibling-calls -march=armv5te -DCY_CHECK_DNAT_MARK_AND_DO_MASQUERADE_SUPPORT=1 -Wdeclaration-after-statement -Wno-pointer-sign"
  426. (cat /dev/null; ) > init/modules.order
  427. make -f scripts/Makefile.build obj=usr
  428. (cat /dev/null; ) > usr/modules.order
  429. make -f scripts/Makefile.build obj=arch/arm/kernel
  430. (cat /dev/null; ) > arch/arm/kernel/modules.order
  431. make -f scripts/Makefile.build obj=arch/arm/mm
  432. (cat /dev/null; ) > arch/arm/mm/modules.order
  433. make -f scripts/Makefile.build obj=arch/arm/common
  434. (cat /dev/null; ) > arch/arm/common/modules.order
  435. make -f scripts/Makefile.build obj=arch/arm/mach-pnx8181
  436. (cat /dev/null; ) > arch/arm/mach-pnx8181/modules.order
  437. make -f scripts/Makefile.build obj=kernel
  438. make -f scripts/Makefile.build obj=kernel/irq
  439. (cat /dev/null; ) > kernel/irq/modules.order
  440. make -f scripts/Makefile.build obj=kernel/time
  441. (cat /dev/null; ) > kernel/time/modules.order
  442. (cat /dev/null; cat kernel/time/modules.order; cat kernel/irq/modules.order;) > kernel/modules.order
  443. make -f scripts/Makefile.build obj=mm
  444. (cat /dev/null; ) > mm/modules.order
  445. make -f scripts/Makefile.build obj=fs
  446. make -f scripts/Makefile.build obj=fs/configfs
  447. (cat /dev/null; ) > fs/configfs/modules.order
  448. make -f scripts/Makefile.build obj=fs/debugfs
  449. (cat /dev/null; ) > fs/debugfs/modules.order
  450. make -f scripts/Makefile.build obj=fs/devpts
  451. (cat /dev/null; ) > fs/devpts/modules.order
  452. make -f scripts/Makefile.build obj=fs/jffs2
  453. (cat /dev/null; ) > fs/jffs2/modules.order
  454. make -f scripts/Makefile.build obj=fs/lockd
  455. (cat /dev/null; ) > fs/lockd/modules.order
  456. make -f scripts/Makefile.build obj=fs/nfs
  457. (cat /dev/null; ) > fs/nfs/modules.order
  458. make -f scripts/Makefile.build obj=fs/nfs_common
  459. (cat /dev/null; ) > fs/nfs_common/modules.order
  460. make -f scripts/Makefile.build obj=fs/nls
  461. (cat /dev/null; ) > fs/nls/modules.order
  462. make -f scripts/Makefile.build obj=fs/partitions
  463. (cat /dev/null; ) > fs/partitions/modules.order
  464. make -f scripts/Makefile.build obj=fs/proc
  465. (cat /dev/null; ) > fs/proc/modules.order
  466. make -f scripts/Makefile.build obj=fs/ramfs
  467. (cat /dev/null; ) > fs/ramfs/modules.order
  468. make -f scripts/Makefile.build obj=fs/squashfs
  469. (cat /dev/null; ) > fs/squashfs/modules.order
  470. make -f scripts/Makefile.build obj=fs/sysfs
  471. (cat /dev/null; ) > fs/sysfs/modules.order
  472. (cat /dev/null; cat fs/nfs_common/modules.order; cat fs/proc/modules.order; cat fs/partitions/modules.order; cat fs/sysfs/modules.order; cat fs/configfs/modules.order; cat fs/devpts/modules.order; cat fs/squashfs/modules.order; cat fs/ramfs/modules.order; cat fs/nfs/modules.order; cat fs/lockd/modules.order; cat fs/nls/modules.order; cat fs/jffs2/modules.order; cat fs/debugfs/modules.order;) > fs/modules.order
  473. make -f scripts/Makefile.build obj=ipc
  474. (cat /dev/null; ) > ipc/modules.order
  475. make -f scripts/Makefile.build obj=security
  476. (cat /dev/null; ) > security/modules.order
  477. make -f scripts/Makefile.build obj=crypto
  478. (cat /dev/null; echo kernel/crypto/crypto_hash.ko; echo kernel/crypto/hmac.ko; echo kernel/crypto/md4.ko; echo kernel/crypto/sha256_generic.ko; echo kernel/crypto/sha512_generic.ko; echo kernel/crypto/cbc.ko; echo kernel/crypto/pcbc.ko; echo kernel/crypto/des_generic.ko; echo kernel/crypto/blowfish.ko; echo kernel/crypto/twofish.ko; echo kernel/crypto/twofish_common.ko; echo kernel/crypto/aes_generic.ko; echo kernel/crypto/cast6.ko; echo kernel/crypto/tea.ko; echo kernel/crypto/crc32c.ko;) > crypto/modules.order
  479. make -f scripts/Makefile.build obj=block
  480. (cat /dev/null; ) > block/modules.order
  481. make -f scripts/Makefile.build obj=drivers
  482. make -f scripts/Makefile.build obj=drivers/auxdisplay
  483. (cat /dev/null; ) > drivers/auxdisplay/modules.order
  484. make -f scripts/Makefile.build obj=drivers/base
  485. make -f scripts/Makefile.build obj=drivers/base/power
  486. (cat /dev/null; ) > drivers/base/power/modules.order
  487. (cat /dev/null; cat drivers/base/power/modules.order;) > drivers/base/modules.order
  488. make -f scripts/Makefile.build obj=drivers/block
  489. (cat /dev/null; echo kernel/drivers/block/loop.ko; echo kernel/drivers/block/nbd.ko; echo kernel/drivers/block/cryptoloop.ko;) > drivers/block/modules.order
  490. make -f scripts/Makefile.build obj=drivers/cdrom
  491. (cat /dev/null; ) > drivers/cdrom/modules.order
  492. make -f scripts/Makefile.build obj=drivers/char
  493. make -f scripts/Makefile.build obj=drivers/char/hw_random
  494. (cat /dev/null; echo kernel/drivers/char/hw_random/rng-core.ko;) > drivers/char/hw_random/modules.order
  495. (cat /dev/null; cat drivers/char/hw_random/modules.order;) > drivers/char/modules.order
  496. make -f scripts/Makefile.build obj=drivers/connector
  497. (cat /dev/null; ) > drivers/connector/modules.order
  498. make -f scripts/Makefile.build obj=drivers/cordless
  499. (cat /dev/null; ) > drivers/cordless/modules.order
  500. make -f scripts/Makefile.build obj=drivers/crypto
  501. (cat /dev/null; ) > drivers/crypto/modules.order
  502. make -f scripts/Makefile.build obj=drivers/firmware
  503. (cat /dev/null; ) > drivers/firmware/modules.order
  504. make -f scripts/Makefile.build obj=drivers/hid
  505. (cat /dev/null; ) > drivers/hid/modules.order
  506. make -f scripts/Makefile.build obj=drivers/i2c
  507. make -f scripts/Makefile.build obj=drivers/i2c/algos
  508. (cat /dev/null; ) > drivers/i2c/algos/modules.order
  509. make -f scripts/Makefile.build obj=drivers/i2c/busses
  510. (cat /dev/null; ) > drivers/i2c/busses/modules.order
  511. make -f scripts/Makefile.build obj=drivers/i2c/chips
  512. (cat /dev/null; ) > drivers/i2c/chips/modules.order
  513. (cat /dev/null; cat drivers/i2c/busses/modules.order; cat drivers/i2c/chips/modules.order; cat drivers/i2c/algos/modules.order;) > drivers/i2c/modules.order
  514. make -f scripts/Makefile.build obj=drivers/ieee1394
  515. (cat /dev/null; ) > drivers/ieee1394/modules.order
  516. make -f scripts/Makefile.build obj=drivers/input
  517. (cat /dev/null; ) > drivers/input/modules.order
  518. make -f scripts/Makefile.build obj=drivers/leds
  519. (cat /dev/null; ) > drivers/leds/modules.order
  520. make -f scripts/Makefile.build obj=drivers/lguest
  521. (cat /dev/null; ) > drivers/lguest/modules.order
  522. make -f scripts/Makefile.build obj=drivers/macintosh
  523. (cat /dev/null; ) > drivers/macintosh/modules.order
  524. make -f scripts/Makefile.build obj=drivers/media
  525. make -f scripts/Makefile.build obj=drivers/media/common
  526. make -f scripts/Makefile.build obj=drivers/media/common/tuners
  527. (cat /dev/null; ) > drivers/media/common/tuners/modules.order
  528. (cat /dev/null; cat drivers/media/common/tuners/modules.order;) > drivers/media/common/modules.order
  529. make -f scripts/Makefile.build obj=drivers/media/video
  530. (cat /dev/null; ) > drivers/media/video/modules.order
  531. (cat /dev/null; cat drivers/media/common/modules.order; cat drivers/media/video/modules.order;) > drivers/media/modules.order
  532. make -f scripts/Makefile.build obj=drivers/mfd
  533. (cat /dev/null; ) > drivers/mfd/modules.order
  534. make -f scripts/Makefile.build obj=drivers/misc
  535. (cat /dev/null; ) > drivers/misc/modules.order
  536. make -f scripts/Makefile.build obj=drivers/mtd
  537. make -f scripts/Makefile.build obj=drivers/mtd/chips
  538. (cat /dev/null; ) > drivers/mtd/chips/modules.order
  539. make -f scripts/Makefile.build obj=drivers/mtd/devices
  540. (cat /dev/null; ) > drivers/mtd/devices/modules.order
  541. make -f scripts/Makefile.build obj=drivers/mtd/maps
  542. (cat /dev/null; ) > drivers/mtd/maps/modules.order
  543. make -f scripts/Makefile.build obj=drivers/mtd/nand
  544. (cat /dev/null; ) > drivers/mtd/nand/modules.order
  545. make -f scripts/Makefile.build obj=drivers/mtd/onenand
  546. (cat /dev/null; ) > drivers/mtd/onenand/modules.order
  547. (cat /dev/null; cat drivers/mtd/chips/modules.order; cat drivers/mtd/maps/modules.order; cat drivers/mtd/devices/modules.order; cat drivers/mtd/nand/modules.order; cat drivers/mtd/onenand/modules.order;) > drivers/mtd/modules.order
  548. make -f scripts/Makefile.build obj=drivers/net
  549. make -f scripts/Makefile.build obj=drivers/net/arm
  550. (cat /dev/null; ) > drivers/net/arm/modules.order
  551. make -f scripts/Makefile.build obj=drivers/net/ip3912
  552. (cat /dev/null; ) > drivers/net/ip3912/modules.order
  553. make -f scripts/Makefile.build obj=drivers/net/phy
  554. (cat /dev/null; ) > drivers/net/phy/modules.order
  555. make -f scripts/Makefile.build obj=drivers/net/wireless
  556. (cat /dev/null; ) > drivers/net/wireless/modules.order
  557. (cat /dev/null; cat drivers/net/phy/modules.order; cat drivers/net/arm/modules.order; cat drivers/net/wireless/modules.order; cat drivers/net/ip3912/modules.order;) > drivers/net/modules.order
  558. make -f scripts/Makefile.build obj=drivers/rtc
  559. (cat /dev/null; ) > drivers/rtc/modules.order
  560. make -f scripts/Makefile.build obj=drivers/serial
  561. (cat /dev/null; ) > drivers/serial/modules.order
  562. make -f scripts/Makefile.build obj=drivers/slic
  563. (cat /dev/null; ) > drivers/slic/modules.order
  564. make -f scripts/Makefile.build obj=drivers/spi
  565. (cat /dev/null; ) > drivers/spi/modules.order
  566. make -f scripts/Makefile.build obj=drivers/video
  567. make -f scripts/Makefile.build obj=drivers/video/backlight
  568. (cat /dev/null; ) > drivers/video/backlight/modules.order
  569. make -f scripts/Makefile.build obj=drivers/video/console
  570. (cat /dev/null; ) > drivers/video/console/modules.order
  571. make -f scripts/Makefile.build obj=drivers/video/display
  572. (cat /dev/null; ) > drivers/video/display/modules.order
  573. (cat /dev/null; cat drivers/video/console/modules.order; cat drivers/video/backlight/modules.order; cat drivers/video/display/modules.order;) > drivers/video/modules.order
  574. make -f scripts/Makefile.build obj=drivers/watchdog
  575. (cat /dev/null; ) > drivers/watchdog/modules.order
  576. (cat /dev/null; cat drivers/video/modules.order; cat drivers/char/modules.order; cat drivers/connector/modules.order; cat drivers/serial/modules.order; cat drivers/base/modules.order; cat drivers/block/modules.order; cat drivers/misc/modules.order; cat drivers/mfd/modules.order; cat drivers/net/modules.order; cat drivers/media/modules.order; cat drivers/macintosh/modules.order; cat drivers/ieee1394/modules.order; cat drivers/cdrom/modules.order; cat drivers/auxdisplay/modules.order; cat drivers/mtd/modules.order; cat drivers/spi/modules.order; cat drivers/input/modules.order; cat drivers/rtc/modules.order; cat drivers/i2c/modules.order; cat drivers/watchdog/modules.order; cat drivers/lguest/modules.order; cat drivers/leds/modules.order; cat drivers/firmware/modules.order; cat drivers/crypto/modules.order; cat drivers/hid/modules.order; cat drivers/cordless/modules.order; cat drivers/slic/modules.order;) > drivers/modules.order
  577. make -f scripts/Makefile.build obj=sound
  578. (cat /dev/null; ) > sound/modules.order
  579. make -f scripts/Makefile.build obj=arch/arm/oprofile
  580. (cat /dev/null; echo kernel/arch/arm/oprofile/oprofile.ko;) > arch/arm/oprofile/modules.order
  581. make -f scripts/Makefile.build obj=net
  582. make -f scripts/Makefile.build obj=net/802
  583. (cat /dev/null; ) > net/802/modules.order
  584. make -f scripts/Makefile.build obj=net/8021q
  585. (cat /dev/null; ) > net/8021q/modules.order
  586. make -f scripts/Makefile.build obj=net/bridge
  587. make -f scripts/Makefile.build obj=net/bridge/netfilter
  588. (cat /dev/null; ) > net/bridge/netfilter/modules.order
  589. (cat /dev/null; cat net/bridge/netfilter/modules.order;) > net/bridge/modules.order
  590. make -f scripts/Makefile.build obj=net/core
  591. (cat /dev/null; ) > net/core/modules.order
  592. make -f scripts/Makefile.build obj=net/ethernet
  593. (cat /dev/null; ) > net/ethernet/modules.order
  594. make -f scripts/Makefile.build obj=net/ipv4
  595. make -f scripts/Makefile.build obj=net/ipv4/netfilter
  596. (cat /dev/null; echo kernel/net/ipv4/netfilter/nf_nat_h323.ko; echo kernel/net/ipv4/netfilter/nf_nat_irc.ko; echo kernel/net/ipv4/netfilter/nf_nat_sip.ko; echo kernel/net/ipv4/netfilter/nf_nat_rtsp.ko;) > net/ipv4/netfilter/modules.order
  597. (cat /dev/null; cat net/ipv4/netfilter/modules.order; echo kernel/net/ipv4/ipip.ko; echo kernel/net/ipv4/tunnel4.ko;) > net/ipv4/modules.order
  598. make -f scripts/Makefile.build obj=net/key
  599. (cat /dev/null; echo kernel/net/key/af_key.ko;) > net/key/modules.order
  600. make -f scripts/Makefile.build obj=net/llc
  601. (cat /dev/null; ) > net/llc/modules.order
  602. make -f scripts/Makefile.build obj=net/netfilter
  603. (cat /dev/null; echo kernel/net/netfilter/nf_conntrack_h323.ko; echo kernel/net/netfilter/nf_conntrack_irc.ko; echo kernel/net/netfilter/nf_conntrack_sip.ko; echo kernel/net/netfilter/nf_conntrack_rtsp.ko;) > net/netfilter/modules.order
  604. make -f scripts/Makefile.build obj=net/netlink
  605. (cat /dev/null; ) > net/netlink/modules.order
  606. make -f scripts/Makefile.build obj=net/packet
  607. (cat /dev/null; ) > net/packet/modules.order
  608. make -f scripts/Makefile.build obj=net/sched
  609. (cat /dev/null; ) > net/sched/modules.order
  610. make -f scripts/Makefile.build obj=net/sunrpc
  611. (cat /dev/null; ) > net/sunrpc/modules.order
  612. make -f scripts/Makefile.build obj=net/unix
  613. (cat /dev/null; ) > net/unix/modules.order
  614. make -f scripts/Makefile.build obj=net/wireless
  615. (cat /dev/null; ) > net/wireless/modules.order
  616. make -f scripts/Makefile.build obj=net/xfrm
  617. (cat /dev/null; ) > net/xfrm/modules.order
  618. (cat /dev/null; cat net/core/modules.order; cat net/llc/modules.order; cat net/ethernet/modules.order; cat net/802/modules.order; cat net/sched/modules.order; cat net/netlink/modules.order; cat net/netfilter/modules.order; cat net/ipv4/modules.order; cat net/xfrm/modules.order; cat net/unix/modules.order; cat net/packet/modules.order; cat net/sched/modules.order; cat net/bridge/modules.order; cat net/sunrpc/modules.order; cat net/8021q/modules.order; cat net/wireless/modules.order; cat net/key/modules.order;) > net/modules.order
  619. make -f scripts/Makefile.build obj=arch/arm/lib
  620. (cat /dev/null; ) > arch/arm/lib/modules.order
  621. make -f scripts/Makefile.build obj=lib
  622. make -f scripts/Makefile.build obj=lib/zlib_deflate
  623. (cat /dev/null; ) > lib/zlib_deflate/modules.order
  624. make -f scripts/Makefile.build obj=lib/zlib_inflate
  625. (cat /dev/null; ) > lib/zlib_inflate/modules.order
  626. (cat /dev/null; cat lib/zlib_inflate/modules.order; cat lib/zlib_deflate/modules.order; echo kernel/lib/libcrc32c.ko;) > lib/modules.order
  627. rm -f .old_version
  628. make -f scripts/Makefile.build obj=arch/arm/boot MACHINE=arch/arm/mach-pnx8181/ arch/arm/boot/uImage
  629. Kernel: arch/arm/boot/Image is ready
  630. make -f scripts/Makefile.build obj=arch/arm/boot/compressed arch/arm/boot/compressed/vmlinux
  631. Kernel: arch/arm/boot/zImage is ready
  632. Image arch/arm/boot/uImage is ready
  633. awk '!x[$0]++' /home/alexander/test/payton_1.4.1.SR1_gpl/payton/src/linux/pkgs/dspg_pnx8181/linux-2.6.26.5/init/modules.order /home/alexander/test/payton_1.4.1.SR1_gpl/payton/src/linux/pkgs/dspg_pnx8181/linux-2.6.26.5/usr/modules.order /home/alexander/test/payton_1.4.1.SR1_gpl/payton/src/linux/pkgs/dspg_pnx8181/linux-2.6.26.5/arch/arm/kernel/modules.order /home/alexander/test/payton_1.4.1.SR1_gpl/payton/src/linux/pkgs/dspg_pnx8181/linux-2.6.26.5/arch/arm/mm/modules.order /home/alexander/test/payton_1.4.1.SR1_gpl/payton/src/linux/pkgs/dspg_pnx8181/linux-2.6.26.5/arch/arm/common/modules.order /home/alexander/test/payton_1.4.1.SR1_gpl/payton/src/linux/pkgs/dspg_pnx8181/linux-2.6.26.5/arch/arm/mach-pnx8181/modules.order /home/alexander/test/payton_1.4.1.SR1_gpl/payton/src/linux/pkgs/dspg_pnx8181/linux-2.6.26.5/kernel/modules.order /home/alexander/test/payton_1.4.1.SR1_gpl/payton/src/linux/pkgs/dspg_pnx8181/linux-2.6.26.5/mm/modules.order /home/alexander/test/payton_1.4.1.SR1_gpl/payton/src/linux/pkgs/dspg_pnx8181/linux-2.6.26.5/fs/modules.order /home/alexander/test/payton_1.4.1.SR1_gpl/payton/src/linux/pkgs/dspg_pnx8181/linux-2.6.26.5/ipc/modules.order /home/alexander/test/payton_1.4.1.SR1_gpl/payton/src/linux/pkgs/dspg_pnx8181/linux-2.6.26.5/security/modules.order /home/alexander/test/payton_1.4.1.SR1_gpl/payton/src/linux/pkgs/dspg_pnx8181/linux-2.6.26.5/crypto/modules.order /home/alexander/test/payton_1.4.1.SR1_gpl/payton/src/linux/pkgs/dspg_pnx8181/linux-2.6.26.5/block/modules.order /home/alexander/test/payton_1.4.1.SR1_gpl/payton/src/linux/pkgs/dspg_pnx8181/linux-2.6.26.5/drivers/modules.order /home/alexander/test/payton_1.4.1.SR1_gpl/payton/src/linux/pkgs/dspg_pnx8181/linux-2.6.26.5/sound/modules.order /home/alexander/test/payton_1.4.1.SR1_gpl/payton/src/linux/pkgs/dspg_pnx8181/linux-2.6.26.5/arch/arm/oprofile/modules.order /home/alexander/test/payton_1.4.1.SR1_gpl/payton/src/linux/pkgs/dspg_pnx8181/linux-2.6.26.5/net/modules.order /home/alexander/test/payton_1.4.1.SR1_gpl/payton/src/linux/pkgs/dspg_pnx8181/linux-2.6.26.5/arch/arm/lib/modules.order /home/alexander/test/payton_1.4.1.SR1_gpl/payton/src/linux/pkgs/dspg_pnx8181/linux-2.6.26.5/lib/modules.order > /home/alexander/test/payton_1.4.1.SR1_gpl/payton/src/linux/pkgs/dspg_pnx8181/linux-2.6.26.5/modules.order
  634. Building modules, stage 2.
  635. make -f /home/alexander/test/payton_1.4.1.SR1_gpl/payton/src/linux/pkgs/dspg_pnx8181/linux-2.6.26.5/scripts/Makefile.modpost
  636. scripts/mod/modpost -o /home/alexander/test/payton_1.4.1.SR1_gpl/payton/src/linux/pkgs/dspg_pnx8181/linux-2.6.26.5/Module.symvers -S -c -s
  637. make[4]: Leaving directory '/home/alexander/test/payton_1.4.1.SR1_gpl/payton/src/linux/pkgs/dspg_pnx8181/linux-2.6.26.5'
  638. make[3]: Leaving directory '/home/alexander/test/payton_1.4.1.SR1_gpl/payton/src/linux/pkgs/dspg_pnx8181/linux-2.6.26.5'
  639. make[2]: Leaving directory '/home/alexander/test/payton_1.4.1.SR1_gpl/payton/src/linux'
  640. if [ -f open_source/Makefile.cyt ]; then \
  641. make -C open_source -f Makefile.cyt; \
  642. else \
  643. make -C open_source; \
  644. fi
  645. make[2]: Entering directory '/home/alexander/test/payton_1.4.1.SR1_gpl/payton/src/router/open_source'
  646. Makefile:60: warning: overriding recipe for target '_subdir_installu-boot'
  647. /home/alexander/test/payton_1.4.1.SR1_gpl/payton/src/Rules.mk:82: warning: ignoring old recipe for target '_subdir_installu-boot'
  648. Makefile:60: warning: overriding recipe for target '_subdir_installu-boot_env'
  649. /home/alexander/test/payton_1.4.1.SR1_gpl/payton/src/Rules.mk:82: warning: ignoring old recipe for target '_subdir_installu-boot_env'
  650. Makefile:60: warning: overriding recipe for target '_subdir_installopenssl'
  651. /home/alexander/test/payton_1.4.1.SR1_gpl/payton/src/Rules.mk:82: warning: ignoring old recipe for target '_subdir_installopenssl'
  652. Makefile:60: warning: overriding recipe for target '_subdir_installcurl'
  653. /home/alexander/test/payton_1.4.1.SR1_gpl/payton/src/Rules.mk:82: warning: ignoring old recipe for target '_subdir_installcurl'
  654. Makefile:60: warning: overriding recipe for target '_subdir_installbusybox'
  655. /home/alexander/test/payton_1.4.1.SR1_gpl/payton/src/Rules.mk:82: warning: ignoring old recipe for target '_subdir_installbusybox'
  656. Makefile:60: warning: overriding recipe for target '_subdir_installbusybox-modify'
  657. /home/alexander/test/payton_1.4.1.SR1_gpl/payton/src/Rules.mk:82: warning: ignoring old recipe for target '_subdir_installbusybox-modify'
  658. Makefile:60: warning: overriding recipe for target '_subdir_installnet-tools'
  659. /home/alexander/test/payton_1.4.1.SR1_gpl/payton/src/Rules.mk:82: warning: ignoring old recipe for target '_subdir_installnet-tools'
  660. Makefile:60: warning: overriding recipe for target '_subdir_installdnsmasq'
  661. /home/alexander/test/payton_1.4.1.SR1_gpl/payton/src/Rules.mk:82: warning: ignoring old recipe for target '_subdir_installdnsmasq'
  662. Makefile:60: warning: overriding recipe for target '_subdir_installiptables'
  663. /home/alexander/test/payton_1.4.1.SR1_gpl/payton/src/Rules.mk:82: warning: ignoring old recipe for target '_subdir_installiptables'
  664. Makefile:60: warning: overriding recipe for target '_subdir_installntpclient'
  665. /home/alexander/test/payton_1.4.1.SR1_gpl/payton/src/Rules.mk:82: warning: ignoring old recipe for target '_subdir_installntpclient'
  666. Makefile:60: warning: overriding recipe for target '_subdir_installudhcpd'
  667. /home/alexander/test/payton_1.4.1.SR1_gpl/payton/src/Rules.mk:82: warning: ignoring old recipe for target '_subdir_installudhcpd'
  668. Makefile:60: warning: overriding recipe for target '_subdir_installpppd'
  669. /home/alexander/test/payton_1.4.1.SR1_gpl/payton/src/Rules.mk:82: warning: ignoring old recipe for target '_subdir_installpppd'
  670. Makefile:60: warning: overriding recipe for target '_subdir_installtraceroute'
  671. /home/alexander/test/payton_1.4.1.SR1_gpl/payton/src/Rules.mk:82: warning: ignoring old recipe for target '_subdir_installtraceroute'
  672. Makefile:60: warning: overriding recipe for target '_subdir_installiproute2'
  673. /home/alexander/test/payton_1.4.1.SR1_gpl/payton/src/Rules.mk:82: warning: ignoring old recipe for target '_subdir_installiproute2'
  674. Makefile:60: warning: overriding recipe for target '_subdir_installbridge'
  675. /home/alexander/test/payton_1.4.1.SR1_gpl/payton/src/Rules.mk:82: warning: ignoring old recipe for target '_subdir_installbridge'
  676. Makefile:60: warning: overriding recipe for target '_subdir_installmtd-utils'
  677. /home/alexander/test/payton_1.4.1.SR1_gpl/payton/src/Rules.mk:82: warning: ignoring old recipe for target '_subdir_installmtd-utils'
  678. Makefile:60: warning: overriding recipe for target '_subdir_installc-ares'
  679. /home/alexander/test/payton_1.4.1.SR1_gpl/payton/src/Rules.mk:82: warning: ignoring old recipe for target '_subdir_installc-ares'
  680. Makefile:60: warning: overriding recipe for target '_subdir_installnet-snmp'
  681. /home/alexander/test/payton_1.4.1.SR1_gpl/payton/src/Rules.mk:82: warning: ignoring old recipe for target '_subdir_installnet-snmp'
  682. Makefile:60: warning: overriding recipe for target '_subdir_installebtables'
  683. /home/alexander/test/payton_1.4.1.SR1_gpl/payton/src/Rules.mk:82: warning: ignoring old recipe for target '_subdir_installebtables'
  684. Makefile:60: warning: overriding recipe for target '_subdir_installexpat'
  685. /home/alexander/test/payton_1.4.1.SR1_gpl/payton/src/Rules.mk:82: warning: ignoring old recipe for target '_subdir_installexpat'
  686. Makefile:60: warning: overriding recipe for target '_subdir_installcy_linux_driver'
  687. /home/alexander/test/payton_1.4.1.SR1_gpl/payton/src/Rules.mk:82: warning: ignoring old recipe for target '_subdir_installcy_linux_driver'
  688. Makefile:60: warning: overriding recipe for target '_subdir_installgsoap'
  689. /home/alexander/test/payton_1.4.1.SR1_gpl/payton/src/Rules.mk:82: warning: ignoring old recipe for target '_subdir_installgsoap'
  690. Makefile:60: warning: overriding recipe for target '_subdir_installsyslog-ng'
  691. /home/alexander/test/payton_1.4.1.SR1_gpl/payton/src/Rules.mk:82: warning: ignoring old recipe for target '_subdir_installsyslog-ng'
  692. Makefile:60: warning: overriding recipe for target '_subdir_installstunnel'
  693. /home/alexander/test/payton_1.4.1.SR1_gpl/payton/src/Rules.mk:82: warning: ignoring old recipe for target '_subdir_installstunnel'
  694. Makefile:60: warning: overriding recipe for target '_subdir_installmDNSResponder'
  695. /home/alexander/test/payton_1.4.1.SR1_gpl/payton/src/Rules.mk:82: warning: ignoring old recipe for target '_subdir_installmDNSResponder'
  696. Makefile:60: warning: overriding recipe for target '_subdir_installinclude'
  697. /home/alexander/test/payton_1.4.1.SR1_gpl/payton/src/Rules.mk:82: warning: ignoring old recipe for target '_subdir_installinclude'
  698. echo "PWD = /home/alexander/test/payton_1.4.1.SR1_gpl/payton/src/router"
  699. PWD = /home/alexander/test/payton_1.4.1.SR1_gpl/payton/src/router
  700. echo "NOW = open_source"
  701. NOW = open_source
  702. if [ -f u-boot/Makefile.cyt ]; then \
  703. make -C u-boot -f Makefile.cyt; \
  704. else \
  705. make -C u-boot; \
  706. fi
  707. make[3]: Entering directory '/home/alexander/test/payton_1.4.1.SR1_gpl/payton/src/router/open_source/pkgs/u-boot-1.3.3-pnx8181'
  708. rm -rf *.bin
  709. rm -rf *.img
  710. make
  711. make[4]: Entering directory '/home/alexander/test/payton_1.4.1.SR1_gpl/payton/src/router/open_source/pkgs/u-boot-1.3.3-pnx8181'
  712. for dir in tools examples api_examples ; do make -C $dir _depend ; done
  713. make[5]: Entering directory '/home/alexander/test/payton_1.4.1.SR1_gpl/payton/src/router/open_source/pkgs/u-boot-1.3.3-pnx8181/tools'
  714. ln -s ../lib_generic/crc32.c crc32.c
  715. make[5]: Nothing to be done for '_depend'.
  716. make[5]: Leaving directory '/home/alexander/test/payton_1.4.1.SR1_gpl/payton/src/router/open_source/pkgs/u-boot-1.3.3-pnx8181/tools'
  717. make[5]: Entering directory '/home/alexander/test/payton_1.4.1.SR1_gpl/payton/src/router/open_source/pkgs/u-boot-1.3.3-pnx8181/examples'
  718. make[5]: Nothing to be done for '_depend'.
  719. make[5]: Leaving directory '/home/alexander/test/payton_1.4.1.SR1_gpl/payton/src/router/open_source/pkgs/u-boot-1.3.3-pnx8181/examples'
  720. make[5]: Entering directory '/home/alexander/test/payton_1.4.1.SR1_gpl/payton/src/router/open_source/pkgs/u-boot-1.3.3-pnx8181/api_examples'
  721. make[5]: Nothing to be done for '_depend'.
  722. make[5]: Leaving directory '/home/alexander/test/payton_1.4.1.SR1_gpl/payton/src/router/open_source/pkgs/u-boot-1.3.3-pnx8181/api_examples'
  723. make -C tools all
  724. make[5]: Entering directory '/home/alexander/test/payton_1.4.1.SR1_gpl/payton/src/router/open_source/pkgs/u-boot-1.3.3-pnx8181/tools'
  725. ln -s ../lib_generic/crc32.c crc32.c
  726. make[5]: Leaving directory '/home/alexander/test/payton_1.4.1.SR1_gpl/payton/src/router/open_source/pkgs/u-boot-1.3.3-pnx8181/tools'
  727. make -C examples all
  728. make[5]: Entering directory '/home/alexander/test/payton_1.4.1.SR1_gpl/payton/src/router/open_source/pkgs/u-boot-1.3.3-pnx8181/examples'
  729. make[5]: Nothing to be done for 'all'.
  730. make[5]: Leaving directory '/home/alexander/test/payton_1.4.1.SR1_gpl/payton/src/router/open_source/pkgs/u-boot-1.3.3-pnx8181/examples'
  731. make -C api_examples all
  732. make[5]: Entering directory '/home/alexander/test/payton_1.4.1.SR1_gpl/payton/src/router/open_source/pkgs/u-boot-1.3.3-pnx8181/api_examples'
  733. /opt/emlix/pnx8181/bin/arm-linux-gnueabi-ar crv libglue.a
  734. make[5]: Leaving directory '/home/alexander/test/payton_1.4.1.SR1_gpl/payton/src/router/open_source/pkgs/u-boot-1.3.3-pnx8181/api_examples'
  735. make -C cpu/arm926ejs start.o
  736. make[5]: Entering directory '/home/alexander/test/payton_1.4.1.SR1_gpl/payton/src/router/open_source/pkgs/u-boot-1.3.3-pnx8181/cpu/arm926ejs'
  737. make[5]: 'start.o' is up to date.
  738. make[5]: Leaving directory '/home/alexander/test/payton_1.4.1.SR1_gpl/payton/src/router/open_source/pkgs/u-boot-1.3.3-pnx8181/cpu/arm926ejs'
  739. make -C lib_generic/
  740. make[5]: Entering directory '/home/alexander/test/payton_1.4.1.SR1_gpl/payton/src/router/open_source/pkgs/u-boot-1.3.3-pnx8181/lib_generic'
  741. make[5]: 'libgeneric.a' is up to date.
  742. make[5]: Leaving directory '/home/alexander/test/payton_1.4.1.SR1_gpl/payton/src/router/open_source/pkgs/u-boot-1.3.3-pnx8181/lib_generic'
  743. make -C lib_generic/lzma/
  744. make[5]: Entering directory '/home/alexander/test/payton_1.4.1.SR1_gpl/payton/src/router/open_source/pkgs/u-boot-1.3.3-pnx8181/lib_generic/lzma'
  745. make[5]: 'liblzma.a' is up to date.
  746. make[5]: Leaving directory '/home/alexander/test/payton_1.4.1.SR1_gpl/payton/src/router/open_source/pkgs/u-boot-1.3.3-pnx8181/lib_generic/lzma'
  747. make -C cpu/arm926ejs/
  748. make[5]: Entering directory '/home/alexander/test/payton_1.4.1.SR1_gpl/payton/src/router/open_source/pkgs/u-boot-1.3.3-pnx8181/cpu/arm926ejs'
  749. make[5]: Nothing to be done for 'all'.
  750. make[5]: Leaving directory '/home/alexander/test/payton_1.4.1.SR1_gpl/payton/src/router/open_source/pkgs/u-boot-1.3.3-pnx8181/cpu/arm926ejs'
  751. make -C cpu/arm926ejs/pnx8181/
  752. make[5]: Entering directory '/home/alexander/test/payton_1.4.1.SR1_gpl/payton/src/router/open_source/pkgs/u-boot-1.3.3-pnx8181/cpu/arm926ejs/pnx8181'
  753. make[5]: Nothing to be done for 'all'.
  754. make[5]: Leaving directory '/home/alexander/test/payton_1.4.1.SR1_gpl/payton/src/router/open_source/pkgs/u-boot-1.3.3-pnx8181/cpu/arm926ejs/pnx8181'
  755. make -C lib_arm/
  756. make[5]: Entering directory '/home/alexander/test/payton_1.4.1.SR1_gpl/payton/src/router/open_source/pkgs/u-boot-1.3.3-pnx8181/lib_arm'
  757. /opt/emlix/pnx8181/bin/arm-linux-gnueabi-gcc -g -Os -fno-strict-aliasing -fno-common -ffixed-r8 -msoft-float -D__KERNEL__ -DTEXT_BASE=0x20780000 -I/home/alexander/test/payton_1.4.1.SR1_gpl/payton/src/router/open_source/pkgs/u-boot-1.3.3-pnx8181/include -fno-builtin -ffreestanding -nostdinc -isystem /opt/emlix/pnx8181/bin/../lib/gcc/arm-linux-gnueabi/4.1.2/include -pipe -DCONFIG_ARM -D__ARM__ -march=armv5te -mabi=apcs-gnu -mno-thumb-interwork -fPIC -fPIE -fno-jump-tables -Wall -Wstrict-prototypes -fno-stack-protector -c -o board.o board.c
  758. board.c: In function 'start_armboot':
  759. board.c:439: warning: implicit declaration of function 'board_model_get'
  760. /opt/emlix/pnx8181/bin/arm-linux-gnueabi-ar crv libarm.a _ashldi3.o _ashrdi3.o _divsi3.o _modsi3.o _udivsi3.o _umodsi3.o board.o bootm.o cache.o div0.o interrupts.o
  761. r - _ashldi3.o
  762. r - _ashrdi3.o
  763. r - _divsi3.o
  764. r - _modsi3.o
  765. r - _udivsi3.o
  766. r - _umodsi3.o
  767. r - board.o
  768. r - bootm.o
  769. r - cache.o
  770. r - div0.o
  771. r - interrupts.o
  772. make[5]: Leaving directory '/home/alexander/test/payton_1.4.1.SR1_gpl/payton/src/router/open_source/pkgs/u-boot-1.3.3-pnx8181/lib_arm'
  773. make -C fs/cramfs/
  774. make[5]: Entering directory '/home/alexander/test/payton_1.4.1.SR1_gpl/payton/src/router/open_source/pkgs/u-boot-1.3.3-pnx8181/fs/cramfs'
  775. /opt/emlix/pnx8181/bin/arm-linux-gnueabi-ar crv libcramfs.a
  776. make[5]: Leaving directory '/home/alexander/test/payton_1.4.1.SR1_gpl/payton/src/router/open_source/pkgs/u-boot-1.3.3-pnx8181/fs/cramfs'
  777. make -C fs/fat/
  778. make[5]: Entering directory '/home/alexander/test/payton_1.4.1.SR1_gpl/payton/src/router/open_source/pkgs/u-boot-1.3.3-pnx8181/fs/fat'
  779. /opt/emlix/pnx8181/bin/arm-linux-gnueabi-ar crv libfat.a
  780. make[5]: Leaving directory '/home/alexander/test/payton_1.4.1.SR1_gpl/payton/src/router/open_source/pkgs/u-boot-1.3.3-pnx8181/fs/fat'
  781. make -C fs/fdos/
  782. make[5]: Entering directory '/home/alexander/test/payton_1.4.1.SR1_gpl/payton/src/router/open_source/pkgs/u-boot-1.3.3-pnx8181/fs/fdos'
  783. /opt/emlix/pnx8181/bin/arm-linux-gnueabi-ar crv libfdos.a
  784. make[5]: Leaving directory '/home/alexander/test/payton_1.4.1.SR1_gpl/payton/src/router/open_source/pkgs/u-boot-1.3.3-pnx8181/fs/fdos'
  785. make -C fs/jffs2/
  786. make[5]: Entering directory '/home/alexander/test/payton_1.4.1.SR1_gpl/payton/src/router/open_source/pkgs/u-boot-1.3.3-pnx8181/fs/jffs2'
  787. make[5]: Nothing to be done for 'all'.
  788. make[5]: Leaving directory '/home/alexander/test/payton_1.4.1.SR1_gpl/payton/src/router/open_source/pkgs/u-boot-1.3.3-pnx8181/fs/jffs2'
  789. make -C fs/reiserfs/
  790. make[5]: Entering directory '/home/alexander/test/payton_1.4.1.SR1_gpl/payton/src/router/open_source/pkgs/u-boot-1.3.3-pnx8181/fs/reiserfs'
  791. /opt/emlix/pnx8181/bin/arm-linux-gnueabi-ar crv libreiserfs.a
  792. make[5]: Leaving directory '/home/alexander/test/payton_1.4.1.SR1_gpl/payton/src/router/open_source/pkgs/u-boot-1.3.3-pnx8181/fs/reiserfs'
  793. make -C fs/ext2/
  794. make[5]: Entering directory '/home/alexander/test/payton_1.4.1.SR1_gpl/payton/src/router/open_source/pkgs/u-boot-1.3.3-pnx8181/fs/ext2'
  795. /opt/emlix/pnx8181/bin/arm-linux-gnueabi-ar crv libext2fs.a
  796. make[5]: Leaving directory '/home/alexander/test/payton_1.4.1.SR1_gpl/payton/src/router/open_source/pkgs/u-boot-1.3.3-pnx8181/fs/ext2'
  797. make -C fs/yaffs2/
  798. make[5]: Entering directory '/home/alexander/test/payton_1.4.1.SR1_gpl/payton/src/router/open_source/pkgs/u-boot-1.3.3-pnx8181/fs/yaffs2'
  799. /opt/emlix/pnx8181/bin/arm-linux-gnueabi-ar crv libyaffs2.a
  800. make[5]: Leaving directory '/home/alexander/test/payton_1.4.1.SR1_gpl/payton/src/router/open_source/pkgs/u-boot-1.3.3-pnx8181/fs/yaffs2'
  801. make -C net/
  802. make[5]: Entering directory '/home/alexander/test/payton_1.4.1.SR1_gpl/payton/src/router/open_source/pkgs/u-boot-1.3.3-pnx8181/net'
  803. make[5]: Nothing to be done for 'all'.
  804. make[5]: Leaving directory '/home/alexander/test/payton_1.4.1.SR1_gpl/payton/src/router/open_source/pkgs/u-boot-1.3.3-pnx8181/net'
  805. make -C disk/
  806. make[5]: Entering directory '/home/alexander/test/payton_1.4.1.SR1_gpl/payton/src/router/open_source/pkgs/u-boot-1.3.3-pnx8181/disk'
  807. make[5]: Nothing to be done for 'all'.
  808. make[5]: Leaving directory '/home/alexander/test/payton_1.4.1.SR1_gpl/payton/src/router/open_source/pkgs/u-boot-1.3.3-pnx8181/disk'
  809. make -C drivers/bios_emulator/
  810. make[5]: Entering directory '/home/alexander/test/payton_1.4.1.SR1_gpl/payton/src/router/open_source/pkgs/u-boot-1.3.3-pnx8181/drivers/bios_emulator'
  811. /opt/emlix/pnx8181/bin/arm-linux-gnueabi-ar crv libatibiosemu.a
  812. make[5]: Leaving directory '/home/alexander/test/payton_1.4.1.SR1_gpl/payton/src/router/open_source/pkgs/u-boot-1.3.3-pnx8181/drivers/bios_emulator'
  813. make -C drivers/block/
  814. make[5]: Entering directory '/home/alexander/test/payton_1.4.1.SR1_gpl/payton/src/router/open_source/pkgs/u-boot-1.3.3-pnx8181/drivers/block'
  815. /opt/emlix/pnx8181/bin/arm-linux-gnueabi-ar crv libblock.a
  816. make[5]: Leaving directory '/home/alexander/test/payton_1.4.1.SR1_gpl/payton/src/router/open_source/pkgs/u-boot-1.3.3-pnx8181/drivers/block'
  817. make -C drivers/dma/
  818. make[5]: Entering directory '/home/alexander/test/payton_1.4.1.SR1_gpl/payton/src/router/open_source/pkgs/u-boot-1.3.3-pnx8181/drivers/dma'
  819. /opt/emlix/pnx8181/bin/arm-linux-gnueabi-ar crv libdma.a
  820. make[5]: Leaving directory '/home/alexander/test/payton_1.4.1.SR1_gpl/payton/src/router/open_source/pkgs/u-boot-1.3.3-pnx8181/drivers/dma'
  821. make -C drivers/fpga/
  822. make[5]: Entering directory '/home/alexander/test/payton_1.4.1.SR1_gpl/payton/src/router/open_source/pkgs/u-boot-1.3.3-pnx8181/drivers/fpga'
  823. /opt/emlix/pnx8181/bin/arm-linux-gnueabi-ar crv libfpga.a
  824. make[5]: Leaving directory '/home/alexander/test/payton_1.4.1.SR1_gpl/payton/src/router/open_source/pkgs/u-boot-1.3.3-pnx8181/drivers/fpga'
  825. make -C drivers/gpio/
  826. make[5]: Entering directory '/home/alexander/test/payton_1.4.1.SR1_gpl/payton/src/router/open_source/pkgs/u-boot-1.3.3-pnx8181/drivers/gpio'
  827. /opt/emlix/pnx8181/bin/arm-linux-gnueabi-ar crv libgpio.a
  828. make[5]: Leaving directory '/home/alexander/test/payton_1.4.1.SR1_gpl/payton/src/router/open_source/pkgs/u-boot-1.3.3-pnx8181/drivers/gpio'
  829. make -C drivers/hwmon/
  830. make[5]: Entering directory '/home/alexander/test/payton_1.4.1.SR1_gpl/payton/src/router/open_source/pkgs/u-boot-1.3.3-pnx8181/drivers/hwmon'
  831. /opt/emlix/pnx8181/bin/arm-linux-gnueabi-ar crv libhwmon.a
  832. make[5]: Leaving directory '/home/alexander/test/payton_1.4.1.SR1_gpl/payton/src/router/open_source/pkgs/u-boot-1.3.3-pnx8181/drivers/hwmon'
  833. make -C drivers/i2c/
  834. make[5]: Entering directory '/home/alexander/test/payton_1.4.1.SR1_gpl/payton/src/router/open_source/pkgs/u-boot-1.3.3-pnx8181/drivers/i2c'
  835. make[5]: Nothing to be done for 'all'.
  836. make[5]: Leaving directory '/home/alexander/test/payton_1.4.1.SR1_gpl/payton/src/router/open_source/pkgs/u-boot-1.3.3-pnx8181/drivers/i2c'
  837. make -C drivers/input/
  838. make[5]: Entering directory '/home/alexander/test/payton_1.4.1.SR1_gpl/payton/src/router/open_source/pkgs/u-boot-1.3.3-pnx8181/drivers/input'
  839. /opt/emlix/pnx8181/bin/arm-linux-gnueabi-ar crv libinput.a
  840. make[5]: Leaving directory '/home/alexander/test/payton_1.4.1.SR1_gpl/payton/src/router/open_source/pkgs/u-boot-1.3.3-pnx8181/drivers/input'
  841. make -C drivers/misc/
  842. make[5]: Entering directory '/home/alexander/test/payton_1.4.1.SR1_gpl/payton/src/router/open_source/pkgs/u-boot-1.3.3-pnx8181/drivers/misc'
  843. make[5]: Nothing to be done for 'all'.
  844. make[5]: Leaving directory '/home/alexander/test/payton_1.4.1.SR1_gpl/payton/src/router/open_source/pkgs/u-boot-1.3.3-pnx8181/drivers/misc'
  845. make -C drivers/mmc/
  846. make[5]: Entering directory '/home/alexander/test/payton_1.4.1.SR1_gpl/payton/src/router/open_source/pkgs/u-boot-1.3.3-pnx8181/drivers/mmc'
  847. /opt/emlix/pnx8181/bin/arm-linux-gnueabi-ar crv libmmc.a
  848. make[5]: Leaving directory '/home/alexander/test/payton_1.4.1.SR1_gpl/payton/src/router/open_source/pkgs/u-boot-1.3.3-pnx8181/drivers/mmc'
  849. make -C drivers/mtd/
  850. make[5]: Entering directory '/home/alexander/test/payton_1.4.1.SR1_gpl/payton/src/router/open_source/pkgs/u-boot-1.3.3-pnx8181/drivers/mtd'
  851. /opt/emlix/pnx8181/bin/arm-linux-gnueabi-ar crv libmtd.a
  852. make[5]: Leaving directory '/home/alexander/test/payton_1.4.1.SR1_gpl/payton/src/router/open_source/pkgs/u-boot-1.3.3-pnx8181/drivers/mtd'
  853. make -C drivers/mtd/nand/
  854. make[5]: Entering directory '/home/alexander/test/payton_1.4.1.SR1_gpl/payton/src/router/open_source/pkgs/u-boot-1.3.3-pnx8181/drivers/mtd/nand'
  855. make[5]: Nothing to be done for 'all'.
  856. make[5]: Leaving directory '/home/alexander/test/payton_1.4.1.SR1_gpl/payton/src/router/open_source/pkgs/u-boot-1.3.3-pnx8181/drivers/mtd/nand'
  857. make -C drivers/mtd/nand_legacy/
  858. make[5]: Entering directory '/home/alexander/test/payton_1.4.1.SR1_gpl/payton/src/router/open_source/pkgs/u-boot-1.3.3-pnx8181/drivers/mtd/nand_legacy'
  859. /opt/emlix/pnx8181/bin/arm-linux-gnueabi-ar crv libnand_legacy.a
  860. make[5]: Leaving directory '/home/alexander/test/payton_1.4.1.SR1_gpl/payton/src/router/open_source/pkgs/u-boot-1.3.3-pnx8181/drivers/mtd/nand_legacy'
  861. make -C drivers/mtd/onenand/
  862. make[5]: Entering directory '/home/alexander/test/payton_1.4.1.SR1_gpl/payton/src/router/open_source/pkgs/u-boot-1.3.3-pnx8181/drivers/mtd/onenand'
  863. /opt/emlix/pnx8181/bin/arm-linux-gnueabi-ar crv libonenand.a
  864. make[5]: Leaving directory '/home/alexander/test/payton_1.4.1.SR1_gpl/payton/src/router/open_source/pkgs/u-boot-1.3.3-pnx8181/drivers/mtd/onenand'
  865. make -C drivers/mtd/ubi/
  866. make[5]: Entering directory '/home/alexander/test/payton_1.4.1.SR1_gpl/payton/src/router/open_source/pkgs/u-boot-1.3.3-pnx8181/drivers/mtd/ubi'
  867. /opt/emlix/pnx8181/bin/arm-linux-gnueabi-ar crv libubi.a
  868. make[5]: Leaving directory '/home/alexander/test/payton_1.4.1.SR1_gpl/payton/src/router/open_source/pkgs/u-boot-1.3.3-pnx8181/drivers/mtd/ubi'
  869. make -C drivers/mtd/spi/
  870. make[5]: Entering directory '/home/alexander/test/payton_1.4.1.SR1_gpl/payton/src/router/open_source/pkgs/u-boot-1.3.3-pnx8181/drivers/mtd/spi'
  871. /opt/emlix/pnx8181/bin/arm-linux-gnueabi-ar crv libspi_flash.a
  872. make[5]: Leaving directory '/home/alexander/test/payton_1.4.1.SR1_gpl/payton/src/router/open_source/pkgs/u-boot-1.3.3-pnx8181/drivers/mtd/spi'
  873. make -C drivers/net/
  874. make[5]: Entering directory '/home/alexander/test/payton_1.4.1.SR1_gpl/payton/src/router/open_source/pkgs/u-boot-1.3.3-pnx8181/drivers/net'
  875. make[5]: Nothing to be done for 'all'.
  876. make[5]: Leaving directory '/home/alexander/test/payton_1.4.1.SR1_gpl/payton/src/router/open_source/pkgs/u-boot-1.3.3-pnx8181/drivers/net'
  877. make -C drivers/net/phy/
  878. make[5]: Entering directory '/home/alexander/test/payton_1.4.1.SR1_gpl/payton/src/router/open_source/pkgs/u-boot-1.3.3-pnx8181/drivers/net/phy'
  879. /opt/emlix/pnx8181/bin/arm-linux-gnueabi-ar crv libphy.a
  880. make[5]: Leaving directory '/home/alexander/test/payton_1.4.1.SR1_gpl/payton/src/router/open_source/pkgs/u-boot-1.3.3-pnx8181/drivers/net/phy'
  881. make -C drivers/net/sk98lin/
  882. make[5]: Entering directory '/home/alexander/test/payton_1.4.1.SR1_gpl/payton/src/router/open_source/pkgs/u-boot-1.3.3-pnx8181/drivers/net/sk98lin'
  883. /opt/emlix/pnx8181/bin/arm-linux-gnueabi-ar crv libsk98lin.a
  884. make[5]: Leaving directory '/home/alexander/test/payton_1.4.1.SR1_gpl/payton/src/router/open_source/pkgs/u-boot-1.3.3-pnx8181/drivers/net/sk98lin'
  885. make -C drivers/pci/
  886. make[5]: Entering directory '/home/alexander/test/payton_1.4.1.SR1_gpl/payton/src/router/open_source/pkgs/u-boot-1.3.3-pnx8181/drivers/pci'
  887. /opt/emlix/pnx8181/bin/arm-linux-gnueabi-ar crv libpci.a
  888. make[5]: Leaving directory '/home/alexander/test/payton_1.4.1.SR1_gpl/payton/src/router/open_source/pkgs/u-boot-1.3.3-pnx8181/drivers/pci'
  889. make -C drivers/pcmcia/
  890. make[5]: Entering directory '/home/alexander/test/payton_1.4.1.SR1_gpl/payton/src/router/open_source/pkgs/u-boot-1.3.3-pnx8181/drivers/pcmcia'
  891. make[5]: Nothing to be done for 'all'.
  892. make[5]: Leaving directory '/home/alexander/test/payton_1.4.1.SR1_gpl/payton/src/router/open_source/pkgs/u-boot-1.3.3-pnx8181/drivers/pcmcia'
  893. make -C drivers/spi/
  894. make[5]: Entering directory '/home/alexander/test/payton_1.4.1.SR1_gpl/payton/src/router/open_source/pkgs/u-boot-1.3.3-pnx8181/drivers/spi'
  895. /opt/emlix/pnx8181/bin/arm-linux-gnueabi-ar crv libspi.a
  896. make[5]: Leaving directory '/home/alexander/test/payton_1.4.1.SR1_gpl/payton/src/router/open_source/pkgs/u-boot-1.3.3-pnx8181/drivers/spi'
  897. make -C drivers/rtc/
  898. make[5]: Entering directory '/home/alexander/test/payton_1.4.1.SR1_gpl/payton/src/router/open_source/pkgs/u-boot-1.3.3-pnx8181/drivers/rtc'
  899. make[5]: Nothing to be done for 'all'.
  900. make[5]: Leaving directory '/home/alexander/test/payton_1.4.1.SR1_gpl/payton/src/router/open_source/pkgs/u-boot-1.3.3-pnx8181/drivers/rtc'
  901. make -C drivers/serial/
  902. make[5]: Entering directory '/home/alexander/test/payton_1.4.1.SR1_gpl/payton/src/router/open_source/pkgs/u-boot-1.3.3-pnx8181/drivers/serial'
  903. make[5]: Nothing to be done for 'all'.
  904. make[5]: Leaving directory '/home/alexander/test/payton_1.4.1.SR1_gpl/payton/src/router/open_source/pkgs/u-boot-1.3.3-pnx8181/drivers/serial'
  905. make -C drivers/usb/
  906. make[5]: Entering directory '/home/alexander/test/payton_1.4.1.SR1_gpl/payton/src/router/open_source/pkgs/u-boot-1.3.3-pnx8181/drivers/usb'
  907. make[5]: Nothing to be done for 'all'.
  908. make[5]: Leaving directory '/home/alexander/test/payton_1.4.1.SR1_gpl/payton/src/router/open_source/pkgs/u-boot-1.3.3-pnx8181/drivers/usb'
  909. make -C drivers/video/
  910. make[5]: Entering directory '/home/alexander/test/payton_1.4.1.SR1_gpl/payton/src/router/open_source/pkgs/u-boot-1.3.3-pnx8181/drivers/video'
  911. make[5]: Nothing to be done for 'all'.
  912. make[5]: Leaving directory '/home/alexander/test/payton_1.4.1.SR1_gpl/payton/src/router/open_source/pkgs/u-boot-1.3.3-pnx8181/drivers/video'
  913. make -C common/
  914. make[5]: Entering directory '/home/alexander/test/payton_1.4.1.SR1_gpl/payton/src/router/open_source/pkgs/u-boot-1.3.3-pnx8181/common'
  915. make[5]: Nothing to be done for 'all'.
  916. make[5]: Leaving directory '/home/alexander/test/payton_1.4.1.SR1_gpl/payton/src/router/open_source/pkgs/u-boot-1.3.3-pnx8181/common'
  917. make -C libfdt/
  918. make[5]: Entering directory '/home/alexander/test/payton_1.4.1.SR1_gpl/payton/src/router/open_source/pkgs/u-boot-1.3.3-pnx8181/libfdt'
  919. /opt/emlix/pnx8181/bin/arm-linux-gnueabi-ar crv libfdt.a
  920. make[5]: Leaving directory '/home/alexander/test/payton_1.4.1.SR1_gpl/payton/src/router/open_source/pkgs/u-boot-1.3.3-pnx8181/libfdt'
  921. make -C api/
  922. make[5]: Entering directory '/home/alexander/test/payton_1.4.1.SR1_gpl/payton/src/router/open_source/pkgs/u-boot-1.3.3-pnx8181/api'
  923. /opt/emlix/pnx8181/bin/arm-linux-gnueabi-ar crv libapi.a
  924. make[5]: Leaving directory '/home/alexander/test/payton_1.4.1.SR1_gpl/payton/src/router/open_source/pkgs/u-boot-1.3.3-pnx8181/api'
  925. make -C post/
  926. make[5]: Entering directory '/home/alexander/test/payton_1.4.1.SR1_gpl/payton/src/router/open_source/pkgs/u-boot-1.3.3-pnx8181/post'
  927. make[5]: Nothing to be done for 'all'.
  928. make[5]: Leaving directory '/home/alexander/test/payton_1.4.1.SR1_gpl/payton/src/router/open_source/pkgs/u-boot-1.3.3-pnx8181/post'
  929. make -C board/dspg/firetux/
  930. make[5]: Entering directory '/home/alexander/test/payton_1.4.1.SR1_gpl/payton/src/router/open_source/pkgs/u-boot-1.3.3-pnx8181/board/dspg/firetux'
  931. make[5]: Nothing to be done for 'all'.
  932. make[5]: Leaving directory '/home/alexander/test/payton_1.4.1.SR1_gpl/payton/src/router/open_source/pkgs/u-boot-1.3.3-pnx8181/board/dspg/firetux'
  933. make -C /home/alexander/test/payton_1.4.1.SR1_gpl/payton/src/router/open_source/pkgs/u-boot-1.3.3-pnx8181/board/dspg/firetux/ u-boot.lds
  934. make[5]: Entering directory '/home/alexander/test/payton_1.4.1.SR1_gpl/payton/src/router/open_source/pkgs/u-boot-1.3.3-pnx8181/board/dspg/firetux'
  935. make[5]: Nothing to be done for 'u-boot.lds'.
  936. make[5]: Leaving directory '/home/alexander/test/payton_1.4.1.SR1_gpl/payton/src/router/open_source/pkgs/u-boot-1.3.3-pnx8181/board/dspg/firetux'
  937. UNDEF_SYM=`/opt/emlix/pnx8181/bin/arm-linux-gnueabi-objdump -x board/dspg/firetux/libfiretux.a lib_generic/libgeneric.a lib_generic/lzma/liblzma.a cpu/arm926ejs/libarm926ejs.a cpu/arm926ejs/pnx8181/libpnx8181.a lib_arm/libarm.a fs/cramfs/libcramfs.a fs/fat/libfat.a fs/fdos/libfdos.a fs/jffs2/libjffs2.a fs/reiserfs/libreiserfs.a fs/ext2/libext2fs.a fs/yaffs2/libyaffs2.a net/libnet.a disk/libdisk.a drivers/bios_emulator/libatibiosemu.a drivers/block/libblock.a drivers/dma/libdma.a drivers/fpga/libfpga.a drivers/gpio/libgpio.a drivers/hwmon/libhwmon.a drivers/i2c/libi2c.a drivers/input/libinput.a drivers/misc/libmisc.a drivers/mmc/libmmc.a drivers/mtd/libmtd.a drivers/mtd/nand/libnand.a drivers/mtd/nand_legacy/libnand_legacy.a drivers/mtd/onenand/libonenand.a drivers/mtd/ubi/libubi.a drivers/mtd/spi/libspi_flash.a drivers/net/libnet.a drivers/net/phy/libphy.a drivers/net/sk98lin/libsk98lin.a drivers/pci/libpci.a drivers/pcmcia/libpcmcia.a drivers/spi/libspi.a drivers/rtc/librtc.a drivers/serial/libserial.a drivers/usb/libusb.a drivers/video/libvideo.a common/libcommon.a libfdt/libfdt.a api/libapi.a post/libpost.a | \
  938. sed -n -e 's/.*\(__u_boot_cmd_.*\)/-u\1/p'|sort|uniq`;\
  939. cd /home/alexander/test/payton_1.4.1.SR1_gpl/payton/src/router/open_source/pkgs/u-boot-1.3.3-pnx8181 && /opt/emlix/pnx8181/bin/arm-linux-gnueabi-ld -Bstatic -T /home/alexander/test/payton_1.4.1.SR1_gpl/payton/src/router/open_source/pkgs/u-boot-1.3.3-pnx8181/board/dspg/firetux/u-boot.lds -Ttext 0x20780000 $UNDEF_SYM cpu/arm926ejs/start.o \
  940. --start-group lib_generic/libgeneric.a lib_generic/lzma/liblzma.a cpu/arm926ejs/libarm926ejs.a cpu/arm926ejs/pnx8181/libpnx8181.a lib_arm/libarm.a fs/cramfs/libcramfs.a fs/fat/libfat.a fs/fdos/libfdos.a fs/jffs2/libjffs2.a fs/reiserfs/libreiserfs.a fs/ext2/libext2fs.a fs/yaffs2/libyaffs2.a net/libnet.a disk/libdisk.a drivers/bios_emulator/libatibiosemu.a drivers/block/libblock.a drivers/dma/libdma.a drivers/fpga/libfpga.a drivers/gpio/libgpio.a drivers/hwmon/libhwmon.a drivers/i2c/libi2c.a drivers/input/libinput.a drivers/misc/libmisc.a drivers/mmc/libmmc.a drivers/mtd/libmtd.a drivers/mtd/nand/libnand.a drivers/mtd/nand_legacy/libnand_legacy.a drivers/mtd/onenand/libonenand.a drivers/mtd/ubi/libubi.a drivers/mtd/spi/libspi_flash.a drivers/net/libnet.a drivers/net/phy/libphy.a drivers/net/sk98lin/libsk98lin.a drivers/pci/libpci.a drivers/pcmcia/libpcmcia.a drivers/spi/libspi.a drivers/rtc/librtc.a drivers/serial/libserial.a drivers/usb/libusb.a drivers/video/libvideo.a common/libcommon.a libfdt/libfdt.a api/libapi.a post/libpost.a board/dspg/firetux/libfiretux.a --end-group -L /opt/emlix/pnx8181/bin/../lib/gcc/arm-linux-gnueabi/4.1.2 -lgcc \
  941. -Map u-boot.map -o u-boot
  942. /opt/emlix/pnx8181/bin/arm-linux-gnueabi-objcopy -O srec u-boot u-boot.srec
  943. /opt/emlix/pnx8181/bin/arm-linux-gnueabi-objcopy --gap-fill=0xff -O binary u-boot u-boot.bin
  944. make[4]: Leaving directory '/home/alexander/test/payton_1.4.1.SR1_gpl/payton/src/router/open_source/pkgs/u-boot-1.3.3-pnx8181'
  945. make[3]: Leaving directory '/home/alexander/test/payton_1.4.1.SR1_gpl/payton/src/router/open_source/pkgs/u-boot-1.3.3-pnx8181'
  946. if [ -f u-boot_env/Makefile.cyt ]; then \
  947. make -C u-boot_env -f Makefile.cyt; \
  948. else \
  949. make -C u-boot_env; \
  950. fi
  951. make[3]: Entering directory '/home/alexander/test/payton_1.4.1.SR1_gpl/payton/src/router/open_source/pkgs/u-boot_env-1.1.4'
  952. make all
  953. make[4]: Entering directory '/home/alexander/test/payton_1.4.1.SR1_gpl/payton/src/router/open_source/pkgs/u-boot_env-1.1.4'
  954. make[4]: Nothing to be done for 'all'.
  955. make[4]: Leaving directory '/home/alexander/test/payton_1.4.1.SR1_gpl/payton/src/router/open_source/pkgs/u-boot_env-1.1.4'
  956. make[3]: Leaving directory '/home/alexander/test/payton_1.4.1.SR1_gpl/payton/src/router/open_source/pkgs/u-boot_env-1.1.4'
  957. if [ -f openssl/Makefile.cyt ]; then \
  958. make -C openssl -f Makefile.cyt; \
  959. else \
  960. make -C openssl; \
  961. fi
  962. make[3]: Entering directory '/home/alexander/test/payton_1.4.1.SR1_gpl/payton/src/router/open_source/pkgs/openssl-1.0.2l'
  963. make CROSS_COMPILE=/opt/emlix/pnx8181/bin/arm-linux-gnueabi- CC=/opt/emlix/pnx8181/bin/arm-linux-gnueabi-gcc
  964. make[4]: Entering directory '/home/alexander/test/payton_1.4.1.SR1_gpl/payton/src/router/open_source/pkgs/openssl-1.0.2l'
  965. making all in crypto...
  966. make[5]: Entering directory '/home/alexander/test/payton_1.4.1.SR1_gpl/payton/src/router/open_source/pkgs/openssl-1.0.2l/crypto'
  967. /usr/bin/perl ../util/mkbuildinf.pl "/opt/emlix/pnx8181/bin/arm-linux-gnueabi-gcc -I. -I.. -I../include -DOPENSSL_THREADS -D_REENTRANT -DDSO_DLFCN -DHAVE_DLFCN_H -Wa,--noexecstack -DL_ENDIAN -O3 -fomit-frame-pointer -Wall -DOPENSSL_BN_ASM_PART_WORDS -DOPENSSL_IA32_SSE2 -DOPENSSL_BN_ASM_MONT -DOPENSSL_BN_ASM_GF2m -DRC4_ASM -DSHA1_ASM -DSHA256_ASM -DSHA512_ASM -DMD5_ASM -DRMD160_ASM -DAES_ASM -DVPAES_ASM -DWHIRLPOOL_ASM -DGHASH_ASM" "linux-elf" >buildinf.h
  968. /opt/emlix/pnx8181/bin/arm-linux-gnueabi-gcc -I. -I.. -I../include -DOPENSSL_THREADS -D_REENTRANT -DDSO_DLFCN -DHAVE_DLFCN_H -Wa,--noexecstack -DL_ENDIAN -O3 -fomit-frame-pointer -Wall -DOPENSSL_BN_ASM_PART_WORDS -DOPENSSL_IA32_SSE2 -DOPENSSL_BN_ASM_MONT -DOPENSSL_BN_ASM_GF2m -DRC4_ASM -DSHA1_ASM -DSHA256_ASM -DSHA512_ASM -DMD5_ASM -DRMD160_ASM -DAES_ASM -DVPAES_ASM -DWHIRLPOOL_ASM -DGHASH_ASM -c -o cversion.o cversion.c
  969. /opt/emlix/pnx8181/bin/arm-linux-gnueabi-gcc -I. -I.. -I../include -DOPENSSL_THREADS -D_REENTRANT -DDSO_DLFCN -DHAVE_DLFCN_H -Wa,--noexecstack -DL_ENDIAN -O3 -fomit-frame-pointer -Wall -DOPENSSL_BN_ASM_PART_WORDS -DOPENSSL_IA32_SSE2 -DOPENSSL_BN_ASM_MONT -DOPENSSL_BN_ASM_GF2m -DRC4_ASM -DSHA1_ASM -DSHA256_ASM -DSHA512_ASM -DMD5_ASM -DRMD160_ASM -DAES_ASM -DVPAES_ASM -DWHIRLPOOL_ASM -DGHASH_ASM -c -o x86cpuid.o x86cpuid.s
  970. x86cpuid.s: Assembler messages:
  971. x86cpuid.s:4: Error: unrecognized symbol type ""
  972. x86cpuid.s:5: Error: alignment too large: 15 assumed
  973. x86cpuid.s:8: Error: bad instruction `pushl %ebp'
  974. x86cpuid.s:9: Error: bad instruction `pushl %ebx'
  975. x86cpuid.s:10: Error: bad instruction `pushl %esi'
  976. x86cpuid.s:11: Error: bad instruction `pushl %edi'
  977. x86cpuid.s:12: Error: bad instruction `xorl %edx,%edx'
  978. x86cpuid.s:13: Error: bad instruction `pushfl'
  979. x86cpuid.s:14: Error: bad instruction `popl %eax'
  980. x86cpuid.s:15: Error: bad instruction `movl %eax,%ecx'
  981. x86cpuid.s:16: Error: bad instruction `xorl $2097152,%eax'
  982. x86cpuid.s:17: Error: bad instruction `pushl %eax'
  983. x86cpuid.s:18: Error: bad instruction `popfl'
  984. x86cpuid.s:19: Error: bad instruction `pushfl'
  985. x86cpuid.s:20: Error: bad instruction `popl %eax'
  986. x86cpuid.s:21: Error: bad instruction `xorl %eax,%ecx'
  987. x86cpuid.s:22: Error: bad instruction `xorl %eax,%eax'
  988. x86cpuid.s:23: Error: bad instruction `movl 20(%esp),%esi'
  989. x86cpuid.s:24: Error: bad instruction `movl %eax,8(%esi)'
  990. x86cpuid.s:25: Error: bad instruction `btl $21,%ecx'
  991. x86cpuid.s:26: Error: bad instruction `jnc .L000nocpuid'
  992. x86cpuid.s:28: Error: bad instruction `movl %eax,%edi'
  993. x86cpuid.s:29: Error: bad instruction `xorl %eax,%eax'
  994. x86cpuid.s:30: Error: bad instruction `cmpl $1970169159,%ebx'
  995. x86cpuid.s:31: Error: bad instruction `setne %al'
  996. x86cpuid.s:32: Error: bad instruction `movl %eax,%ebp'
  997. x86cpuid.s:33: Error: bad instruction `cmpl $1231384169,%edx'
  998. x86cpuid.s:34: Error: bad instruction `setne %al'
  999. x86cpuid.s:35: Error: bad instruction `orl %eax,%ebp'
  1000. x86cpuid.s:36: Error: bad instruction `cmpl $1818588270,%ecx'
  1001. x86cpuid.s:37: Error: bad instruction `setne %al'
  1002. x86cpuid.s:38: Error: bad instruction `orl %eax,%ebp'
  1003. x86cpuid.s:39: Error: bad instruction `jz .L001intel'
  1004. x86cpuid.s:40: Error: bad instruction `cmpl $1752462657,%ebx'
  1005. x86cpuid.s:41: Error: bad instruction `setne %al'
  1006. x86cpuid.s:42: Error: bad instruction `movl %eax,%esi'
  1007. x86cpuid.s:43: Error: bad instruction `cmpl $1769238117,%edx'
  1008. x86cpuid.s:44: Error: bad instruction `setne %al'
  1009. x86cpuid.s:45: Error: bad instruction `orl %eax,%esi'
  1010. x86cpuid.s:46: Error: bad instruction `cmpl $1145913699,%ecx'
  1011. x86cpuid.s:47: Error: bad instruction `setne %al'
  1012. x86cpuid.s:48: Error: bad instruction `orl %eax,%esi'
  1013. x86cpuid.s:49: Error: bad instruction `jnz .L001intel'
  1014. x86cpuid.s:50: Error: bad instruction `movl $2147483648,%eax'
  1015. x86cpuid.s:52: Error: bad instruction `cmpl $2147483649,%eax'
  1016. x86cpuid.s:53: Error: bad instruction `jb .L001intel'
  1017. x86cpuid.s:54: Error: bad instruction `movl %eax,%esi'
  1018. x86cpuid.s:55: Error: bad instruction `movl $2147483649,%eax'
  1019. x86cpuid.s:57: Error: bad instruction `orl %ecx,%ebp'
  1020. x86cpuid.s:58: Error: bad instruction `andl $2049,%ebp'
  1021. x86cpuid.s:59: Error: bad instruction `cmpl $2147483656,%esi'
  1022. x86cpuid.s:60: Error: bad instruction `jb .L001intel'
  1023. x86cpuid.s:61: Error: bad instruction `movl $2147483656,%eax'
  1024. x86cpuid.s:63: Error: bad instruction `movzbl %cl,%esi'
  1025. x86cpuid.s:64: Error: bad instruction `incl %esi'
  1026. x86cpuid.s:65: Error: bad instruction `movl $1,%eax'
  1027. x86cpuid.s:66: Error: bad instruction `xorl %ecx,%ecx'
  1028. x86cpuid.s:68: Error: bad instruction `btl $28,%edx'
  1029. x86cpuid.s:69: Error: bad instruction `jnc .L002generic'
  1030. x86cpuid.s:70: Error: bad instruction `shrl $16,%ebx'
  1031. x86cpuid.s:71: Error: bad instruction `andl $255,%ebx'
  1032. x86cpuid.s:72: Error: bad instruction `cmpl %esi,%ebx'
  1033. x86cpuid.s:73: Error: bad instruction `ja .L002generic'
  1034. x86cpuid.s:74: Error: bad instruction `andl $4026531839,%edx'
  1035. x86cpuid.s:75: Error: bad instruction `jmp .L002generic'
  1036. x86cpuid.s:77: Error: bad instruction `cmpl $4,%edi'
  1037. x86cpuid.s:78: Error: bad instruction `movl $-1,%esi'
  1038. x86cpuid.s:79: Error: bad instruction `jb .L003nocacheinfo'
  1039. x86cpuid.s:80: Error: bad instruction `movl $4,%eax'
  1040. x86cpuid.s:81: Error: bad instruction `movl $0,%ecx'
  1041. x86cpuid.s:83: Error: bad instruction `movl %eax,%esi'
  1042. x86cpuid.s:84: Error: bad instruction `shrl $14,%esi'
  1043. x86cpuid.s:85: Error: bad instruction `andl $4095,%esi'
  1044. x86cpuid.s:87: Error: bad instruction `movl $1,%eax'
  1045. x86cpuid.s:88: Error: bad instruction `xorl %ecx,%ecx'
  1046. x86cpuid.s:90: Error: bad instruction `andl $3220176895,%edx'
  1047. x86cpuid.s:91: Error: bad instruction `cmpl $0,%ebp'
  1048. x86cpuid.s:92: Error: bad instruction `jne .L004notintel'
  1049. x86cpuid.s:93: Error: bad instruction `orl $1073741824,%edx'
  1050. x86cpuid.s:94: Error: bad instruction `andb $15,%ah'
  1051. x86cpuid.s:95: Error: bad instruction `cmpb $15,%ah'
  1052. x86cpuid.s:96: Error: bad instruction `jne .L004notintel'
  1053. x86cpuid.s:97: Error: bad instruction `orl $1048576,%edx'
  1054. x86cpuid.s:99: Error: bad instruction `btl $28,%edx'
  1055. x86cpuid.s:100: Error: bad instruction `jnc .L002generic'
  1056. x86cpuid.s:101: Error: bad instruction `andl $4026531839,%edx'
  1057. x86cpuid.s:102: Error: bad instruction `cmpl $0,%esi'
  1058. x86cpuid.s:103: Error: bad instruction `je .L002generic'
  1059. x86cpuid.s:104: Error: bad instruction `orl $268435456,%edx'
  1060. x86cpuid.s:105: Error: bad instruction `shrl $16,%ebx'
  1061. x86cpuid.s:106: Error: bad instruction `cmpb $1,%bl'
  1062. x86cpuid.s:107: Error: bad instruction `ja .L002generic'
  1063. x86cpuid.s:108: Error: bad instruction `andl $4026531839,%edx'
  1064. x86cpuid.s:110: Error: bad instruction `andl $2048,%ebp'
  1065. x86cpuid.s:111: Error: bad instruction `andl $4294965247,%ecx'
  1066. x86cpuid.s:112: Error: bad instruction `movl %edx,%esi'
  1067. x86cpuid.s:113: Error: bad instruction `orl %ecx,%ebp'
  1068. x86cpuid.s:114: Error: bad instruction `cmpl $7,%edi'
  1069. x86cpuid.s:115: Error: bad instruction `movl 20(%esp),%edi'
  1070. x86cpuid.s:116: Error: bad instruction `jb .L005no_extended_info'
  1071. x86cpuid.s:117: Error: bad instruction `movl $7,%eax'
  1072. x86cpuid.s:118: Error: bad instruction `xorl %ecx,%ecx'
  1073. x86cpuid.s:120: Error: bad instruction `movl %ebx,8(%edi)'
  1074. x86cpuid.s:122: Error: bad instruction `btl $27,%ebp'
  1075. x86cpuid.s:123: Error: bad instruction `jnc .L006clear_avx'
  1076. x86cpuid.s:124: Error: bad instruction `xorl %ecx,%ecx'
  1077. x86cpuid.s:126: Error: bad instruction `andl $6,%eax'
  1078. x86cpuid.s:127: Error: bad instruction `cmpl $6,%eax'
  1079. x86cpuid.s:128: Error: bad instruction `je .L007done'
  1080. x86cpuid.s:129: Error: bad instruction `cmpl $2,%eax'
  1081. x86cpuid.s:130: Error: bad instruction `je .L006clear_avx'
  1082. x86cpuid.s:132: Error: bad instruction `andl $4261412861,%ebp'
  1083. x86cpuid.s:133: Error: bad instruction `andl $4278190079,%esi'
  1084. x86cpuid.s:135: Error: bad instruction `andl $4026525695,%ebp'
  1085. x86cpuid.s:136: Error: bad instruction `andl $4294967263,8(%edi)'
  1086. x86cpuid.s:138: Error: bad instruction `movl %esi,%eax'
  1087. x86cpuid.s:139: Error: bad instruction `movl %ebp,%edx'
  1088. x86cpuid.s:141: Error: bad instruction `popl %edi'
  1089. x86cpuid.s:142: Error: bad instruction `popl %esi'
  1090. x86cpuid.s:143: Error: bad instruction `popl %ebx'
  1091. x86cpuid.s:144: Error: bad instruction `popl %ebp'
  1092. x86cpuid.s:145: Error: bad instruction `ret'
  1093. x86cpuid.s:148: Error: unrecognized symbol type ""
  1094. x86cpuid.s:149: Error: alignment too large: 15 assumed
  1095. x86cpuid.s:152: Error: bad instruction `xorl %eax,%eax'
  1096. x86cpuid.s:153: Error: bad instruction `xorl %edx,%edx'
  1097. x86cpuid.s:154: Error: bad instruction `leal OPENSSL_ia32cap_P,%ecx'
  1098. x86cpuid.s:155: Error: bad instruction `btl $4,(%ecx)'
  1099. x86cpuid.s:156: Error: bad instruction `jnc .L009notsc'
  1100. x86cpuid.s:159: Error: bad instruction `ret'
  1101. x86cpuid.s:162: Error: unrecognized symbol type ""
  1102. x86cpuid.s:163: Error: alignment too large: 15 assumed
  1103. x86cpuid.s:166: Error: bad instruction `leal OPENSSL_ia32cap_P,%ecx'
  1104. x86cpuid.s:167: Error: bad instruction `btl $4,(%ecx)'
  1105. x86cpuid.s:168: Error: bad instruction `jnc .L010nohalt'
  1106. x86cpuid.s:170: Error: bad instruction `andl $3,%eax'
  1107. x86cpuid.s:171: Error: bad instruction `jnz .L010nohalt'
  1108. x86cpuid.s:172: Error: bad instruction `pushfl'
  1109. x86cpuid.s:173: Error: bad instruction `popl %eax'
  1110. x86cpuid.s:174: Error: bad instruction `btl $9,%eax'
  1111. x86cpuid.s:175: Error: bad instruction `jnc .L010nohalt'
  1112. x86cpuid.s:177: Error: bad instruction `pushl %edx'
  1113. x86cpuid.s:178: Error: bad instruction `pushl %eax'
  1114. x86cpuid.s:179: Error: bad instruction `hlt'
  1115. x86cpuid.s:181: Error: bad instruction `subl (%esp),%eax'
  1116. x86cpuid.s:182: Error: bad instruction `sbbl 4(%esp),%edx'
  1117. x86cpuid.s:183: Error: bad instruction `addl $8,%esp'
  1118. x86cpuid.s:184: Error: bad instruction `ret'
  1119. x86cpuid.s:186: Error: bad instruction `xorl %eax,%eax'
  1120. x86cpuid.s:187: Error: bad instruction `xorl %edx,%edx'
  1121. x86cpuid.s:188: Error: bad instruction `ret'
  1122. x86cpuid.s:191: Error: unrecognized symbol type ""
  1123. x86cpuid.s:192: Error: alignment too large: 15 assumed
  1124. x86cpuid.s:195: Error: bad instruction `pushfl'
  1125. x86cpuid.s:196: Error: bad instruction `popl %eax'
  1126. x86cpuid.s:197: Error: bad instruction `btl $9,%eax'
  1127. x86cpuid.s:198: Error: bad instruction `jnc .L011nospin'
  1128. x86cpuid.s:199: Error: bad instruction `movl 4(%esp),%eax'
  1129. x86cpuid.s:200: Error: bad instruction `movl 8(%esp),%ecx'
  1130. x86cpuid.s:202: Error: bad instruction `xorl %eax,%eax'
  1131. x86cpuid.s:203: Error: bad instruction `movl (%ecx),%edx'
  1132. x86cpuid.s:204: Error: bad instruction `jmp .L012spin'
  1133. x86cpuid.s:205: Error: alignment too large: 15 assumed
  1134. x86cpuid.s:207: Error: bad instruction `incl %eax'
  1135. x86cpuid.s:208: Error: bad instruction `cmpl (%ecx),%edx'
  1136. x86cpuid.s:209: Error: bad instruction `je .L012spin'
  1137. x86cpuid.s:211: Error: bad instruction `ret'
  1138. x86cpuid.s:213: Error: bad instruction `xorl %eax,%eax'
  1139. x86cpuid.s:214: Error: bad instruction `xorl %edx,%edx'
  1140. x86cpuid.s:215: Error: bad instruction `ret'
  1141. x86cpuid.s:218: Error: unrecognized symbol type ""
  1142. x86cpuid.s:219: Error: alignment too large: 15 assumed
  1143. x86cpuid.s:222: Error: bad instruction `xorl %eax,%eax'
  1144. x86cpuid.s:223: Error: bad instruction `xorl %edx,%edx'
  1145. x86cpuid.s:224: Error: bad instruction `leal OPENSSL_ia32cap_P,%ecx'
  1146. x86cpuid.s:225: Error: bad instruction `movl (%ecx),%ecx'
  1147. x86cpuid.s:226: Error: bad instruction `btl $1,(%ecx)'
  1148. x86cpuid.s:227: Error: bad instruction `jnc .L013no_x87'
  1149. x86cpuid.s:228: Error: bad instruction `andl $83886080,%ecx'
  1150. x86cpuid.s:229: Error: bad instruction `cmpl $83886080,%ecx'
  1151. x86cpuid.s:230: Error: bad instruction `jne .L014no_sse2'
  1152. x86cpuid.s:231: Error: bad instruction `pxor %xmm0,%xmm0'
  1153. x86cpuid.s:232: Error: bad instruction `pxor %xmm1,%xmm1'
  1154. x86cpuid.s:233: Error: bad instruction `pxor %xmm2,%xmm2'
  1155. x86cpuid.s:234: Error: bad instruction `pxor %xmm3,%xmm3'
  1156. x86cpuid.s:235: Error: bad instruction `pxor %xmm4,%xmm4'
  1157. x86cpuid.s:236: Error: bad instruction `pxor %xmm5,%xmm5'
  1158. x86cpuid.s:237: Error: bad instruction `pxor %xmm6,%xmm6'
  1159. x86cpuid.s:238: Error: bad instruction `pxor %xmm7,%xmm7'
  1160. x86cpuid.s:242: Error: bad instruction `leal 4(%esp),%eax'
  1161. x86cpuid.s:243: Error: bad instruction `ret'
  1162. x86cpuid.s:246: Error: unrecognized symbol type ""
  1163. x86cpuid.s:247: Error: alignment too large: 15 assumed
  1164. x86cpuid.s:250: Error: bad instruction `movl 4(%esp),%edx'
  1165. x86cpuid.s:251: Error: bad instruction `movl 8(%esp),%ecx'
  1166. x86cpuid.s:252: Error: bad instruction `pushl %ebx'
  1167. x86cpuid.s:254: Error: bad instruction `movl (%edx),%eax'
  1168. x86cpuid.s:256: Error: bad instruction `leal (%eax,%ecx,1),%ebx'
  1169. x86cpuid.s:259: Error: bad instruction `jne .L015spin'
  1170. x86cpuid.s:260: Error: bad instruction `movl %ebx,%eax'
  1171. x86cpuid.s:261: Error: bad instruction `popl %ebx'
  1172. x86cpuid.s:262: Error: bad instruction `ret'
  1173. x86cpuid.s:265: Error: unrecognized symbol type ""
  1174. x86cpuid.s:266: Error: alignment too large: 15 assumed
  1175. x86cpuid.s:269: Error: bad instruction `pushl %ebp'
  1176. x86cpuid.s:270: Error: bad instruction `movl %esp,%ebp'
  1177. x86cpuid.s:271: Error: bad instruction `subl $28,%esp'
  1178. x86cpuid.s:272: Error: bad instruction `movl 12(%ebp),%ecx'
  1179. x86cpuid.s:273: Error: bad instruction `movl %ecx,(%esp)'
  1180. x86cpuid.s:274: Error: bad instruction `movl 16(%ebp),%edx'
  1181. x86cpuid.s:275: Error: bad instruction `movl %edx,4(%esp)'
  1182. x86cpuid.s:276: Error: bad instruction `movl 20(%ebp),%eax'
  1183. x86cpuid.s:277: Error: bad instruction `movl %eax,8(%esp)'
  1184. x86cpuid.s:278: Error: bad instruction `movl 24(%ebp),%eax'
  1185. x86cpuid.s:279: Error: bad instruction `movl %eax,12(%esp)'
  1186. x86cpuid.s:280: Error: bad instruction `movl 28(%ebp),%eax'
  1187. x86cpuid.s:281: Error: bad instruction `movl %eax,16(%esp)'
  1188. x86cpuid.s:282: Error: bad instruction `movl 32(%ebp),%eax'
  1189. x86cpuid.s:283: Error: bad instruction `movl %eax,20(%esp)'
  1190. x86cpuid.s:284: Error: bad instruction `movl 36(%ebp),%eax'
  1191. x86cpuid.s:285: Error: bad instruction `movl %eax,24(%esp)'
  1192. x86cpuid.s:286: Error: bad instruction `call *8(%ebp)'
  1193. x86cpuid.s:287: Error: bad instruction `movl %ebp,%esp'
  1194. x86cpuid.s:288: Error: bad instruction `popl %ebp'
  1195. x86cpuid.s:289: Error: bad instruction `ret'
  1196. x86cpuid.s:292: Error: unrecognized symbol type ""
  1197. x86cpuid.s:293: Error: alignment too large: 15 assumed
  1198. x86cpuid.s:296: Error: bad instruction `movl 4(%esp),%edx'
  1199. x86cpuid.s:297: Error: bad instruction `movl 8(%esp),%ecx'
  1200. x86cpuid.s:298: Error: bad instruction `xorl %eax,%eax'
  1201. x86cpuid.s:299: Error: bad instruction `cmpl $7,%ecx'
  1202. x86cpuid.s:300: Error: bad instruction `jae .L016lot'
  1203. x86cpuid.s:301: Error: bad instruction `cmpl $0,%ecx'
  1204. x86cpuid.s:302: Error: bad instruction `je .L017ret'
  1205. x86cpuid.s:304: Error: bad instruction `movb %al,(%edx)'
  1206. x86cpuid.s:305: Error: bad instruction `subl $1,%ecx'
  1207. x86cpuid.s:306: Error: bad instruction `leal 1(%edx),%edx'
  1208. x86cpuid.s:307: Error: bad instruction `jnz .L018little'
  1209. x86cpuid.s:309: Error: bad instruction `ret'
  1210. x86cpuid.s:310: Error: alignment too large: 15 assumed
  1211. x86cpuid.s:312: Error: bad instruction `testl $3,%edx'
  1212. x86cpuid.s:313: Error: bad instruction `jz .L019aligned'
  1213. x86cpuid.s:314: Error: bad instruction `movb %al,(%edx)'
  1214. x86cpuid.s:315: Error: bad instruction `leal -1(%ecx),%ecx'
  1215. x86cpuid.s:316: Error: bad instruction `leal 1(%edx),%edx'
  1216. x86cpuid.s:317: Error: bad instruction `jmp .L016lot'
  1217. x86cpuid.s:319: Error: bad instruction `movl %eax,(%edx)'
  1218. x86cpuid.s:320: Error: bad instruction `leal -4(%ecx),%ecx'
  1219. x86cpuid.s:321: Error: bad instruction `testl $-4,%ecx'
  1220. x86cpuid.s:322: Error: bad instruction `leal 4(%edx),%edx'
  1221. x86cpuid.s:323: Error: bad instruction `jnz .L019aligned'
  1222. x86cpuid.s:324: Error: bad instruction `cmpl $0,%ecx'
  1223. x86cpuid.s:325: Error: bad instruction `jne .L018little'
  1224. x86cpuid.s:326: Error: bad instruction `ret'
  1225. x86cpuid.s:329: Error: unrecognized symbol type ""
  1226. x86cpuid.s:330: Error: alignment too large: 15 assumed
  1227. x86cpuid.s:333: Error: bad instruction `movl $8,%ecx'
  1228. x86cpuid.s:336: Error: bad instruction `jc .L021break'
  1229. x86cpuid.s:337: Error: bad instruction `loop .L020loop'
  1230. x86cpuid.s:339: Error: bad instruction `cmpl $0,%eax'
  1231. x86cpuid.s:340: Error: bad instruction `cmovel %ecx,%eax'
  1232. x86cpuid.s:341: Error: bad instruction `ret'
  1233. x86cpuid.s:344: Error: unrecognized symbol type ""
  1234. x86cpuid.s:345: Error: alignment too large: 15 assumed
  1235. x86cpuid.s:348: Error: bad instruction `movl $8,%ecx'
  1236. x86cpuid.s:351: Error: bad instruction `jc .L023break'
  1237. x86cpuid.s:352: Error: bad instruction `loop .L022loop'
  1238. x86cpuid.s:354: Error: bad instruction `cmpl $0,%eax'
  1239. x86cpuid.s:355: Error: bad instruction `cmovel %ecx,%eax'
  1240. x86cpuid.s:356: Error: bad instruction `ret'
  1241. x86cpuid.s:362: Error: bad instruction `call OPENSSL_cpuid_setup'
  1242. <builtin>: recipe for target 'x86cpuid.o' failed
  1243. make[5]: *** [x86cpuid.o] Error 1
  1244. make[5]: Leaving directory '/home/alexander/test/payton_1.4.1.SR1_gpl/payton/src/router/open_source/pkgs/openssl-1.0.2l/crypto'
  1245. Makefile:287: recipe for target 'build_crypto' failed
  1246. make[4]: *** [build_crypto] Error 1
  1247. make[4]: Leaving directory '/home/alexander/test/payton_1.4.1.SR1_gpl/payton/src/router/open_source/pkgs/openssl-1.0.2l'
  1248. Makefile.cyt:5: recipe for target 'all' failed
  1249. make[3]: *** [all] Error 2
  1250. make[3]: Leaving directory '/home/alexander/test/payton_1.4.1.SR1_gpl/payton/src/router/open_source/pkgs/openssl-1.0.2l'
  1251. /home/alexander/test/payton_1.4.1.SR1_gpl/payton/src/Rules.mk:74: recipe for target '_subdir_openssl' failed
  1252. make[2]: *** [_subdir_openssl] Error 2
  1253. make[2]: Leaving directory '/home/alexander/test/payton_1.4.1.SR1_gpl/payton/src/router/open_source'
  1254. /home/alexander/test/payton_1.4.1.SR1_gpl/payton/src/Rules.mk:74: recipe for target '_subdir_open_source' failed
  1255. make[1]: *** [_subdir_open_source] Error 2
  1256. make[1]: Leaving directory '/home/alexander/test/payton_1.4.1.SR1_gpl/payton/src/router'
  1257. Rules.mk:74: recipe for target '_subdir_router' failed
  1258. make: *** [_subdir_router] Error 2
Advertisement
Add Comment
Please, Sign In to add comment