SHARE
TWEET

Untitled

a guest Jul 24th, 2019 108 Never
Not a member of Pastebin yet? Sign Up, it unlocks many cool features!
  1. make "prepare" "CONFIGURATION=Release" -C "/home/cacacarrot/.cache/yay/xamarin-android-git/src/xamarin-android/external/xamarin-android-tools"
  2. [Make] running
  3. [Make] log file: bin/BuildRelease/prepare-20190725T120110.make.xamarin-android-tools.log
  4. To wait, or not to wait... 00:00:00.2500887
  5. Elapsed: 00:00:01.6121926
  6.  
  7. make "prepare" "CONFIGURATION=Release" "JI_MAX_JDK=8" -C "/home/cacacarrot/.cache/yay/xamarin-android-git/src/xamarin-android/external/Java.Interop"
  8. [Make] running
  9. [Make] log file: bin/BuildRelease/prepare-20190725T120110.make.java-interop-prepare.log
  10. stderr | which: no mono64 in (/opt/anaconda/bin:/opt/cuda/bin:/usr/local/sbin:/usr/local/bin:/usr/bin:/opt/cuda/bin:/opt/flutter/bin:/usr/lib/jvm/default/bin:/usr/bin/site_perl:/usr/bin/vendor_perl:/usr/bin/core_perl:/home/cacacarrot/Applications/flutter/.pub-cache/bin)
  11. And the time slowly passes... 00:00:00.2501061
  12. "Wait" is my second name... 00:00:10.2500840
  13. stderr | make[1]: *** [build-tools/scripts/jdk.mk:46: bin/BuildRelease/JdkInfo.props] Error 1
  14. Elapsed: 00:00:12.0997546
  15.  
  16. Step Xamarin.Android.Prepare.Step_PrepareExternal failed
  17. System.InvalidOperationException: Step Xamarin.Android.Prepare.Step_PrepareExternal failed
  18.   at Xamarin.Android.Prepare.Scenario.Run (Xamarin.Android.Prepare.Context context, Xamarin.Android.Prepare.Log log) [0x00144] in /home/cacacarrot/.cache/yay/xamarin-android-git/src/xamarin-android/build-tools/xaprepare/xaprepare/Application/Scenario.cs:46
  19.   at Xamarin.Android.Prepare.Context.Execute () [0x000a7] in /home/cacacarrot/.cache/yay/xamarin-android-git/src/xamarin-android/build-tools/xaprepare/xaprepare/Application/Context.cs:777
  20.   at Xamarin.Android.Prepare.App.Run (System.String[] args) [0x0081d] in /home/cacacarrot/.cache/yay/xamarin-android-git/src/xamarin-android/build-tools/xaprepare/xaprepare/Main.cs:172
  21.  
  22. make: *** [Makefile:197: prepare] Error 1
  23. ==> ERROR: A failure occurred in prepare().
  24.     Aborting...
  25. Error making: xamarin-android-git
RAW Paste Data
We use cookies for various purposes including analytics. By continuing to use Pastebin, you agree to our use of cookies as described in the Cookies Policy. OK, I Understand
 
Top