Hariton

Untitled

Dec 28th, 2019
205
Never
Not a member of Pastebin yet? Sign Up, it unlocks many cool features!
  1. 09:57:34.682 WebServices: Call user.login2 failed in 1577516254 seconds: XmlRpcImplementation::execute: [HttpSendRequest]
  2. 09:57:34.682 - Local system uses a local area network to connect to the Internet
  3. 09:57:34.682 - Local system has RAS installed
  4. 09:57:34.682 params: {
  5. 09:57:34.682 "hash" = "ead48ec5f9793216b0a44fee07b53c68205bc4c093466c444ed475d78eb4896b"
  6. 09:57:34.682 "domain_name" = "developer.anscamobile.com"
  7. 09:57:34.682 "domain_time_stamp" = "1577515217"
  8. 09:57:34.682 "nonce" = "SzhmQxbutr"
  9. 09:57:34.682 "sessid" = "fb4d575044e1e0cb092f644a0feee29f"
  10. 09:57:34.682 "username" = "hariton1500@gmail.com"
  11. 09:57:34.682 "encryptedPassword" = "541073cce62a67e380f2e6a9c1392565f33891e2bae23b695e51968782412af11f27cfd347f5b321503adb0e4c2955545b781ad7beacc2e3c8c992932dee815c9757e07e3f7b1089d6031940f545987a2497c59c2598d9a301e8b7eccba758edf409461762184a6e505955077174d5fd09567a1b7a666eb93e958b5b451b092df4cc7004a5dbe56a2e85e86b405ebf621ee15a18e44b20f66613e893e7ec10253c5b714668b37324f5b7cbf49508427dfaa2955a58839fc90065c09f150541926cca0ae534f03757daf96c381828e964b1f0fecc995cfc48618fef0f10bca34dcd18aadec45da714b92c6abb1108344ef5e34908c719b5756d06a8de32c31b03"
  12. 09:57:34.682 "timestamp" = "5e015500"
  13. 09:57:34.682 }
  14. 09:57:38.261 Using custom build id from app bundle: 00000 (AppSettings.lua)
  15. 09:57:38.261
  16. 09:57:38.261 Using custom Build Id 00000
  17. 09:57:38.261 Prepackage: Compiling Lua ...
  18. 09:57:38.399 Prepackage: Building server data file
  19. 09:57:38.399 Prepackage: running: "C:\Program Files\Java\jdk-13.0.1\bin\java.exe" -Djava.class.path="C:\Program Files (x86)\Corona Labs\Corona\Resources/ant.jar;C:\Program Files (x86)\Corona Labs\Corona\Resources/ant-launcher.jar;C:\Program Files (x86)\Corona Labs\Corona\Resources/AntLiveManifest.jar" org.apache.tools.ant.launch.Launcher -d -DTEMP_DIR="C:\Users\Hariton\AppData\Local\Temp\Corona Labs\CLtmpa07624" -DSRC_DIR="C:\Users\Hariton\Documents\Corona Projects\myEvpaNet" -DBUNDLE_DIR="C:\Program Files (x86)\Corona Labs\Corona\Resources" -DLIVE_BUILD=NO -DLIVE_BUILD_MANIFEST_FILE= -f "C:\Program Files (x86)\Corona Labs\Corona\Resources"/build.xml build-input-zip
  20. 09:57:41.948 Picked up JAVA_TOOL_OPTIONS: -Duser.language=en
  21. 09:57:41.948 Apache Ant version 1.8.1 compiled on April 30 2010
  22. 09:57:41.948 Buildfile: C:\Program Files (x86)\Corona Labs\Corona\Resources\build.xml
  23. 09:57:41.948 Adding reference: ant.PropertyHelper
  24. 09:57:41.948 Detected Java version: 1.6 in: C:\Program Files\Java\jdk-13.0.1
  25. 09:57:41.948 Detected OS: Windows 8
  26. 09:57:41.948 Adding reference: ant.ComponentHelper
  27. 09:57:41.948 Setting ro project property: LIVE_BUILD -> NO
  28. 09:57:41.948 Setting ro project property: BUNDLE_DIR -> C:\Program Files (x86)\Corona Labs\Corona\Resources
  29. 09:57:41.948 Setting ro project property: TEMP_DIR -> C:\Users\Hariton\AppData\Local\Temp\Corona Labs\CLtmpa07624
  30. 09:57:41.948 Setting ro project property: SRC_DIR -> C:\Users\Hariton\Documents\Corona Projects\myEvpaNet
  31. 09:57:41.948 Setting ro project property: LIVE_BUILD_MANIFEST_FILE ->
  32. 09:57:41.948 Setting ro project property: ant.file -> C:\Program Files (x86)\Corona Labs\Corona\Resources\build.xml
  33. 09:57:41.948 Setting ro project property: ant.file.type -> file
  34. 09:57:41.948 Adding reference: ant.projectHelper
  35. 09:57:41.948 Adding reference: ant.parsing.context
  36. 09:57:41.948 Adding reference: ant.targets
  37. 09:57:41.948 parsing buildfile C:\Program Files (x86)\Corona Labs\Corona\Resources\build.xml with URI = file:/C:/Program%20Files%20(x86)/Corona%20Labs/Corona/Resources/build.xml
  38. 09:57:41.948 Setting ro project property: ant.project.name -> Corona Client Build
  39. 09:57:41.948 Adding reference: Corona Client Build
  40. 09:57:41.948 Setting ro project property: ant.project.default-target -> none
  41. 09:57:41.948 Setting ro project property: ant.file.Corona Client Build -> C:\Program Files (x86)\Corona Labs\Corona\Resources\build.xml
  42. 09:57:41.948 Setting ro project property: ant.file.type.Corona Client Build -> file
  43. 09:57:41.948 Project base dir set to: C:\Program Files (x86)\Corona Labs\Corona\Resources
  44. 09:57:41.948 +Target:
  45. 09:57:41.948 +Target: generate-live-build-manifest
  46. 09:57:41.948 +Target: check-gradle-bundle
  47. 09:57:41.948 +Target: setup-gradle-builds
  48. 09:57:41.948 +Target: build-input-zip
  49. 09:57:41.948 +Target: unzip-apk-template
  50. 09:57:41.948 +Target: find-main-application-icons
  51. 09:57:41.948 +Target: find-main-application-banner
  52. 09:57:41.948 +Target: find-ouya-application-icon
  53. 09:57:41.948 +Target: find-ouya-xiaomi-application-icon
  54. 09:57:41.948 +Target: find-default-notification-icons
  55. 09:57:41.948 +Target: copy-file
  56. 09:57:41.948 +Target: can-copy-file
  57. 09:57:41.948 +Target: delete-file
  58. 09:57:41.948 +Target: can-delete-file
  59. 09:57:41.948 +Target: insert-main-application-icons
  60. 09:57:41.948 +Target: insert-main-application-banner
  61. 09:57:41.948 +Target: insert-ouya-application-icon
  62. 09:57:41.948 +Target: insert-ouya-xiaomi-application-icon
  63. 09:57:41.948 +Target: insert-default-notification-icons
  64. 09:57:41.948 +Target: insert-assets-multi-icon
  65. 09:57:41.948 +Target: copy-apk-assets
  66. 09:57:41.948 +Target: copy-files-to-apk
  67. 09:57:41.948 +Target: sign-apk
  68. 09:57:41.948 +Target: sign-apk-md5
  69. 09:57:41.948 +Target: sign-apk-sha1
  70. 09:57:41.948 +Target: sign-apk-auto
  71. 09:57:41.948 +Target: build-unsigned-apk
  72. 09:57:41.948 +Target: build-signed-apk
  73. 09:57:41.948 +Target: build-expansion-file
  74. 09:57:41.948 +Target: copy-apk-to
  75. 09:57:41.948 +Target: copy-to
  76. 09:57:41.948 +Target: build
  77. 09:57:41.948 +Target: test-sign
  78. 09:57:41.948 Adding reference: ant.LocalProperties
  79. 09:57:41.948 parsing buildfile jar:file:/C:/Program%20Files%20(x86)/Corona%20Labs/Corona/Resources/ant.jar!/org/apache/tools/ant/antlib.xml with URI = jar:file:/C:/Program%20Files%20(x86)/Corona%20Labs/Corona/Resources/ant.jar!/org/apache/tools/ant/antlib.xml from a zip file
  80. 09:57:41.948 [property] Loading C:\Program Files (x86)\Corona Labs\Corona\Resources\build.properties
  81. 09:57:41.948 Setting project property: ANDROID_API_VERSION -> android-8
  82. 09:57:41.948 Setting project property: ANDROID_ROOT -> /usr/local/bin/android-sdk-mac_x86
  83. 09:57:41.948 Setting project property: USER_ACTIVITY_PATH -> com/ansca/test/analyticstest
  84. 09:57:41.948 Setting project property: ANDROID_VERSION -> android-8
  85. 09:57:41.948 Setting project property: USER_ACTIVITY_PACKAGE -> com.ansca.test.analyticstest
  86. 09:57:41.948 Setting project property: ANDROID_MIN_SDK_INTEGER_VERSION -> 8
  87. 09:57:41.948 Setting project property: CORONA_ROOT -> /Volumes/Ansca/code/main
  88. 09:57:41.948 Setting project property: USER_APP_DISPLAY_NAME -> analyticstest
  89. 09:57:41.948 Override ignored for property "SRC_DIR"
  90. 09:57:41.948 Setting project property: APK_APP_NAME -> MyCoronaActivity
  91. 09:57:41.948 Class org.apache.tools.ant.taskdefs.condition.Os loaded from parent loader (parentFirst)
  92. 09:57:41.948 Condition true; setting SCRIPT_EXT to exe
  93. 09:57:41.948 Setting project property: SCRIPT_EXT -> exe
  94. 09:57:41.948 Override ignored for property "SCRIPT_EXT"
  95. 09:57:41.948 Condition true; setting USE_OLD_TOUCH to true
  96. 09:57:41.948 Setting project property: USE_OLD_TOUCH -> true
  97. 09:57:41.948 Condition true; setting onWindows to true
  98. 09:57:41.948 Setting project property: onWindows -> true
  99. 09:57:41.948 Class org.apache.tools.ant.taskdefs.condition.Equals loaded from parent loader (parentFirst)
  100. 09:57:41.948 Condition false; not setting live.build
  101. 09:57:41.948 Adding reference: asset.fileset
  102. 09:57:41.948 [available] Found: C:\Program Files (x86)\Corona Labs\Corona\Native\Corona\android
  103. 09:57:41.948 Condition true; setting corona.native.android to C:\Program Files (x86)\Corona Labs\Corona\Resources/../Native/Corona/android
  104. 09:57:41.948 Setting project property: corona.native.android -> C:\Program Files (x86)\Corona Labs\Corona\Resources/../Native/Corona/android
  105. 09:57:41.948 [available] Unable to find C:\Program Files (x86)\Native\Corona\android
  106. 09:57:41.948 Condition false; not setting corona.native.android
  107. 09:57:41.948 [available] Unable to find ..\..\..\..\..\android
  108. 09:57:41.948 Condition false; not setting corona.native.android
  109. 09:57:41.948 [available] Unable to find C:\Users\Hariton\Library\Application Support\Corona\Native\Corona\android
  110. 09:57:41.948 Condition false; not setting corona.native.android
  111. 09:57:41.948 +Datatype copy-res-file org.apache.tools.ant.taskdefs.MacroInstance
  112. 09:57:41.948 [macrodef] creating macro copy-res-file
  113. 09:57:41.949 +Datatype copy-drawable-file org.apache.tools.ant.taskdefs.MacroInstance
  114. 09:57:41.949 [macrodef] creating macro copy-drawable-file
  115. 09:57:41.949 +Datatype copy-mipmap-file org.apache.tools.ant.taskdefs.MacroInstance
  116. 09:57:41.949 [macrodef] creating macro copy-mipmap-file
  117. 09:57:41.949 +Datatype copy-notification-icon org.apache.tools.ant.taskdefs.MacroInstance
  118. 09:57:41.949 [macrodef] creating macro copy-notification-icon
  119. 09:57:41.949 Setting ro project property: ant.project.invoked-targets -> build-input-zip
  120. 09:57:41.949 Attempting to create object of type org.apache.tools.ant.helper.DefaultExecutor
  121. 09:57:41.949 Adding reference: ant.executor
  122. 09:57:41.949 Build sequence for target(s) `build-input-zip' is [generate-live-build-manifest, check-gradle-bundle, setup-gradle-builds, build-input-zip]
  123. 09:57:41.949 Complete build sequence is [generate-live-build-manifest, check-gradle-bundle, setup-gradle-builds, build-input-zip, can-delete-file, unzip-apk-template, build-unsigned-apk, sign-apk-md5, sign-apk-sha1, can-copy-file, build-signed-apk, copy-files-to-apk, copy-apk-assets, test-sign, find-ouya-xiaomi-application-icon, insert-ouya-xiaomi-application-icon, copy-apk-to, sign-apk-auto, sign-apk, find-main-application-banner, insert-main-application-banner, find-main-application-icons, insert-main-application-icons, find-default-notification-icons, insert-default-notification-icons, insert-assets-multi-icon, build-expansion-file, copy-to, build, find-ouya-application-icon, insert-ouya-application-icon, copy-file, , delete-file]
  124. 09:57:41.949
  125. 09:57:41.949 generate-live-build-manifest:
  126. 09:57:41.949 Skipped because property 'live.build' not set.
  127. 09:57:41.949
  128. 09:57:41.949 check-gradle-bundle:
  129. 09:57:41.949 [available] Found: C:\Program Files (x86)\Corona Labs\Corona\Native\Corona\android\resource\android-template.zip
  130. 09:57:41.949 Setting project property: gradle.bundle.exists -> true
  131. 09:57:41.949
  132. 09:57:41.949 setup-gradle-builds:
  133. 09:57:41.949 [unzip] Expanding: C:\Program Files (x86)\Corona Labs\Corona\Native\Corona\android\resource\android-template.zip into C:\Users\Hariton\AppData\Local\Temp\Corona Labs\CLtmpa07624
  134. 09:57:41.949 [unzip] extracting template/gradlew.bat
  135. 09:57:41.949 [unzip] expanding template/gradlew.bat to C:\Users\Hariton\AppData\Local\Temp\Corona Labs\CLtmpa07624\template\gradlew.bat
  136. 09:57:41.949 [unzip] extracting template/setup.sh
  137. 09:57:41.949 [unzip] expanding template/setup.sh to C:\Users\Hariton\AppData\Local\Temp\Corona Labs\CLtmpa07624\template\setup.sh
  138. 09:57:41.949 [unzip] extracting template/gradle.properties
  139. 09:57:41.949 [unzip] expanding template/gradle.properties to C:\Users\Hariton\AppData\Local\Temp\Corona Labs\CLtmpa07624\template\gradle.properties
  140. 09:57:41.949 [unzip] extracting template/app/
  141. 09:57:41.949 [unzip] expanding template/app/ to C:\Users\Hariton\AppData\Local\Temp\Corona Labs\CLtmpa07624\template\app
  142. 09:57:41.949 [unzip] extracting template/app/build.gradle.kts
  143. 09:57:41.949 [unzip] expanding template/app/build.gradle.kts to C:\Users\Hariton\AppData\Local\Temp\Corona Labs\CLtmpa07624\template\app\build.gradle.kts
  144. 09:57:41.949 [unzip] extracting template/gradle/wrapper/gradle-wrapper.properties
  145. 09:57:41.949 [unzip] expanding template/gradle/wrapper/gradle-wrapper.properties to C:\Users\Hariton\AppData\Local\Temp\Corona Labs\CLtmpa07624\template\gradle\wrapper\gradle-wrapper.properties
  146. 09:57:41.949 [unzip] extracting template/app/src/main/
  147. 09:57:41.949 [unzip] expanding template/app/src/main/ to C:\Users\Hariton\AppData\Local\Temp\Corona Labs\CLtmpa07624\template\app\src\main
  148. 09:57:41.949 [unzip] extracting sdk/licenses/android-sdk-license
  149. 09:57:41.949 [unzip] expanding sdk/licenses/android-sdk-license to C:\Users\Hariton\AppData\Local\Temp\Corona Labs\CLtmpa07624\sdk\licenses\android-sdk-license
  150. 09:57:41.949 [unzip] extracting template/app/buildTools/strings.xml
  151. 09:57:41.949 [unzip] expanding template/app/buildTools/strings.xml to C:\Users\Hariton\AppData\Local\Temp\Corona Labs\CLtmpa07624\template\app\buildTools\strings.xml
  152. 09:57:41.949 [unzip] extracting template/app/_corona_splash_screen.png
  153. 09:57:41.949 [unzip] expanding template/app/_corona_splash_screen.png to C:\Users\Hariton\AppData\Local\Temp\Corona Labs\CLtmpa07624\template\app\_corona_splash_screen.png
  154. 09:57:41.949 [unzip] extracting template/app/src/main/res/values/
  155. 09:57:41.949 [unzip] expanding template/app/src/main/res/values/ to C:\Users\Hariton\AppData\Local\Temp\Corona Labs\CLtmpa07624\template\app\src\main\res\values
  156. 09:57:41.949 [unzip] extracting template/
  157. 09:57:41.949 [unzip] expanding template/ to C:\Users\Hariton\AppData\Local\Temp\Corona Labs\CLtmpa07624\template
  158. 09:57:41.949 [unzip] extracting sdk/
  159. 09:57:41.949 [unzip] expanding sdk/ to C:\Users\Hariton\AppData\Local\Temp\Corona Labs\CLtmpa07624\sdk
  160. 09:57:41.949 [unzip] extracting template/gradlew
  161. 09:57:41.949 [unzip] expanding template/gradlew to C:\Users\Hariton\AppData\Local\Temp\Corona Labs\CLtmpa07624\template\gradlew
  162. 09:57:41.949 [unzip] extracting template/app/proguard-rules.pro
  163. 09:57:41.949 [unzip] expanding template/app/proguard-rules.pro to C:\Users\Hariton\AppData\Local\Temp\Corona Labs\CLtmpa07624\template\app\proguard-rules.pro
  164. 09:57:41.949 [unzip] extracting template/app/buildTools/update_manifest.lua
  165. 09:57:41.949 [unzip] expanding template/app/buildTools/update_manifest.lua to C:\Users\Hariton\AppData\Local\Temp\Corona Labs\CLtmpa07624\template\app\buildTools\update_manifest.lua
  166. 09:57:41.949 [unzip] extracting template/app/buildTools/convert_metadata.lua
  167. 09:57:41.949 [unzip] expanding template/app/buildTools/convert_metadata.lua to C:\Users\Hariton\AppData\Local\Temp\Corona Labs\CLtmpa07624\template\app\buildTools\convert_metadata.lua
  168. 09:57:41.949 [unzip] extracting template/app/src/main/res/
  169. 09:57:41.949 [unzip] expanding template/app/src/main/res/ to C:\Users\Hariton\AppData\Local\Temp\Corona Labs\CLtmpa07624\template\app\src\main\res
  170. 09:57:41.949 [unzip] extracting template/gradle/wrapper/
  171. 09:57:41.949 [unzip] expanding template/gradle/wrapper/ to C:\Users\Hariton\AppData\Local\Temp\Corona Labs\CLtmpa07624\template\gradle\wrapper
  172. 09:57:41.949 [unzip] extracting template/gradle/wrapper/gradle-wrapper.jar
  173. 09:57:41.949 [unzip] expanding template/gradle/wrapper/gradle-wrapper.jar to C:\Users\Hariton\AppData\Local\Temp\Corona Labs\CLtmpa07624\template\gradle\wrapper\gradle-wrapper.jar
  174. 09:57:41.949 [unzip] extracting template/settings.gradle.kts
  175. 09:57:41.949 [unzip] expanding template/settings.gradle.kts to C:\Users\Hariton\AppData\Local\Temp\Corona Labs\CLtmpa07624\template\settings.gradle.kts
  176. 09:57:41.949 [unzip] extracting template/app/src/
  177. 09:57:41.949 [unzip] expanding template/app/src/ to C:\Users\Hariton\AppData\Local\Temp\Corona Labs\CLtmpa07624\template\app\src
  178. 09:57:41.949 [unzip] extracting template/gradle/
  179. 09:57:41.949 [unzip] expanding template/gradle/ to C:\Users\Hariton\AppData\Local\Temp\Corona Labs\CLtmpa07624\template\gradle
  180. 09:57:41.949 [unzip] extracting template/app/src/main/res/values/strings.xml
  181. 09:57:41.949 [unzip] expanding template/app/src/main/res/values/strings.xml to C:\Users\Hariton\AppData\Local\Temp\Corona Labs\CLtmpa07624\template\app\src\main\res\values\strings.xml
  182. 09:57:41.949 [unzip] extracting template/app/buildTools/
  183. 09:57:41.949 [unzip] expanding template/app/buildTools/ to C:\Users\Hariton\AppData\Local\Temp\Corona Labs\CLtmpa07624\template\app\buildTools
  184. 09:57:41.949 [unzip] extracting template/build.gradle.kts
  185. 09:57:41.949 [unzip] expanding template/build.gradle.kts to C:\Users\Hariton\AppData\Local\Temp\Corona Labs\CLtmpa07624\template\build.gradle.kts
  186. 09:57:41.949 [unzip] extracting template/app/libs/licensing-google.jar
  187. 09:57:41.949 [unzip] expanding template/app/libs/licensing-google.jar to C:\Users\Hariton\AppData\Local\Temp\Corona Labs\CLtmpa07624\template\app\libs\licensing-google.jar
  188. 09:57:41.949 [unzip] extracting template/app/buildTools/AndroidManifest.template.xml
  189. 09:57:41.949 [unzip] expanding template/app/buildTools/AndroidManifest.template.xml to C:\Users\Hariton\AppData\Local\Temp\Corona Labs\CLtmpa07624\template\app\buildTools\AndroidManifest.template.xml
  190. 09:57:41.949 [unzip] extracting template/app/libs/
  191. 09:57:41.949 [unzip] expanding template/app/libs/ to C:\Users\Hariton\AppData\Local\Temp\Corona Labs\CLtmpa07624\template\app\libs
  192. 09:57:41.949 [unzip] extracting sdk/licenses/
  193. 09:57:41.949 [unzip] expanding sdk/licenses/ to C:\Users\Hariton\AppData\Local\Temp\Corona Labs\CLtmpa07624\sdk\licenses
  194. 09:57:41.949 [unzip] extracting template/setup.bat
  195. 09:57:41.949 [unzip] expanding template/setup.bat to C:\Users\Hariton\AppData\Local\Temp\Corona Labs\CLtmpa07624\template\setup.bat
  196. 09:57:41.949 [unzip] extracting template/app/src/main/AndroidManifest.xml
  197. 09:57:41.949 [unzip] expanding template/app/src/main/AndroidManifest.xml to C:\Users\Hariton\AppData\Local\Temp\Corona Labs\CLtmpa07624\template\app\src\main\AndroidManifest.xml
  198. 09:57:41.949 [unzip] expand complete
  199. 09:57:41.949 fileset: Setup scanner in dir C:\Program Files (x86)\Corona Labs\Corona\Native\Corona\android\lib\gradle with patternSet{ includes: [] excludes: [] }
  200. 09:57:41.949 [copy] Corona.aar added as Corona.aar doesn't exist.
  201. 09:57:41.949 [copy] added as is outdated.
  202. 09:57:41.949 [copy] Copying 1 file to C:\Users\Hariton\AppData\Local\Temp\Corona Labs\CLtmpa07624\template\app\libs
  203. 09:57:41.949 [copy] Copying C:\Program Files (x86)\Corona Labs\Corona\Native\Corona\android\lib\gradle\Corona.aar to C:\Users\Hariton\AppData\Local\Temp\Corona Labs\CLtmpa07624\template\app\libs\Corona.aar
  204. 09:57:41.949
  205. 09:57:41.949 build-input-zip:
  206. 09:57:41.949 Setting project property: USER_ZIP -> C:\Users\Hariton\AppData\Local\Temp\Corona Labs\CLtmpa07624/input.zip
  207. 09:57:41.949 fileset: Setup scanner in dir C:\Users\Hariton\AppData\Local\Temp\Corona Labs\CLtmpa07624 with patternSet{ includes: [] excludes: [resource.car] }
  208. 09:57:41.949 [zip] Building zip: C:\Users\Hariton\AppData\Local\Temp\Corona Labs\CLtmpa07624\input.zip
  209. 09:57:41.949 [zip] adding directory sdk/
  210. 09:57:41.949 [zip] adding directory sdk/licenses/
  211. 09:57:41.949 [zip] adding directory template/
  212. 09:57:41.949 [zip] adding directory template/app/
  213. 09:57:41.949 [zip] adding directory template/app/buildTools/
  214. 09:57:41.949 [zip] adding directory template/app/libs/
  215. 09:57:41.949 [zip] adding directory template/app/src/
  216. 09:57:41.949 [zip] adding directory template/app/src/main/
  217. 09:57:41.949 [zip] adding directory template/app/src/main/res/
  218. 09:57:41.949 [zip] adding directory template/app/src/main/res/values/
  219. 09:57:41.949 [zip] adding directory template/gradle/
  220. 09:57:41.949 [zip] adding directory template/gradle/wrapper/
  221. 09:57:41.949 [zip] adding entry app.data.data_source.lu
  222. 09:57:41.949 [zip] adding entry app.data.my_api.lu
  223. 09:57:41.949 [zip] adding entry app.fragments.setup.setup.lu
  224. 09:57:41.949 [zip] adding entry app.fragments.setup.setup_view.lu
  225. 09:57:41.949 [zip] adding entry app.fragments.statistics.statistics.lu
  226. 09:57:41.949 [zip] adding entry app.fragments.statistics.statistics_view.lu
  227. 09:57:41.949 [zip] adding entry app.fragments.test_1.test_1.lu
  228. 09:57:41.949 [zip] adding entry app.fragments.test_1.test_1_view.lu
  229. 09:57:41.950 [zip] adding entry app.fragments.test_2.test_2.lu
  230. 09:57:41.950 [zip] adding entry app.fragments.test_2.test_2_view.lu
  231. 09:57:41.950 [zip] adding entry app.fragments.userinfo.userinfo.lu
  232. 09:57:41.950 [zip] adding entry app.fragments.userinfo.userinfo_view.lu
  233. 09:57:41.950 [zip] adding entry app.scenes.details.details.lu
  234. 09:57:41.950 [zip] adding entry app.scenes.details.details_view.lu
  235. 09:57:41.950 [zip] adding entry app.scenes.error.error.lu
  236. 09:57:41.950 [zip] adding entry app.scenes.error.error_view.lu
  237. 09:57:41.950 [zip] adding entry app.scenes.force_update.force_update.lu
  238. 09:57:41.950 [zip] adding entry app.scenes.force_update.force_update_view.lu
  239. 09:57:41.950 [zip] adding entry app.scenes.grid.grid.lu
  240. 09:57:41.950 [zip] adding entry app.scenes.grid.grid_view.lu
  241. 09:57:41.950 [zip] adding entry app.scenes.guids.guids.lu
  242. 09:57:41.950 [zip] adding entry app.scenes.guids.guids_view.lu
  243. 09:57:41.950 [zip] adding entry app.scenes.login.login.lu
  244. 09:57:41.950 [zip] adding entry app.scenes.login.login_view.lu
  245. 09:57:41.950 [zip] adding entry app.scenes.pay.pay.lu
  246. 09:57:41.950 [zip] adding entry app.scenes.pay.pay_view.lu
  247. 09:57:41.950 [zip] adding entry app.scenes.splash.old_splash.lu
  248. 09:57:41.950 [zip] adding entry app.scenes.splash.old_splash_view.lu
  249. 09:57:41.950 [zip] adding entry app.scenes.splash.splash.lu
  250. 09:57:41.950 [zip] adding entry app.scenes.splash.splash_view.lu
  251. 09:57:41.950 [zip] adding entry app.scenes.support.support.lu
  252. 09:57:41.950 [zip] adding entry app.scenes.support.support_view.lu
  253. 09:57:41.950 [zip] adding entry app.scenes.userinfo.userinfo.lu
  254. 09:57:41.950 [zip] adding entry app.scenes.userinfo.userinfo_view.lu
  255. 09:57:41.950 [zip] adding entry build.properties
  256. 09:57:41.950 [zip] adding entry config.lu
  257. 09:57:41.950 [zip] adding entry excludesfile.properties
  258. 09:57:41.950 [zip] adding entry main.lu
  259. 09:57:41.950 [zip] adding entry myapi.lu
  260. 09:57:41.950 [zip] adding entry scripts.convertcolor.lu
  261. 09:57:41.950 [zip] adding entry scripts.funx.lu
  262. 09:57:41.950 [zip] adding entry sdk/licenses/android-sdk-license
  263. 09:57:41.950 [zip] adding entry template/app/_corona_splash_screen.png
  264. 09:57:41.950 [zip] adding entry template/app/build.gradle.kts
  265. 09:57:41.950 [zip] adding entry template/app/buildTools/AndroidManifest.template.xml
  266. 09:57:41.950 [zip] adding entry template/app/buildTools/convert_metadata.lua
  267. 09:57:41.950 [zip] adding entry template/app/buildTools/strings.xml
  268. 09:57:41.950 [zip] adding entry template/app/buildTools/update_manifest.lua
  269. 09:57:41.950 [zip] adding entry template/app/libs/Corona.aar
  270. 09:57:41.950 [zip] adding entry template/app/libs/licensing-google.jar
  271. 09:57:41.950 [zip] adding entry template/app/proguard-rules.pro
  272. 09:57:41.950 [zip] adding entry template/app/src/main/AndroidManifest.xml
  273. 09:57:41.950 [zip] adding entry template/app/src/main/res/values/strings.xml
  274. 09:57:41.950 [zip] adding entry template/build.gradle.kts
  275. 09:57:41.950 [zip] adding entry template/gradle.properties
  276. 09:57:41.950 [zip] adding entry template/gradle/wrapper/gradle-wrapper.jar
  277. 09:57:41.950 [zip] adding entry template/gradle/wrapper/gradle-wrapper.properties
  278. 09:57:41.950 [zip] adding entry template/gradlew
  279. 09:57:41.950 [zip] adding entry template/gradlew.bat
  280. 09:57:41.950 [zip] adding entry template/settings.gradle.kts
  281. 09:57:41.950 [zip] adding entry template/setup.bat
  282. 09:57:41.950 [zip] adding entry template/setup.sh
  283. 09:57:41.950
  284. 09:57:41.950 BUILD SUCCESSFUL
  285. 09:57:41.950 Total time: 3 seconds
  286. 09:57:41.960 DeviceBuildData: {"isLaunchPadActive":false,"targetCertType":"distribution","targetPlatformVersion":140300,"debugBuildProcess":5,"targetDevice":0,"splashScreen":{"enable":false},"dailyBuildRevision":3564,"buildBucket":"ansca-templates","clientPlatform":"Win","targetAppStore":"google","targetPlatform":1,"clientDeviceId":"454bf7af3900ec293b5c4d05246908f5","plugins":{"plugin.app_framework":{"publisherId":"maciej.czekala"},"plugin.notifications.v2":{"publisherId":"com.coronalabs"},"plugin.ui_framework":{"publisherId":"com.skyjoy"}},"dailyBuildYear":2019,"clientProductId":"basic","appName":"Мой EvpaNet"}
  287. 09:57:41.960 Build: running: cd /d "C:\Users\Hariton\AppData\Local\Temp\Corona Labs\CLtmpa07624" && cd template && setup.bat && gradlew.bat buildCoronaApp --no-daemon -PconfigureCoronaPlugins=YES -PcoronaBuild=2019.3564 -PcoronaResourcesDir="C:\Program Files (x86)\Corona Labs\Corona\Resources" -PcoronaDstDir="C:\Users\Hariton\Documents\Corona Built Apps" -PcoronaTmpDir="C:\Users\Hariton\AppData\Local\Temp\Corona Labs\CLtmpa07624" -PcoronaSrcDir="C:\Users\Hariton\Documents\Corona Projects\myEvpaNet" -PcoronaAppFileName="Мой EvpaNet" -PcoronaAppPackage="com.evpanet.app" -PcoronaVersionCode=1 -PcoronaVersionName="0.9.0" -PcoronaKeystore="C:\Users\Hariton\Documents\Corona Projects\myevpanet.keystore" -PcoronaKeystorePassword="XXXXXX" -PcoronaKeyAlias="evpanet" -PcoronaTargetStore="google" -PcoronaKeyAliasPassword="XXXXXX" -PcoronaBuildData="C:\Users\Hariton\AppData\Local\Temp\Corona Labs\CLtmpa07624\build.data" --console=plain
  288. 09:58:36.824 @ver > NUL
  289. 09:58:36.824 Picked up JAVA_TOOL_OPTIONS: -Duser.language=en
  290. 09:58:36.824 Exception in thread "DisconnectableInputStream source reader" org.gradle.api.UncheckedIOException: java.io.IOException:
  291. 09:58:36.824 at org.gradle.internal.UncheckedException.throwAsUncheckedException(UncheckedException.java:61)
  292. 09:58:36.824 at org.gradle.internal.UncheckedException.throwAsUncheckedException(UncheckedException.java:41)
  293. 09:58:36.824 at org.gradle.util.DisconnectableInputStream$1.run(DisconnectableInputStream.java:125)
  294. 09:58:36.824 at java.base/java.lang.Thread.run(Thread.java:830)
  295. 09:58:36.824 Caused by: java.io.IOException:
  296. 09:58:36.824 at java.base/java.io.FileInputStream.readBytes(Native Method)
  297. 09:58:36.824 at java.base/java.io.FileInputStream.read(FileInputStream.java:273)
  298. 09:58:36.824 at java.base/java.io.BufferedInputStream.fill(BufferedInputStream.java:245)
  299. 09:58:36.824 at java.base/java.io.BufferedInputStream.read1(BufferedInputStream.java:285)
  300. 09:58:36.824 at java.base/java.io.BufferedInputStream.read(BufferedInputStream.java:344)
  301. 09:58:36.824 at org.gradle.util.DisconnectableInputStream$1.run(DisconnectableInputStream.java:96)
  302. 09:58:36.824 ... 1 more
  303. 09:58:36.824 ERROR: configuring 'shared.firebase.messaging_com.coronalabs' failed!
  304. 09:58:36.824
  305. 09:58:36.824 FAILURE: Build failed with an exception.
  306. 09:58:36.824
  307. 09:58:36.824 * Where:
  308. 09:58:36.824 Build file 'C:\Users\Hariton\AppData\Local\Temp\Corona Labs\CLtmpa07624\template\app\build.gradle.kts' line: 277
  309. 09:58:36.824
  310. 09:58:36.824 * What went wrong:
  311. 09:58:36.824 Could not open dsl remapped class cache for 21tjb5jf7wgv11saot1wddt1t (C:\Users\Hariton\.gradle\caches\5.4.1\scripts-remapped\corona_1mcyfgf063dxxu3kir3ioxl0\21tjb5jf7wgv11saot1wddt1t\dsldcd040730888da95d185715568c9cc57).
  312. 09:58:36.824 > Could not open dsl generic class cache for script 'C:\Users\Hariton\AppData\Local\Temp\Corona Labs\CLtmpa07624\template\app\build\corona-plugins\shared.firebase.messaging_com.coronalabs\corona.gradle' (C:\Users\Hariton\.gradle\caches\5.4.1\scripts\21tjb5jf7wgv11saot1wddt1t\dsl\dsldcd040730888da95d185715568c9cc57).
  313. 09:58:36.824 > Could not compile script 'C:\Users\Hariton\AppData\Local\Temp\Corona Labs\CLtmpa07624\template\app\build\corona-plugins\shared.firebase.messaging_com.coronalabs\corona.gradle'.
  314. 09:58:36.824 > startup failed:
  315. 09:58:36.824 General error during semantic analysis: Unsupported class file major version 57
  316. 09:58:36.824
  317. 09:58:36.824 java.lang.IllegalArgumentException: Unsupported class file major version 57
  318. 09:58:36.824 at groovyjarjarasm.asm.ClassReader.<init>(ClassReader.java:184)
  319. 09:58:36.824 at groovyjarjarasm.asm.ClassReader.<init>(ClassReader.java:166)
  320. 09:58:36.824 at groovyjarjarasm.asm.ClassReader.<init>(ClassReader.java:152)
  321. 09:58:36.824 at groovyjarjarasm.asm.ClassReader.<init>(ClassReader.java:273)
  322. 09:58:36.824 at org.codehaus.groovy.ast.decompiled.AsmDecompiler.parseClass(AsmDecompiler.java:81)
  323. 09:58:36.824 at org.codehaus.groovy.control.ClassNodeResolver.findDecompiled(ClassNodeResolver.java:254)
  324. 09:58:36.824 at org.codehaus.groovy.control.ClassNodeResolver.tryAsLoaderClassOrScript(ClassNodeResolver.java:192)
  325. 09:58:36.824 at org.codehaus.groovy.control.ClassNodeResolver.findClassNode(ClassNodeResolver.java:172)
  326. 09:58:36.824 at org.codehaus.groovy.control.ClassNodeResolver.resolveName(ClassNodeResolver.java:128)
  327. 09:58:36.824 at org.codehaus.groovy.ast.decompiled.AsmReferenceResolver.resolveClassNullable(AsmReferenceResolver.java:59)
  328. 09:58:36.824 at org.codehaus.groovy.ast.decompiled.AsmReferenceResolver.resolveClass(AsmReferenceResolver.java:46)
  329. 09:58:36.824 at org.codehaus.groovy.ast.decompiled.AsmReferenceResolver.resolveNonArrayType(AsmReferenceResolver.java:81)
  330. 09:58:36.824 at org.codehaus.groovy.ast.decompiled.AsmReferenceResolver.resolveType(AsmReferenceResolver.java:72)
  331. 09:58:36.824 at org.codehaus.groovy.ast.decompiled.MemberSignatureParser.createMethodNode(MemberSignatureParser.java:55)
  332. 09:58:36.824 at org.codehaus.groovy.ast.decompiled.DecompiledClassNode.lazyInitMembers(DecompiledClassNode.java:195)
  333. 09:58:36.824 at org.codehaus.groovy.ast.decompiled.DecompiledClassNode.getDeclaredMethods(DecompiledClassNode.java:121)
  334. 09:58:36.824 at org.codehaus.groovy.ast.ClassNode.getMethods(ClassNode.java:912)
  335. 09:58:36.824 at org.codehaus.groovy.ast.ClassNode.tryFindPossibleMethod(ClassNode.java:1280)
  336. 09:58:36.824 at org.codehaus.groovy.control.StaticImportVisitor.transformMethodCallExpression(StaticImportVisitor.java:252)
  337. 09:58:36.824 at org.codehaus.groovy.control.StaticImportVisitor.transform(StaticImportVisitor.java:112)
  338. 09:58:36.824 at org.codehaus.groovy.ast.ClassCodeExpressionTransformer.visitExpressionStatement(ClassCodeExpressionTransformer.java:144)
  339. 09:58:36.824 at org.codehaus.groovy.ast.stmt.ExpressionStatement.visit(ExpressionStatement.java:42)
  340. 09:58:36.824 at org.codehaus.groovy.ast.ClassCodeVisitorSupport.visitClassCodeContainer(ClassCodeVisitorSupport.java:110)
  341. 09:58:36.824 at org.codehaus.groovy.ast.ClassCodeVisitorSupport.visitConstructorOrMethod(ClassCodeVisitorSupport.java:121)
  342. 09:58:36.824 at org.codehaus.groovy.ast.ClassCodeExpressionTransformer.visitConstructorOrMethod(ClassCodeExpressionTransformer.java:55)
  343. 09:58:36.824 at org.codehaus.groovy.control.StaticImportVisitor.visitConstructorOrMethod(StaticImportVisitor.java:88)
  344. 09:58:36.824 at org.codehaus.groovy.ast.ClassCodeVisitorSupport.visitConstructor(ClassCodeVisitorSupport.java:128)
  345. 09:58:36.824 at org.codehaus.groovy.ast.ClassNode.visitContents(ClassNode.java:1099)
  346. 09:58:36.824 at org.codehaus.groovy.ast.ClassCodeVisitorSupport.visitClass(ClassCodeVisitorSupport.java:54)
  347. 09:58:36.824 at org.codehaus.groovy.control.StaticImportVisitor.visitClass(StaticImportVisitor.java:82)
  348. 09:58:36.824 at org.codehaus.groovy.control.CompilationUnit$14.call(CompilationUnit.java:717)
  349. 09:58:36.824 at org.codehaus.groovy.control.CompilationUnit.applyToPrimaryClassNodes(CompilationUnit.java:1095)
  350. 09:58:36.824 at org.codehaus.groovy.control.CompilationUnit.doPhaseOperation(CompilationUnit.java:649)
  351. 09:58:36.824 at org.codehaus.groovy.control.CompilationUnit.processPhaseOperations(CompilationUnit.java:627)
  352. 09:58:36.824 at org.codehaus.groovy.control.CompilationUnit.compile(CompilationUnit.java:604)
  353. 09:58:36.824 at groovy.lang.GroovyClassLoader.doParseClass(GroovyClassLoader.java:390)
  354. 09:58:36.824 at groovy.lang.GroovyClassLoader.access$300(GroovyClassLoader.java:89)
  355. 09:58:36.824 at groovy.lang.GroovyClassLoader$5.provide(GroovyClassLoader.java:330)
  356. 09:58:36.824 at groovy.lang.GroovyClassLoader$5.provide(GroovyClassLoader.java:327)
  357. 09:58:36.824 at org.codehaus.groovy.runtime.memoize.ConcurrentCommonCache.getAndPut(ConcurrentCommonCache.java:147)
  358. 09:58:36.824 at groovy.lang.GroovyClassLoader.parseClass(GroovyClassLoader.java:325)
  359. 09:58:36.824 at org.gradle.groovy.scripts.internal.DefaultScriptCompilationHandler.compileScript(DefaultScriptCompilationHandler.java:133)
  360. 09:58:36.824 at org.gradle.groovy.scripts.internal.DefaultScriptCompilationHandler.compileToDir(DefaultScriptCompilationHandler.java:93)
  361. 09:58:36.824 at org.gradle.groovy.scripts.internal.BuildOperationBackedScriptCompilationHandler$2.run(BuildOperationBackedScriptCompilationHandler.java:54)
  362. 09:58:36.824 at org.gradle.internal.operations.DefaultBuildOperationExecutor$RunnableBuildOperationWorker.execute(DefaultBuildOperationExecutor.java:402)
  363. 09:58:36.824 at org.gradle.internal.operations.DefaultBuildOperationExecutor$RunnableBuildOperationWorker.execute(DefaultBuildOperationExecutor.java:394)
  364. 09:58:36.824 at org.gradle.internal.operations.DefaultBuildOperationExecutor$1.execute(DefaultBuildOperationExecutor.java:165)
  365. 09:58:36.824 at org.gradle.internal.operations.DefaultBuildOperationExecutor.execute(DefaultBuildOperationExecutor.java:250)
  366. 09:58:36.824 at org.gradle.internal.operations.DefaultBuildOperationExecutor.execute(DefaultBuildOperationExecutor.java:158)
  367. 09:58:36.824 at org.gradle.internal.operations.DefaultBuildOperationExecutor.run(DefaultBuildOperationExecutor.java:92)
  368. 09:58:36.824 at org.gradle.internal.operations.DelegatingBuildOperationExecutor.run(DelegatingBuildOperationExecutor.java:31)
  369. 09:58:36.824 at org.gradle.groovy.scripts.internal.BuildOperationBackedScriptCompilationHandler.compileToDir(BuildOperationBackedScriptCompilationHandler.java:51)
  370. 09:58:36.824 at org.gradle.groovy.scripts.internal.FileCacheBackedScriptClassCompiler$CompileToCrossBuildCacheAction.execute(FileCacheBackedScriptClassCompiler.java:151)
  371. 09:58:36.824 at org.gradle.groovy.scripts.internal.FileCacheBackedScriptClassCompiler$CompileToCrossBuildCacheAction.execute(FileCacheBackedScriptClassCompiler.java:132)
  372. 09:58:36.824 at org.gradle.groovy.scripts.internal.FileCacheBackedScriptClassCompiler$ProgressReportingInitializer.execute(FileCacheBackedScriptClassCompiler.java:175)
  373. 09:58:36.824 at org.gradle.groovy.scripts.internal.FileCacheBackedScriptClassCompiler$ProgressReportingInitializer.execute(FileCacheBackedScriptClassCompiler.java:155)
  374. 09:58:36.824 at org.gradle.cache.internal.DefaultPersistentDirectoryCache$Initializer.initialize(DefaultPersistentDirectoryCache.java:98)
  375. 09:58:36.824 at org.gradle.cache.internal.FixedSharedModeCrossProcessCacheAccess$1.run(FixedSharedModeCrossProcessCacheAccess.java:85)
  376. 09:58:36.824 at org.gradle.cache.internal.DefaultFileLockManager$DefaultFileLock.doWriteAction(DefaultFileLockManager.java:207)
  377. 09:58:36.824 at org.gradle.cache.internal.DefaultFileLockManager$DefaultFileLock.writeFile(DefaultFileLockManager.java:197)
  378. 09:58:36.824 at org.gradle.cache.internal.FixedSharedModeCrossProcessCacheAccess.open(FixedSharedModeCrossProcessCacheAccess.java:83)
  379. 09:58:36.824 at org.gradle.cache.internal.DefaultCacheAccess.open(DefaultCacheAccess.java:142)
  380. 09:58:36.824 at org.gradle.cache.internal.DefaultPersistentDirectoryStore.open(DefaultPersistentDirectoryStore.java:78)
  381. 09:58:36.824 at org.gradle.cache.internal.DefaultPersistentDirectoryStore.open(DefaultPersistentDirectoryStore.java:42)
  382. 09:58:36.824 at org.gradle.cache.internal.DefaultCacheFactory.doOpen(DefaultCacheFactory.java:94)
  383. 09:58:36.824 at org.gradle.cache.internal.DefaultCacheFactory.open(DefaultCacheFactory.java:68)
  384. 09:58:36.824 at org.gradle.cache.internal.DefaultCacheRepository$PersistentCacheBuilder.open(DefaultCacheRepository.java:118)
  385. 09:58:36.824 at org.gradle.groovy.scripts.internal.FileCacheBackedScriptClassCompiler$RemapBuildScriptsAction.execute(FileCacheBackedScriptClassCompiler.java:421)
  386. 09:58:36.824 at org.gradle.groovy.scripts.internal.FileCacheBackedScriptClassCompiler$RemapBuildScriptsAction.execute(FileCacheBackedScriptClassCompiler.java:390)
  387. 09:58:36.840 at org.gradle.groovy.scripts.internal.FileCacheBackedScriptClassCompiler$ProgressReportingInitializer.execute(FileCacheBackedScriptClassCompiler.java:175)
  388. 09:58:36.840 at org.gradle.groovy.scripts.internal.FileCacheBackedScriptClassCompiler$ProgressReportingInitializer.execute(FileCacheBackedScriptClassCompiler.java:155)
  389. 09:58:36.840 at org.gradle.cache.internal.DefaultPersistentDirectoryCache$Initializer.initialize(DefaultPersistentDirectoryCache.java:98)
  390. 09:58:36.840 at org.gradle.cache.internal.FixedSharedModeCrossProcessCacheAccess$1.run(FixedSharedModeCrossProcessCacheAccess.java:85)
  391. 09:58:36.840 at org.gradle.cache.internal.DefaultFileLockManager$DefaultFileLock.doWriteAction(DefaultFileLockManager.java:207)
  392. 09:58:36.840 at org.gradle.cache.internal.DefaultFileLockManager$DefaultFileLock.writeFile(DefaultFileLockManager.java:197)
  393. 09:58:36.840 at org.gradle.cache.internal.FixedSharedModeCrossProcessCacheAccess.open(FixedSharedModeCrossProcessCacheAccess.java:83)
  394. 09:58:36.840 at org.gradle.cache.internal.DefaultCacheAccess.open(DefaultCacheAccess.java:142)
  395. 09:58:36.840 at org.gradle.cache.internal.DefaultPersistentDirectoryStore.open(DefaultPersistentDirectoryStore.java:78)
  396. 09:58:36.840 at org.gradle.cache.internal.DefaultPersistentDirectoryStore.open(DefaultPersistentDirectoryStore.java:42)
  397. 09:58:36.840 at org.gradle.cache.internal.DefaultCacheFactory.doOpen(DefaultCacheFactory.java:94)
  398. 09:58:36.840 at org.gradle.cache.internal.DefaultCacheFactory.open(DefaultCacheFactory.java:68)
  399. 09:58:36.840 at org.gradle.cache.internal.DefaultCacheRepository$PersistentCacheBuilder.open(DefaultCacheRepository.java:118)
  400. 09:58:36.840 at org.gradle.groovy.scripts.internal.FileCacheBackedScriptClassCompiler.compile(FileCacheBackedScriptClassCompiler.java:105)
  401. 09:58:36.840 at org.gradle.groovy.scripts.internal.CrossBuildInMemoryCachingScriptClassCache.getOrCompile(CrossBuildInMemoryCachingScriptClassCache.java:49)
  402. 09:58:36.840 at org.gradle.groovy.scripts.internal.BuildScopeInMemoryCachingScriptClassCompiler.compile(BuildScopeInMemoryCachingScriptClassCompiler.java:50)
  403. 09:58:36.840 at org.gradle.groovy.scripts.DefaultScriptCompilerFactory$ScriptCompilerImpl.compile(DefaultScriptCompilerFactory.java:50)
  404. 09:58:36.840 at org.gradle.configuration.DefaultScriptPluginFactory$ScriptPluginImpl.apply(DefaultScriptPluginFactory.java:211)
  405. 09:58:36.840 at org.gradle.configuration.BuildOperationScriptPlugin$1$1.run(BuildOperationScriptPlugin.java:69)
  406. 09:58:36.840 at org.gradle.internal.operations.DefaultBuildOperationExecutor$RunnableBuildOperationWorker.execute(DefaultBuildOperationExecutor.java:402)
  407. 09:58:36.840 at org.gradle.internal.operations.DefaultBuildOperationExecutor$RunnableBuildOperationWorker.execute(DefaultBuildOperationExecutor.java:394)
  408. 09:58:36.840 at org.gradle.internal.operations.DefaultBuildOperationExecutor$1.execute(DefaultBuildOperationExecutor.java:165)
  409. 09:58:36.840 at org.gradle.internal.operations.DefaultBuildOperationExecutor.execute(DefaultBuildOperationExecutor.java:250)
  410. 09:58:36.840 at org.gradle.internal.operations.DefaultBuildOperationExecutor.execute(DefaultBuildOperationExecutor.java:158)
  411. 09:58:36.840 at org.gradle.internal.operations.DefaultBuildOperationExecutor.run(DefaultBuildOperationExecutor.java:92)
  412. 09:58:36.840 at org.gradle.internal.operations.DelegatingBuildOperationExecutor.run(DelegatingBuildOperationExecutor.java:31)
  413. 09:58:36.840 at org.gradle.configuration.BuildOperationScriptPlugin$1.execute(BuildOperationScriptPlugin.java:66)
  414. 09:58:36.840 at org.gradle.configuration.BuildOperationScriptPlugin$1.execute(BuildOperationScriptPlugin.java:63)
  415. 09:58:36.840 at org.gradle.configuration.internal.DefaultUserCodeApplicationContext.apply(DefaultUserCodeApplicationContext.java:48)
  416. 09:58:36.840 at org.gradle.configuration.BuildOperationScriptPlugin.apply(BuildOperationScriptPlugin.java:63)
  417. 09:58:36.840 at org.gradle.api.internal.plugins.DefaultObjectConfigurationAction.applyScript(DefaultObjectConfigurationAction.java:109)
  418. 09:58:36.840 at org.gradle.api.internal.plugins.DefaultObjectConfigurationAction.access$000(DefaultObjectConfigurationAction.java:38)
  419. 09:58:36.840 at org.gradle.api.internal.plugins.DefaultObjectConfigurationAction$1.run(DefaultObjectConfigurationAction.java:68)
  420. 09:58:36.840 at org.gradle.api.internal.plugins.DefaultObjectConfigurationAction.execute(DefaultObjectConfigurationAction.java:143)
  421. 09:58:36.840 at org.gradle.api.internal.project.AbstractPluginAware.apply(AbstractPluginAware.java:40)
  422. 09:58:36.840 at org.gradle.kotlin.dsl.support.delegates.ProjectDelegate.apply(ProjectDelegate.kt:344)
  423. 09:58:36.840 at org.gradle.kotlin.dsl.PluginAwareExtensionsKt.apply(PluginAwareExtensions.kt:33)
  424. 09:58:36.840 at org.gradle.kotlin.dsl.PluginAwareExtensionsKt.apply$default(PluginAwareExtensions.kt:31)
  425. 09:58:36.840 at Build_gradle.processPluginGradleScripts(build.gradle.kts:277)
  426. 09:58:36.840 at Build_gradle.downloadAndProcessCoronaPlugins(build.gradle.kts:607)
  427. 09:58:36.840 at Build_gradle.downloadAndProcessCoronaPlugins$default(build.gradle.kts:550)
  428. 09:58:36.840 at Build_gradle.<init>(build.gradle.kts:179)
  429. 09:58:36.840 at Program.execute(Unknown Source)
  430. 09:58:36.840 at org.gradle.kotlin.dsl.execution.Interpreter$ProgramHost.eval(Interpreter.kt:506)
  431. 09:58:36.855 at org.gradle.kotlin.dsl.execution.Interpreter$ProgramHost.evaluateSecondStageOf(Interpreter.kt:422)
  432. 09:58:36.855 at Program.execute(Unknown Source)
  433. 09:58:36.855 at org.gradle.kotlin.dsl.execution.Interpreter$ProgramHost.eval(Interpreter.kt:506)
  434. 09:58:36.855 at org.gradle.kotlin.dsl.execution.Interpreter.eval(Interpreter.kt:206)
  435. 09:58:36.855 at org.gradle.kotlin.dsl.provider.StandardKotlinScriptEvaluator.evaluate(KotlinScriptEvaluator.kt:114)
  436. 09:58:36.855 at org.gradle.kotlin.dsl.provider.KotlinScriptPluginFactory$create$1.invoke(KotlinScriptPluginFactory.kt:51)
  437. 09:58:36.855 at org.gradle.kotlin.dsl.provider.KotlinScriptPluginFactory$create$1.invoke(KotlinScriptPluginFactory.kt:36)
  438. 09:58:36.855 at org.gradle.kotlin.dsl.provider.KotlinScriptPlugin.apply(KotlinScriptPlugin.kt:34)
  439. 09:58:36.855 at org.gradle.configuration.BuildOperationScriptPlugin$1$1.run(BuildOperationScriptPlugin.java:69)
  440. 09:58:36.855 at org.gradle.internal.operations.DefaultBuildOperationExecutor$RunnableBuildOperationWorker.execute(DefaultBuildOperationExecutor.java:402)
  441. 09:58:36.855 at org.gradle.internal.operations.DefaultBuildOperationExecutor$RunnableBuildOperationWorker.execute(DefaultBuildOperationExecutor.java:394)
  442. 09:58:36.855 at org.gradle.internal.operations.DefaultBuildOperationExecutor$1.execute(DefaultBuildOperationExecutor.java:165)
  443. 09:58:36.855 at org.gradle.internal.operations.DefaultBuildOperationExecutor.execute(DefaultBuildOperationExecutor.java:250)
  444. 09:58:36.855 at org.gradle.internal.operations.DefaultBuildOperationExecutor.execute(DefaultBuildOperationExecutor.java:158)
  445. 09:58:36.855 at org.gradle.internal.operations.DefaultBuildOperationExecutor.run(DefaultBuildOperationExecutor.java:92)
  446. 09:58:36.855 at org.gradle.internal.operations.DelegatingBuildOperationExecutor.run(DelegatingBuildOperationExecutor.java:31)
  447. 09:58:36.855 at org.gradle.configuration.BuildOperationScriptPlugin$1.execute(BuildOperationScriptPlugin.java:66)
  448. 09:58:36.855 at org.gradle.configuration.BuildOperationScriptPlugin$1.execute(BuildOperationScriptPlugin.java:63)
  449. 09:58:36.855 at org.gradle.configuration.internal.DefaultUserCodeApplicationContext.apply(DefaultUserCodeApplicationContext.java:48)
  450. 09:58:36.855 at org.gradle.configuration.BuildOperationScriptPlugin.apply(BuildOperationScriptPlugin.java:63)
  451. 09:58:36.855 at org.gradle.configuration.project.BuildScriptProcessor$1.run(BuildScriptProcessor.java:44)
  452. 09:58:36.855 at org.gradle.internal.Factories$1.create(Factories.java:25)
  453. 09:58:36.855 at org.gradle.api.internal.project.DefaultProjectStateRegistry$ProjectStateImpl.withMutableState(DefaultProjectStateRegistry.java:200)
  454. 09:58:36.855 at org.gradle.api.internal.project.DefaultProjectStateRegistry$ProjectStateImpl.withMutableState(DefaultProjectStateRegistry.java:186)
  455. 09:58:36.855 at org.gradle.configuration.project.BuildScriptProcessor.execute(BuildScriptProcessor.java:41)
  456. 09:58:36.855 at org.gradle.configuration.project.BuildScriptProcessor.execute(BuildScriptProcessor.java:26)
  457. 09:58:36.855 at org.gradle.configuration.project.ConfigureActionsProjectEvaluator.evaluate(ConfigureActionsProjectEvaluator.java:34)
  458. 09:58:36.855 at org.gradle.configuration.project.LifecycleProjectEvaluator$EvaluateProject$1.run(LifecycleProjectEvaluator.java:106)
  459. 09:58:36.855 at org.gradle.internal.Factories$1.create(Factories.java:25)
  460. 09:58:36.855 at org.gradle.internal.work.DefaultWorkerLeaseService.withLocks(DefaultWorkerLeaseService.java:183)
  461. 09:58:36.855 at org.gradle.internal.work.StopShieldingWorkerLeaseService.withLocks(StopShieldingWorkerLeaseService.java:40)
  462. 09:58:36.855 at org.gradle.api.internal.project.DefaultProjectStateRegistry$ProjectStateImpl.withProjectLock(DefaultProjectStateRegistry.java:226)
  463. 09:58:36.855 at org.gradle.api.internal.project.DefaultProjectStateRegistry$ProjectStateImpl.withMutableState(DefaultProjectStateRegistry.java:220)
  464. 09:58:36.855 at org.gradle.api.internal.project.DefaultProjectStateRegistry$ProjectStateImpl.withMutableState(DefaultProjectStateRegistry.java:186)
  465. 09:58:36.855 at org.gradle.configuration.project.LifecycleProjectEvaluator$EvaluateProject.run(LifecycleProjectEvaluator.java:95)
  466. 09:58:36.855 at org.gradle.internal.operations.DefaultBuildOperationExecutor$RunnableBuildOperationWorker.execute(DefaultBuildOperationExecutor.java:402)
  467. 09:58:36.855 at org.gradle.internal.operations.DefaultBuildOperationExecutor$RunnableBuildOperationWorker.execute(DefaultBuildOperationExecutor.java:394)
  468. 09:58:36.855 at org.gradle.internal.operations.DefaultBuildOperationExecutor$1.execute(DefaultBuildOperationExecutor.java:165)
  469. 09:58:36.855 at org.gradle.internal.operations.DefaultBuildOperationExecutor.execute(DefaultBuildOperationExecutor.java:250)
  470. 09:58:36.855 at org.gradle.internal.operations.DefaultBuildOperationExecutor.execute(DefaultBuildOperationExecutor.java:158)
  471. 09:58:36.855 at org.gradle.internal.operations.DefaultBuildOperationExecutor.run(DefaultBuildOperationExecutor.java:92)
  472. 09:58:36.855 at org.gradle.internal.operations.DelegatingBuildOperationExecutor.run(DelegatingBuildOperationExecutor.java:31)
  473. 09:58:36.855 at org.gradle.configuration.project.LifecycleProjectEvaluator.evaluate(LifecycleProjectEvaluator.java:67)
  474. 09:58:36.855 at org.gradle.api.internal.project.DefaultProject.evaluate(DefaultProject.java:695)
  475. 09:58:36.856 at org.gradle.api.internal.project.DefaultProject.evaluate(DefaultProject.java:143)
  476. 09:58:36.856 at org.gradle.execution.TaskPathProjectEvaluator.configure(TaskPathProjectEvaluator.java:35)
  477. 09:58:36.856 at org.gradle.execution.TaskPathProjectEvaluator.configureHierarchy(TaskPathProjectEvaluator.java:62)
  478. 09:58:36.856 at org.gradle.configuration.DefaultBuildConfigurer.configure(DefaultBuildConfigurer.java:41)
  479. 09:58:36.856 at org.gradle.initialization.DefaultGradleLauncher$ConfigureBuild.run(DefaultGradleLauncher.java:302)
  480. 09:58:36.856 at org.gradle.internal.operations.DefaultBuildOperationExecutor$RunnableBuildOperationWorker.execute(DefaultBuildOperationExecutor.java:402)
  481. 09:58:36.856 at org.gradle.internal.operations.DefaultBuildOperationExecutor$RunnableBuildOperationWorker.execute(DefaultBuildOperationExecutor.java:394)
  482. 09:58:36.856 at org.gradle.internal.operations.DefaultBuildOperationExecutor$1.execute(DefaultBuildOperationExecutor.java:165)
  483. 09:58:36.856 at org.gradle.internal.operations.DefaultBuildOperationExecutor.execute(DefaultBuildOperationExecutor.java:250)
  484. 09:58:36.856 at org.gradle.internal.operations.DefaultBuildOperationExecutor.execute(DefaultBuildOperationExecutor.java:158)
  485. 09:58:36.856 at org.gradle.internal.operations.DefaultBuildOperationExecutor.run(DefaultBuildOperationExecutor.java:92)
  486. 09:58:36.856 at org.gradle.internal.operations.DelegatingBuildOperationExecutor.run(DelegatingBuildOperationExecutor.java:31)
  487. 09:58:36.856 at org.gradle.initialization.DefaultGradleLauncher.configureBuild(DefaultGradleLauncher.java:210)
  488. 09:58:36.856 at org.gradle.initialization.DefaultGradleLauncher.doBuildStages(DefaultGradleLauncher.java:151)
  489. 09:58:36.856 at org.gradle.initialization.DefaultGradleLauncher.executeTasks(DefaultGradleLauncher.java:134)
  490. 09:58:36.856 at org.gradle.internal.invocation.GradleBuildController$1.execute(GradleBuildController.java:58)
  491. 09:58:36.856 at org.gradle.internal.invocation.GradleBuildController$1.execute(GradleBuildController.java:55)
  492. 09:58:36.856 at org.gradle.internal.invocation.GradleBuildController$3.create(GradleBuildController.java:82)
  493. 09:58:36.856 at org.gradle.internal.invocation.GradleBuildController$3.create(GradleBuildController.java:75)
  494. 09:58:36.856 at org.gradle.internal.work.DefaultWorkerLeaseService.withLocks(DefaultWorkerLeaseService.java:183)
  495. 09:58:36.856 at org.gradle.internal.work.StopShieldingWorkerLeaseService.withLocks(StopShieldingWorkerLeaseService.java:40)
  496. 09:58:36.856 at org.gradle.internal.invocation.GradleBuildController.doBuild(GradleBuildController.java:75)
  497. 09:58:36.856 at org.gradle.internal.invocation.GradleBuildController.run(GradleBuildController.java:55)
  498. 09:58:36.856 at org.gradle.tooling.internal.provider.ExecuteBuildActionRunner.run(ExecuteBuildActionRunner.java:31)
  499. 09:58:36.856 at org.gradle.launcher.exec.ChainingBuildActionRunner.run(ChainingBuildActionRunner.java:35)
  500. 09:58:36.856 at org.gradle.launcher.exec.BuildOutcomeReportingBuildActionRunner.run(BuildOutcomeReportingBuildActionRunner.java:58)
  501. 09:58:36.856 at org.gradle.tooling.internal.provider.ValidatingBuildActionRunner.run(ValidatingBuildActionRunner.java:32)
  502. 09:58:36.856 at org.gradle.launcher.exec.BuildCompletionNotifyingBuildActionRunner.run(BuildCompletionNotifyingBuildActionRunner.java:39)
  503. 09:58:36.856 at org.gradle.launcher.exec.RunAsBuildOperationBuildActionRunner$3.call(RunAsBuildOperationBuildActionRunner.java:51)
  504. 09:58:36.856 at org.gradle.launcher.exec.RunAsBuildOperationBuildActionRunner$3.call(RunAsBuildOperationBuildActionRunner.java:45)
  505. 09:58:36.856 at org.gradle.internal.operations.DefaultBuildOperationExecutor$CallableBuildOperationWorker.execute(DefaultBuildOperationExecutor.java:416)
  506. 09:58:36.856 at org.gradle.internal.operations.DefaultBuildOperationExecutor$CallableBuildOperationWorker.execute(DefaultBuildOperationExecutor.java:406)
  507. 09:58:36.856 at org.gradle.internal.operations.DefaultBuildOperationExecutor$1.execute(DefaultBuildOperationExecutor.java:165)
  508. 09:58:36.856 at org.gradle.internal.operations.DefaultBuildOperationExecutor.execute(DefaultBuildOperationExecutor.java:250)
  509. 09:58:36.856 at org.gradle.internal.operations.DefaultBuildOperationExecutor.execute(DefaultBuildOperationExecutor.java:158)
  510. 09:58:36.856 at org.gradle.internal.operations.DefaultBuildOperationExecutor.call(DefaultBuildOperationExecutor.java:102)
  511. 09:58:36.856 at org.gradle.internal.operations.DelegatingBuildOperationExecutor.call(DelegatingBuildOperationExecutor.java:36)
  512. 09:58:36.856 at org.gradle.launcher.exec.RunAsBuildOperationBuildActionRunner.run(RunAsBuildOperationBuildActionRunner.java:45)
  513. 09:58:36.856 at org.gradle.launcher.exec.InProcessBuildActionExecuter$1.transform(InProcessBuildActionExecuter.java:49)
  514. 09:58:36.856 at org.gradle.launcher.exec.InProcessBuildActionExecuter$1.transform(InProcessBuildActionExecuter.java:46)
  515. 09:58:36.856 at org.gradle.composite.internal.DefaultRootBuildState.run(DefaultRootBuildState.java:78)
  516. 09:58:36.856 at org.gradle.launcher.exec.InProcessBuildActionExecuter.execute(InProcessBuildActionExecuter.java:46)
  517. 09:58:36.856 at org.gradle.launcher.exec.InProcessBuildActionExecuter.execute(InProcessBuildActionExecuter.java:31)
  518. 09:58:36.857 at org.gradle.launcher.exec.BuildTreeScopeBuildActionExecuter.execute(BuildTreeScopeBuildActionExecuter.java:42)
  519. 09:58:36.857 at org.gradle.launcher.exec.BuildTreeScopeBuildActionExecuter.execute(BuildTreeScopeBuildActionExecuter.java:28)
  520. 09:58:36.857 at org.gradle.tooling.internal.provider.ContinuousBuildActionExecuter.execute(ContinuousBuildActionExecuter.java:78)
  521. 09:58:36.857 at org.gradle.tooling.internal.provider.ContinuousBuildActionExecuter.execute(ContinuousBuildActionExecuter.java:52)
  522. 09:58:36.857 at org.gradle.tooling.internal.provider.SubscribableBuildActionExecuter.execute(SubscribableBuildActionExecuter.java:59)
  523. 09:58:36.857 at org.gradle.tooling.internal.provider.SubscribableBuildActionExecuter.execute(SubscribableBuildActionExecuter.java:36)
  524. 09:58:36.857 at org.gradle.tooling.internal.provider.SessionScopeBuildActionExecuter.execute(SessionScopeBuildActionExecuter.java:68)
  525. 09:58:36.857 at org.gradle.tooling.internal.provider.SessionScopeBuildActionExecuter.execute(SessionScopeBuildActionExecuter.java:38)
  526. 09:58:36.857 at org.gradle.tooling.internal.provider.GradleThreadBuildActionExecuter.execute(GradleThreadBuildActionExecuter.java:37)
  527. 09:58:36.857 at org.gradle.tooling.internal.provider.GradleThreadBuildActionExecuter.execute(GradleThreadBuildActionExecuter.java:26)
  528. 09:58:36.857 at org.gradle.tooling.internal.provider.ParallelismConfigurationBuildActionExecuter.execute(ParallelismConfigurationBuildActionExecuter.java:43)
  529. 09:58:36.857 at org.gradle.tooling.internal.provider.ParallelismConfigurationBuildActionExecuter.execute(ParallelismConfigurationBuildActionExecuter.java:29)
  530. 09:58:36.857 at org.gradle.tooling.internal.provider.StartParamsValidatingActionExecuter.execute(StartParamsValidatingActionExecuter.java:60)
  531. 09:58:36.857 at org.gradle.tooling.internal.provider.StartParamsValidatingActionExecuter.execute(StartParamsValidatingActionExecuter.java:32)
  532. 09:58:36.857 at org.gradle.tooling.internal.provider.SessionFailureReportingActionExecuter.execute(SessionFailureReportingActionExecuter.java:55)
  533. 09:58:36.857 at org.gradle.tooling.internal.provider.SessionFailureReportingActionExecuter.execute(SessionFailureReportingActionExecuter.java:41)
  534. 09:58:36.857 at org.gradle.tooling.internal.provider.SetupLoggingActionExecuter.execute(SetupLoggingActionExecuter.java:48)
  535. 09:58:36.857 at org.gradle.tooling.internal.provider.SetupLoggingActionExecuter.execute(SetupLoggingActionExecuter.java:32)
  536. 09:58:36.857 at org.gradle.launcher.daemon.server.exec.ExecuteBuild.doBuild(ExecuteBuild.java:67)
  537. 09:58:36.857 at org.gradle.launcher.daemon.server.exec.BuildCommandOnly.execute(BuildCommandOnly.java:36)
  538. 09:58:36.857 at org.gradle.launcher.daemon.server.api.DaemonCommandExecution.proceed(DaemonCommandExecution.java:104)
  539. 09:58:36.857 at org.gradle.launcher.daemon.server.exec.WatchForDisconnection.execute(WatchForDisconnection.java:37)
  540. 09:58:36.857 at org.gradle.launcher.daemon.server.api.DaemonCommandExecution.proceed(DaemonCommandExecution.java:104)
  541. 09:58:36.857 at org.gradle.launcher.daemon.server.exec.ResetDeprecationLogger.execute(ResetDeprecationLogger.java:26)
  542. 09:58:36.857 at org.gradle.launcher.daemon.server.api.DaemonCommandExecution.proceed(DaemonCommandExecution.java:104)
  543. 09:58:36.857 at org.gradle.launcher.daemon.server.exec.RequestStopIfSingleUsedDaemon.execute(RequestStopIfSingleUsedDaemon.java:34)
  544. 09:58:36.857 at org.gradle.launcher.daemon.server.api.DaemonCommandExecution.proceed(DaemonCommandExecution.java:104)
  545. 09:58:36.857 at org.gradle.launcher.daemon.server.exec.ForwardClientInput$2.call(ForwardClientInput.java:74)
  546. 09:58:36.857 at org.gradle.launcher.daemon.server.exec.ForwardClientInput$2.call(ForwardClientInput.java:72)
  547. 09:58:36.857 at org.gradle.util.Swapper.swap(Swapper.java:38)
  548. 09:58:36.857 at org.gradle.launcher.daemon.server.exec.ForwardClientInput.execute(ForwardClientInput.java:72)
  549. 09:58:36.857 at org.gradle.launcher.daemon.server.api.DaemonCommandExecution.proceed(DaemonCommandExecution.java:104)
  550. 09:58:36.857 at org.gradle.launcher.daemon.server.exec.LogAndCheckHealth.execute(LogAndCheckHealth.java:50)
  551. 09:58:36.857 at org.gradle.launcher.daemon.server.api.DaemonCommandExecution.proceed(DaemonCommandExecution.java:104)
  552. 09:58:36.857 at org.gradle.launcher.daemon.server.exec.LogToClient.doBuild(LogToClient.java:62)
  553. 09:58:36.857 at org.gradle.launcher.daemon.server.exec.BuildCommandOnly.execute(BuildCommandOnly.java:36)
  554. 09:58:36.857 at org.gradle.launcher.daemon.server.api.DaemonCommandExecution.proceed(DaemonCommandExecution.java:104)
  555. 09:58:36.857 at org.gradle.launcher.daemon.server.exec.EstablishBuildEnvironment.doBuild(EstablishBuildEnvironment.java:81)
  556. 09:58:36.857 at org.gradle.launcher.daemon.server.exec.BuildCommandOnly.execute(BuildCommandOnly.java:36)
  557. 09:58:36.857 at org.gradle.launcher.daemon.server.api.DaemonCommandExecution.proceed(DaemonCommandExecution.java:104)
  558. 09:58:36.857 at org.gradle.launcher.daemon.server.exec.StartBuildOrRespondWithBusy$1.run(StartBuildOrRespondWithBusy.java:50)
  559. 09:58:36.857 at org.gradle.launcher.daemon.server.DaemonStateCoordinator$1.run(DaemonStateCoordinator.java:295)
  560. 09:58:36.857 at org.gradle.internal.concurrent.ExecutorPolicy$CatchAndRecordFailures.onExecute(ExecutorPolicy.java:63)
  561. 09:58:36.861 at org.gradle.internal.concurrent.ManagedExecutorImpl$1.run(ManagedExecutorImpl.java:46)
  562. 09:58:36.861 at java.base/java.util.concurrent.ThreadPoolExecutor.runWorker(ThreadPoolExecutor.java:1128)
  563. 09:58:36.861 at java.base/java.util.concurrent.ThreadPoolExecutor$Worker.run(ThreadPoolExecutor.java:628)
  564. 09:58:36.861 at org.gradle.internal.concurrent.ThreadFactoryImpl$ManagedThreadRunnable.run(ThreadFactoryImpl.java:55)
  565. 09:58:36.861 at java.base/java.lang.Thread.run(Thread.java:830)
  566. 09:58:36.861
  567. 09:58:36.861 1 error
  568. 09:58:36.861
  569. 09:58:36.861
  570. 09:58:36.861 * Try:
  571. 09:58:36.861 Run with --stacktrace option to get the stack trace. Run with --info or --debug option to get more log output. Run with --scan to get full insights.
  572. 09:58:36.861
  573. 09:58:36.861 * Get more help at https://help.gradle.org
  574. 09:58:36.861
  575. 09:58:36.861 BUILD FAILED in 53s
  576. 09:58:37.090 Android build failed (1) after 59 seconds
RAW Paste Data