david_david

audaspace.log_1.0_with-DOCS-compile

Aug 12th, 2015
517
0
Never
Not a member of Pastebin yet? Sign Up, it unlocks many cool features!
text 158.81 KB | None | 0 0
  1. Executing(%prep): /bin/sh -e /home/david/mgarepo/audaspace/BUILDROOT/rpm-tmp.vHbAAj
  2. + umask 022
  3. + cd /home/david/mgarepo/audaspace/BUILD
  4. + '[' 1 -eq 1 ']'
  5. + '[' 1 -eq 1 ']'
  6. + '[' 1 -eq 1 ']'
  7. + cd /home/david/mgarepo/audaspace/BUILD
  8. + rm -rf audaspace-1.0
  9. + /usr/bin/gzip -dc /home/david/mgarepo/audaspace/SOURCES/audaspace-1.0.tar.gz
  10. + /usr/bin/tar -xf -
  11. + STATUS=0
  12. + '[' 0 -ne 0 ']'
  13. + cd audaspace-1.0
  14. + /usr/bin/chmod -Rf a+rX,u+w,g-w,o-w .
  15. + exit 0
  16. Executing(%build): /bin/sh -e /home/david/mgarepo/audaspace/BUILDROOT/rpm-tmp.5Z9Kq6
  17. + umask 022
  18. + cd /home/david/mgarepo/audaspace/BUILD
  19. + cd audaspace-1.0
  20. + '[' 1 -eq 1 ']'
  21. + '[' 1 -eq 1 ']'
  22. + CFLAGS='-O2 -g -pipe -Wformat -Werror=format-security -Wp,-D_FORTIFY_SOURCE=2 -fstack-protector --param=ssp-buffer-size=4 -fPIC'
  23. + export CFLAGS
  24. + CXXFLAGS='-O2 -g -pipe -Wformat -Werror=format-security -Wp,-D_FORTIFY_SOURCE=2 -fstack-protector --param=ssp-buffer-size=4 -fPIC'
  25. + export CXXFLAGS
  26. + FFLAGS='-O2 -g -pipe -Wformat -Werror=format-security -Wp,-D_FORTIFY_SOURCE=2 -fstack-protector --param=ssp-buffer-size=4 -fPIC'
  27. + export FFLAGS
  28. + LDFLAGS=' -Wl,--as-needed -Wl,--no-undefined -Wl,-z,relro -Wl,-O1 -Wl,--build-id -Wl,--enable-new-dtags'
  29. + export LDFLAGS
  30. + mkdir -p build
  31. + cd build
  32. + /usr/bin/cmake .. -DCMAKE_INSTALL_PREFIX:PATH=/usr -DCMAKE_INSTALL_LIBDIR:PATH=/usr/lib64 -DCMAKE_INSTALL_LIBEXECDIR:PATH=/usr/libexec -DCMAKE_INSTALL_SYSCONFDIR:PATH=/etc -DINCLUDE_INSTALL_DIR:PATH=/usr/include -DLIB_INSTALL_DIR:PATH=/usr/lib64 -DSYSCONF_INSTALL_DIR:PATH=/etc -DSHARE_INSTALL_PREFIX:PATH=/usr/share -DCMAKE_BUILD_TYPE=release -DLIB_SUFFIX=64 -DCMAKE_SKIP_RPATH:BOOL=ON -DBUILD_SHARED_LIBS:BOOL=ON -DBUILD_STATIC_LIBS:BOOL=OFF '-DCMAKE_MODULE_LINKER_FLAGS=-Wl,--as-needed -Wl,-z,relro -Wl,-O1 -Wl,--build-id -Wl,--enable-new-dtags' -DCMAKE_BUILD_TYPE:STRING=Release -DUSE_SDL2:BOOL=TRUE -DWITH_STRICT_DEPENDENCIES:BOOL=TRUE -DWITH_DOCS:BOOL=TRUE -DWITH_BINDING_DOCS:BOOL=TRUE -DDEFAULT_PLUGIN_PATH:PATH=/usr/lib64/audaspace/plugins -DDOCUMENTATION_INSTALL_PATH:PATH=/usr/share/doc/audaspace
  33. -- The C compiler identification is GNU 4.9.2
  34. -- The CXX compiler identification is GNU 4.9.2
  35. -- Check for working C compiler: /usr/bin/cc
  36. -- Check for working C compiler: /usr/bin/cc -- works
  37. -- Detecting C compiler ABI info
  38. -- Detecting C compiler ABI info - done
  39. -- Check for working CXX compiler: /usr/bin/c++
  40. -- Check for working CXX compiler: /usr/bin/c++ -- works
  41. -- Detecting CXX compiler ABI info
  42. -- Detecting CXX compiler ABI info - done
  43. -- Found FFMPEG: /usr/lib64/libavcodec.so
  44. -- checking for module 'jack'
  45. -- found jack, version 1.9.10
  46. -- Found Jack: /usr/lib64/libjack.so
  47. -- checking for module 'sndfile'
  48. -- found sndfile, version 1.0.25
  49. -- Found LibSndFile: /usr/lib64/libsndfile.so
  50. -- Found OpenAL: /usr/lib64/libopenal.so
  51. -- Found PythonLibs: /usr/lib64/libpython3.4m.so (found suitable version "3.4.3", minimum required is "3.2")
  52. -- Found PythonInterp: /usr/bin/python3 (found suitable version "3.4.3", minimum required is "3.2")
  53. -- Looking for include file pthread.h
  54. -- Looking for include file pthread.h - found
  55. -- Looking for pthread_create
  56. -- Looking for pthread_create - not found
  57. -- Looking for pthread_create in pthreads
  58. -- Looking for pthread_create in pthreads - not found
  59. -- Looking for pthread_create in pthread
  60. -- Looking for pthread_create in pthread - found
  61. -- Found Threads: TRUE
  62. -- Found SDL2: /usr/lib64/libSDL2.so;-lpthread
  63. -- Found Doxygen: /usr/bin/doxygen (found version "1.8.8")
  64. -- Found Sphinx: /usr/bin/sphinx-build
  65. -- Configuring done
  66. -- Generating done
  67. CMake Warning:
  68. Manually-specified variables were not used by the project:
  69.  
  70. BUILD_STATIC_LIBS
  71. CMAKE_INSTALL_LIBDIR
  72. CMAKE_INSTALL_LIBEXECDIR
  73. CMAKE_INSTALL_SYSCONFDIR
  74. INCLUDE_INSTALL_DIR
  75. LIB_INSTALL_DIR
  76. SHARE_INSTALL_PREFIX
  77. SYSCONF_INSTALL_DIR
  78.  
  79.  
  80. -- Build files have been written to: /home/david/mgarepo/audaspace/BUILD/audaspace-1.0/build
  81. + make -O -j4
  82. Scanning dependencies of target bindings_doc
  83. Scanning dependencies of target audaspace_doc
  84. Scanning dependencies of target audaspace
  85. [ 3%] Building CXX object CMakeFiles/audaspace.dir/src/devices/DefaultSynchronizer.cpp.o
  86. [ 1%] Building C/Python HTML documentation with Sphinx.
  87. WARNING: the config value 'copyright' is set to a string with non-ASCII characters; this can lead to Unicode errors occurring. Please use Unicode strings, e.g. u'Content'.
  88.  
  89. Encoding error:
  90. 'ascii' codec can't decode byte 0xc3 in position 12: ordinal not in range(128)
  91. The full traceback has been saved in /tmp/sphinx-err-ZXfUqm.log, if you want to report the issue to the developers.
  92. CMakeFiles/bindings_doc.dir/build.make:49: recipe for target 'CMakeFiles/bindings_doc' failed
  93. make[2]: *** [CMakeFiles/bindings_doc] Error 1
  94. CMakeFiles/Makefile2:480: recipe for target 'CMakeFiles/bindings_doc.dir/all' failed
  95. make[1]: *** [CMakeFiles/bindings_doc.dir/all] Error 2
  96. make[1]: *** Waiting for unfinished jobs....
  97. [ 5%] Building CXX object CMakeFiles/audaspace.dir/src/devices/NULLDevice.cpp.o
  98. [ 6%] Building CXX object CMakeFiles/audaspace.dir/src/devices/ReadDevice.cpp.o
  99. [ 8%] Building CXX object CMakeFiles/audaspace.dir/src/Exception.cpp.o
  100. [ 2%] Building C++ HTML documentation with Doxygen.
  101. /home/david/mgarepo/audaspace/BUILD/audaspace-1.0/build/Audaspace.h:56: warning: documentation for unknown define AUD_STATIC_LIBRARY found.
  102.  
  103. sh: dot: command not found
  104. error: Problems running dot: exit code=127, command='dot', arguments='"/home/david/mgarepo/audaspace/BUILD/audaspace-1.0/build/doc/I3DDevice_8h__incl.dot" -Tpng -o "/home/david/mgarepo/audaspace/BUILD/audaspace-1.0/build/doc/I3DDevice_8h__incl.png"'
  105. sh: dot: command not found
  106. error: Problems running dot: exit code=127, command='dot', arguments='"/home/david/mgarepo/audaspace/BUILD/audaspace-1.0/build/doc/DefaultSynchronizer_8h__incl.dot" -Tpng -o "/home/david/mgarepo/audaspace/BUILD/audaspace-1.0/build/doc/DefaultSynchronizer_8h__incl.png"'
  107. sh: dot: command not found
  108. error: Problems running dot: exit code=127, command='dot', arguments='"/home/david/mgarepo/audaspace/BUILD/audaspace-1.0/build/doc/I3DDevice_8h__dep__incl.dot" -Tpng -o "/home/david/mgarepo/audaspace/BUILD/audaspace-1.0/build/doc/I3DDevice_8h__dep__incl.png"'
  109. sh: dot: command not found
  110. error: Problems running dot: exit code=127, command='dot', arguments='"/home/david/mgarepo/audaspace/BUILD/audaspace-1.0/build/doc/DeviceManager_8h__incl.dot" -Tpng -o "/home/david/mgarepo/audaspace/BUILD/audaspace-1.0/build/doc/DeviceManager_8h__incl.png"'
  111. sh: dot: command not found
  112. error: Problems running dot: exit code=127, command='dot', arguments='"/home/david/mgarepo/audaspace/BUILD/audaspace-1.0/build/doc/Audaspace_8h__dep__incl.dot" -Tpng -o "/home/david/mgarepo/audaspace/BUILD/audaspace-1.0/build/doc/Audaspace_8h__dep__incl.png"'
  113. sh: dot: command not found
  114. error: Problems running dot: exit code=127, command='dot', arguments='"/home/david/mgarepo/audaspace/BUILD/audaspace-1.0/build/doc/DefaultSynchronizer_8h__dep__incl.dot" -Tpng -o "/home/david/mgarepo/audaspace/BUILD/audaspace-1.0/build/doc/DefaultSynchronizer_8h__dep__incl.png"'
  115. sh: dot: command not found
  116. error: Problems running dot: exit code=127, command='dot', arguments='"/home/david/mgarepo/audaspace/BUILD/audaspace-1.0/build/doc/I3DHandle_8h__incl.dot" -Tpng -o "/home/david/mgarepo/audaspace/BUILD/audaspace-1.0/build/doc/I3DHandle_8h__incl.png"'
  117. sh: dot: command not found
  118. error: Problems running dot: exit code=127, command='dot', arguments='"/home/david/mgarepo/audaspace/BUILD/audaspace-1.0/build/doc/IDevice_8h__incl.dot" -Tpng -o "/home/david/mgarepo/audaspace/BUILD/audaspace-1.0/build/doc/IDevice_8h__incl.png"'
  119. sh: dot: command not found
  120. error: Problems running dot: exit code=127, command='dot', arguments='"/home/david/mgarepo/audaspace/BUILD/audaspace-1.0/build/doc/IDevice_8h__dep__incl.dot" -Tpng -o "/home/david/mgarepo/audaspace/BUILD/audaspace-1.0/build/doc/IDevice_8h__dep__incl.png"'
  121. sh: dot: command not found
  122. error: Problems running dot: exit code=127, command='dot', arguments='"/home/david/mgarepo/audaspace/BUILD/audaspace-1.0/build/doc/I3DHandle_8h__dep__incl.dot" -Tpng -o "/home/david/mgarepo/audaspace/BUILD/audaspace-1.0/build/doc/I3DHandle_8h__dep__incl.png"'
  123. sh: dot: command not found
  124. sh: dot: command not found
  125. error: Problems running dot: exit code=127, command='dot', arguments='"/home/david/mgarepo/audaspace/BUILD/audaspace-1.0/build/doc/ISynchronizer_8h__incl.dot" -Tpng -o "/home/david/mgarepo/audaspace/BUILD/audaspace-1.0/build/doc/ISynchronizer_8h__incl.png"'
  126. error: Problems running dot: exit code=127, command='dot', arguments='"/home/david/mgarepo/audaspace/BUILD/audaspace-1.0/build/doc/IHandle_8h__dep__incl.dot" -Tpng -o "/home/david/mgarepo/audaspace/BUILD/audaspace-1.0/build/doc/IHandle_8h__dep__incl.png"'
  127. sh: dot: command not found
  128. error: Problems running dot: exit code=127, command='dot', arguments='"/home/david/mgarepo/audaspace/BUILD/audaspace-1.0/build/doc/IDeviceFactory_8h__incl.dot" -Tpng -o "/home/david/mgarepo/audaspace/BUILD/audaspace-1.0/build/doc/IDeviceFactory_8h__incl.png"'
  129. sh: dot: command not found
  130. error: Problems running dot: exit code=127, command='dot', arguments='"/home/david/mgarepo/audaspace/BUILD/audaspace-1.0/build/doc/ISynchronizer_8h__dep__incl.dot" -Tpng -o "/home/david/mgarepo/audaspace/BUILD/audaspace-1.0/build/doc/ISynchronizer_8h__dep__incl.png"'
  131. sh: dot: command not found
  132. error: Problems running dot: exit code=127, command='dot', arguments='"/home/david/mgarepo/audaspace/BUILD/audaspace-1.0/build/doc/IHandle_8h__incl.dot" -Tpng -o "/home/david/mgarepo/audaspace/BUILD/audaspace-1.0/build/doc/IHandle_8h__incl.png"'
  133. sh: dot: command not found
  134. error: Problems running dot: exit code=127, command='dot', arguments='"/home/david/mgarepo/audaspace/BUILD/audaspace-1.0/build/doc/NULLDevice_8h__incl.dot" -Tpng -o "/home/david/mgarepo/audaspace/BUILD/audaspace-1.0/build/doc/NULLDevice_8h__incl.png"'
  135. sh: dot: command not found
  136. error: Problems running dot: exit code=127, command='dot', arguments='"/home/david/mgarepo/audaspace/BUILD/audaspace-1.0/build/doc/ReadDevice_8h__incl.dot" -Tpng -o "/home/david/mgarepo/audaspace/BUILD/audaspace-1.0/build/doc/ReadDevice_8h__incl.png"'
  137. sh: dot: command not found
  138. error: Problems running dot: exit code=127, command='dot', arguments='"/home/david/mgarepo/audaspace/BUILD/audaspace-1.0/build/doc/Exception_8h__incl.dot" -Tpng -o "/home/david/mgarepo/audaspace/BUILD/audaspace-1.0/build/doc/Exception_8h__incl.png"'
  139. sh: dot: command not found
  140. error: Problems running dot: exit code=127, command='dot', arguments='"/home/david/mgarepo/audaspace/BUILD/audaspace-1.0/build/doc/SoftwareDevice_8h__dep__incl.dot" -Tpng -o "/home/david/mgarepo/audaspace/BUILD/audaspace-1.0/build/doc/SoftwareDevice_8h__dep__incl.png"'
  141. sh: dot: command not found
  142. error: Problems running dot: exit code=127, command='dot', arguments='"/home/david/mgarepo/audaspace/BUILD/audaspace-1.0/build/doc/SoftwareDevice_8h__incl.dot" -Tpng -o "/home/david/mgarepo/audaspace/BUILD/audaspace-1.0/build/doc/SoftwareDevice_8h__incl.png"'
  143. sh: dot: command not found
  144. sh: dot: command not found
  145. error: Problems running dot: exit code=127, command='dot', arguments='"/home/david/mgarepo/audaspace/BUILD/audaspace-1.0/build/doc/ReadDevice_8h__dep__incl.dot" -Tpng -o "/home/david/mgarepo/audaspace/BUILD/audaspace-1.0/build/doc/ReadDevice_8h__dep__incl.png"'
  146. error: Problems running dot: exit code=127, command='dot', arguments='"/home/david/mgarepo/audaspace/BUILD/audaspace-1.0/build/doc/File_8h__incl.dot" -Tpng -o "/home/david/mgarepo/audaspace/BUILD/audaspace-1.0/build/doc/File_8h__incl.png"'
  147. sh: dot: command not found
  148. error: Problems running dot: exit code=127, command='dot', arguments='"/home/david/mgarepo/audaspace/BUILD/audaspace-1.0/build/doc/IFileOutput_8h__incl.dot" -Tpng -o "/home/david/mgarepo/audaspace/BUILD/audaspace-1.0/build/doc/IFileOutput_8h__incl.png"'
  149. sh: dot: command not found
  150. error: Problems running dot: exit code=127, command='dot', arguments='"/home/david/mgarepo/audaspace/BUILD/audaspace-1.0/build/doc/IFileInput_8h__incl.dot" -Tpng -o "/home/david/mgarepo/audaspace/BUILD/audaspace-1.0/build/doc/IFileInput_8h__incl.png"'
  151. sh: dot: command not found
  152. sh: dot: command not found
  153. error: Problems running dot: exit code=127, command='dot', arguments='"/home/david/mgarepo/audaspace/BUILD/audaspace-1.0/build/doc/FileManager_8h__incl.dot" -Tpng -o "/home/david/mgarepo/audaspace/BUILD/audaspace-1.0/build/doc/FileManager_8h__incl.png"'
  154. sh: dot: command not found
  155. error: Problems running dot: exit code=127, command='dot', arguments='"/home/david/mgarepo/audaspace/BUILD/audaspace-1.0/build/doc/IFileInput_8h__dep__incl.dot" -Tpng -o "/home/david/mgarepo/audaspace/BUILD/audaspace-1.0/build/doc/IFileInput_8h__dep__incl.png"'
  156. error: Problems running dot: exit code=127, command='dot', arguments='"/home/david/mgarepo/audaspace/BUILD/audaspace-1.0/build/doc/IWriter_8h__incl.dot" -Tpng -o "/home/david/mgarepo/audaspace/BUILD/audaspace-1.0/build/doc/IWriter_8h__incl.png"'
  157. sh: dot: command not found
  158. error: Problems running dot: exit code=127, command='dot', arguments='"/home/david/mgarepo/audaspace/BUILD/audaspace-1.0/build/doc/FileWriter_8h__incl.dot" -Tpng -o "/home/david/mgarepo/audaspace/BUILD/audaspace-1.0/build/doc/FileWriter_8h__incl.png"'
  159. sh: dot: command not found
  160. error: Problems running dot: exit code=127, command='dot', arguments='"/home/david/mgarepo/audaspace/BUILD/audaspace-1.0/build/doc/IFileOutput_8h__dep__incl.dot" -Tpng -o "/home/david/mgarepo/audaspace/BUILD/audaspace-1.0/build/doc/IFileOutput_8h__dep__incl.png"'
  161. sh: dot: command not found
  162. error: Problems running dot: exit code=127, command='dot', arguments='"/home/david/mgarepo/audaspace/BUILD/audaspace-1.0/build/doc/IWriter_8h__dep__incl.dot" -Tpng -o "/home/david/mgarepo/audaspace/BUILD/audaspace-1.0/build/doc/IWriter_8h__dep__incl.png"'
  163. sh: dot: command not found
  164. error: Problems running dot: exit code=127, command='dot', arguments='"/home/david/mgarepo/audaspace/BUILD/audaspace-1.0/build/doc/ADSR_8h__incl.dot" -Tpng -o "/home/david/mgarepo/audaspace/BUILD/audaspace-1.0/build/doc/ADSR_8h__incl.png"'
  165. sh: dot: command not found
  166. error: Problems running dot: exit code=127, command='dot', arguments='"/home/david/mgarepo/audaspace/BUILD/audaspace-1.0/build/doc/ADSRReader_8h__incl.dot" -Tpng -o "/home/david/mgarepo/audaspace/BUILD/audaspace-1.0/build/doc/ADSRReader_8h__incl.png"'
  167. sh: dot: command not found
  168. error: Problems running dot: exit code=127, command='dot', arguments='"/home/david/mgarepo/audaspace/BUILD/audaspace-1.0/build/doc/Accumulator_8h__incl.dot" -Tpng -o "/home/david/mgarepo/audaspace/BUILD/audaspace-1.0/build/doc/Accumulator_8h__incl.png"'
  169. sh: dot: command not found
  170. error: Problems running dot: exit code=127, command='dot', arguments='"/home/david/mgarepo/audaspace/BUILD/audaspace-1.0/build/doc/Butterworth_8h__incl.dot" -Tpng -o "/home/david/mgarepo/audaspace/BUILD/audaspace-1.0/build/doc/Butterworth_8h__incl.png"'
  171. sh: dot: command not found
  172. error: Problems running dot: exit code=127, command='dot', arguments='"/home/david/mgarepo/audaspace/BUILD/audaspace-1.0/build/doc/BaseIIRFilterReader_8h__incl.dot" -Tpng -o "/home/david/mgarepo/audaspace/BUILD/audaspace-1.0/build/doc/BaseIIRFilterReader_8h__incl.png"'
  173. sh: dot: command not found
  174. error: Problems running dot: exit code=127, command='dot', arguments='"/home/david/mgarepo/audaspace/BUILD/audaspace-1.0/build/doc/BaseIIRFilterReader_8h__dep__incl.dot" -Tpng -o "/home/david/mgarepo/audaspace/BUILD/audaspace-1.0/build/doc/BaseIIRFilterReader_8h__dep__incl.png"'
  175. sh: dot: command not found
  176. sh: dot: command not found
  177. error: Problems running dot: exit code=127, command='dot', arguments='"/home/david/mgarepo/audaspace/BUILD/audaspace-1.0/build/doc/DynamicIIRFilter_8h__incl.dot" -Tpng -o "/home/david/mgarepo/audaspace/BUILD/audaspace-1.0/build/doc/DynamicIIRFilter_8h__incl.png"'
  178. error: Problems running dot: exit code=127, command='dot', arguments='"/home/david/mgarepo/audaspace/BUILD/audaspace-1.0/build/doc/ButterworthCalculator_8h__incl.dot" -Tpng -o "/home/david/mgarepo/audaspace/BUILD/audaspace-1.0/build/doc/ButterworthCalculator_8h__incl.png"'
  179. sh: dot: command not found
  180. sh: dot: command not found
  181. error: Problems running dot: exit code=127, command='dot', arguments='"/home/david/mgarepo/audaspace/BUILD/audaspace-1.0/build/doc/DelayReader_8h__incl.dot" -Tpng -o "/home/david/mgarepo/audaspace/BUILD/audaspace-1.0/build/doc/DelayReader_8h__incl.png"'
  182. error: Problems running dot: exit code=127, command='dot', arguments='"/home/david/mgarepo/audaspace/BUILD/audaspace-1.0/build/doc/CallbackIIRFilterReader_8h__incl.dot" -Tpng -o "/home/david/mgarepo/audaspace/BUILD/audaspace-1.0/build/doc/CallbackIIRFilterReader_8h__incl.png"'
  183. sh: dot: command not found
  184. error: Problems running dot: exit code=127, command='dot', arguments='"/home/david/mgarepo/audaspace/BUILD/audaspace-1.0/build/doc/DynamicIIRFilterReader_8h__incl.dot" -Tpng -o "/home/david/mgarepo/audaspace/BUILD/audaspace-1.0/build/doc/DynamicIIRFilterReader_8h__incl.png"'
  185. sh: dot: command not found
  186. error: Problems running dot: exit code=127, command='dot', arguments='"/home/david/mgarepo/audaspace/BUILD/audaspace-1.0/build/doc/EffectReader_8h__incl.dot" -Tpng -o "/home/david/mgarepo/audaspace/BUILD/audaspace-1.0/build/doc/EffectReader_8h__incl.png"'
  187. sh: dot: command not found
  188. error: Problems running dot: exit code=127, command='dot', arguments='"/home/david/mgarepo/audaspace/BUILD/audaspace-1.0/build/doc/Delay_8h__incl.dot" -Tpng -o "/home/david/mgarepo/audaspace/BUILD/audaspace-1.0/build/doc/Delay_8h__incl.png"'
  189. sh: dot: command not found
  190. sh: dot: command not found
  191. error: Problems running dot: exit code=127, command='dot', arguments='"/home/david/mgarepo/audaspace/BUILD/audaspace-1.0/build/doc/Effect_8h__incl.dot" -Tpng -o "/home/david/mgarepo/audaspace/BUILD/audaspace-1.0/build/doc/Effect_8h__incl.png"'
  192. sh: dot: command not found
  193. error: Problems running dot: exit code=127, command='dot', arguments='"/home/david/mgarepo/audaspace/BUILD/audaspace-1.0/build/doc/DynamicIIRFilter_8h__dep__incl.dot" -Tpng -o "/home/david/mgarepo/audaspace/BUILD/audaspace-1.0/build/doc/DynamicIIRFilter_8h__dep__incl.png"'
  194. error: Problems running dot: exit code=127, command='dot', arguments='"/home/david/mgarepo/audaspace/BUILD/audaspace-1.0/build/doc/Effect_8h__dep__incl.dot" -Tpng -o "/home/david/mgarepo/audaspace/BUILD/audaspace-1.0/build/doc/Effect_8h__dep__incl.png"'
  195. sh: dot: command not found
  196. error: Problems running dot: exit code=127, command='dot', arguments='"/home/david/mgarepo/audaspace/BUILD/audaspace-1.0/build/doc/FaderReader_8h__dep__incl.dot" -Tpng -o "/home/david/mgarepo/audaspace/BUILD/audaspace-1.0/build/doc/FaderReader_8h__dep__incl.png"'
  197. sh: dot: command not found
  198. error: Problems running dot: exit code=127, command='dot', arguments='"/home/david/mgarepo/audaspace/BUILD/audaspace-1.0/build/doc/EffectReader_8h__dep__incl.dot" -Tpng -o "/home/david/mgarepo/audaspace/BUILD/audaspace-1.0/build/doc/EffectReader_8h__dep__incl.png"'
  199. sh: dot: command not found
  200. sh: dot: command not found
  201. error: Problems running dot: exit code=127, command='dot', arguments='"/home/david/mgarepo/audaspace/BUILD/audaspace-1.0/build/doc/Envelope_8h__incl.dot" -Tpng -o "/home/david/mgarepo/audaspace/BUILD/audaspace-1.0/build/doc/Envelope_8h__incl.png"'
  202. sh: dot: command not found
  203. error: Problems running dot: exit code=127, command='dot', arguments='"/home/david/mgarepo/audaspace/BUILD/audaspace-1.0/build/doc/Fader_8h__incl.dot" -Tpng -o "/home/david/mgarepo/audaspace/BUILD/audaspace-1.0/build/doc/Fader_8h__incl.png"'
  204. error: Problems running dot: exit code=127, command='dot', arguments='"/home/david/mgarepo/audaspace/BUILD/audaspace-1.0/build/doc/Highpass_8h__incl.dot" -Tpng -o "/home/david/mgarepo/audaspace/BUILD/audaspace-1.0/build/doc/Highpass_8h__incl.png"'
  205. sh: dot: command not found
  206. sh: dot: command not found
  207. error: Problems running dot: exit code=127, command='dot', arguments='"/home/david/mgarepo/audaspace/BUILD/audaspace-1.0/build/doc/HighpassCalculator_8h__incl.dot" -Tpng -o "/home/david/mgarepo/audaspace/BUILD/audaspace-1.0/build/doc/HighpassCalculator_8h__incl.png"'
  208. error: Problems running dot: exit code=127, command='dot', arguments='"/home/david/mgarepo/audaspace/BUILD/audaspace-1.0/build/doc/FaderReader_8h__incl.dot" -Tpng -o "/home/david/mgarepo/audaspace/BUILD/audaspace-1.0/build/doc/FaderReader_8h__incl.png"'
  209. sh: dot: command not found
  210. error: Problems running dot: exit code=127, command='dot', arguments='"/home/david/mgarepo/audaspace/BUILD/audaspace-1.0/build/doc/IDynamicIIRFilterCalculator_8h__dep__incl.dot" -Tpng -o "/home/david/mgarepo/audaspace/BUILD/audaspace-1.0/build/doc/IDynamicIIRFilterCalculator_8h__dep__incl.png"'
  211. sh: dot: command not found
  212. error: Problems running dot: exit code=127, command='dot', arguments='"/home/david/mgarepo/audaspace/BUILD/audaspace-1.0/build/doc/IDynamicIIRFilterCalculator_8h__incl.dot" -Tpng -o "/home/david/mgarepo/audaspace/BUILD/audaspace-1.0/build/doc/IDynamicIIRFilterCalculator_8h__incl.png"'
  213. sh: dot: command not found
  214. error: Problems running dot: exit code=127, command='dot', arguments='"/home/david/mgarepo/audaspace/BUILD/audaspace-1.0/build/doc/IIRFilterReader_8h__incl.dot" -Tpng -o "/home/david/mgarepo/audaspace/BUILD/audaspace-1.0/build/doc/IIRFilterReader_8h__incl.png"'
  215. sh: dot: command not found
  216. error: Problems running dot: exit code=127, command='dot', arguments='"/home/david/mgarepo/audaspace/BUILD/audaspace-1.0/build/doc/Loop_8h__incl.dot" -Tpng -o "/home/david/mgarepo/audaspace/BUILD/audaspace-1.0/build/doc/Loop_8h__incl.png"'
  217. sh: dot: command not found
  218. sh: dot: command not found
  219. error: Problems running dot: exit code=127, command='dot', arguments='"/home/david/mgarepo/audaspace/BUILD/audaspace-1.0/build/doc/IIRFilterReader_8h__dep__incl.dot" -Tpng -o "/home/david/mgarepo/audaspace/BUILD/audaspace-1.0/build/doc/IIRFilterReader_8h__dep__incl.png"'
  220. error: Problems running dot: exit code=127, command='dot', arguments='"/home/david/mgarepo/audaspace/BUILD/audaspace-1.0/build/doc/IIRFilter_8h__incl.dot" -Tpng -o "/home/david/mgarepo/audaspace/BUILD/audaspace-1.0/build/doc/IIRFilter_8h__incl.png"'
  221. sh: dot: command not found
  222. error: Problems running dot: exit code=127, command='dot', arguments='"/home/david/mgarepo/audaspace/BUILD/audaspace-1.0/build/doc/Limiter_8h__incl.dot" -Tpng -o "/home/david/mgarepo/audaspace/BUILD/audaspace-1.0/build/doc/Limiter_8h__incl.png"'
  223. sh: dot: command not found
  224. error: Problems running dot: exit code=127, command='dot', arguments='"/home/david/mgarepo/audaspace/BUILD/audaspace-1.0/build/doc/LimiterReader_8h__incl.dot" -Tpng -o "/home/david/mgarepo/audaspace/BUILD/audaspace-1.0/build/doc/LimiterReader_8h__incl.png"'
  225. sh: dot: command not found
  226. error: Problems running dot: exit code=127, command='dot', arguments='"/home/david/mgarepo/audaspace/BUILD/audaspace-1.0/build/doc/Lowpass_8h__incl.dot" -Tpng -o "/home/david/mgarepo/audaspace/BUILD/audaspace-1.0/build/doc/Lowpass_8h__incl.png"'
  227. sh: dot: command not found
  228. error: Problems running dot: exit code=127, command='dot', arguments='"/home/david/mgarepo/audaspace/BUILD/audaspace-1.0/build/doc/LoopReader_8h__incl.dot" -Tpng -o "/home/david/mgarepo/audaspace/BUILD/audaspace-1.0/build/doc/LoopReader_8h__incl.png"'
  229. sh: dot: command not found
  230. error: Problems running dot: exit code=127, command='dot', arguments='"/home/david/mgarepo/audaspace/BUILD/audaspace-1.0/build/doc/LowpassCalculator_8h__incl.dot" -Tpng -o "/home/david/mgarepo/audaspace/BUILD/audaspace-1.0/build/doc/LowpassCalculator_8h__incl.png"'
  231. sh: dot: command not found
  232. error: Problems running dot: exit code=127, command='dot', arguments='"/home/david/mgarepo/audaspace/BUILD/audaspace-1.0/build/doc/Pitch_8h__incl.dot" -Tpng -o "/home/david/mgarepo/audaspace/BUILD/audaspace-1.0/build/doc/Pitch_8h__incl.png"'
  233. sh: dot: command not found
  234. error: Problems running dot: exit code=127, command='dot', arguments='"/home/david/mgarepo/audaspace/BUILD/audaspace-1.0/build/doc/Reverse_8h__incl.dot" -Tpng -o "/home/david/mgarepo/audaspace/BUILD/audaspace-1.0/build/doc/Reverse_8h__incl.png"'
  235. sh: dot: command not found
  236. error: Problems running dot: exit code=127, command='dot', arguments='"/home/david/mgarepo/audaspace/BUILD/audaspace-1.0/build/doc/PitchReader_8h__incl.dot" -Tpng -o "/home/david/mgarepo/audaspace/BUILD/audaspace-1.0/build/doc/PitchReader_8h__incl.png"'
  237. sh: dot: command not found
  238. error: Problems running dot: exit code=127, command='dot', arguments='"/home/david/mgarepo/audaspace/BUILD/audaspace-1.0/build/doc/ReverseReader_8h__incl.dot" -Tpng -o "/home/david/mgarepo/audaspace/BUILD/audaspace-1.0/build/doc/ReverseReader_8h__incl.png"'
  239. sh: dot: command not found
  240. sh: dot: command not found
  241. error: Problems running dot: exit code=127, command='dot', arguments='"/home/david/mgarepo/audaspace/BUILD/audaspace-1.0/build/doc/Threshold_8h__incl.dot" -Tpng -o "/home/david/mgarepo/audaspace/BUILD/audaspace-1.0/build/doc/Threshold_8h__incl.png"'
  242. error: Problems running dot: exit code=127, command='dot', arguments='"/home/david/mgarepo/audaspace/BUILD/audaspace-1.0/build/doc/Sum_8h__incl.dot" -Tpng -o "/home/david/mgarepo/audaspace/BUILD/audaspace-1.0/build/doc/Sum_8h__incl.png"'
  243. sh: dot: command not found
  244. error: Problems running dot: exit code=127, command='dot', arguments='"/home/david/mgarepo/audaspace/BUILD/audaspace-1.0/build/doc/Volume_8h__incl.dot" -Tpng -o "/home/david/mgarepo/audaspace/BUILD/audaspace-1.0/build/doc/Volume_8h__incl.png"'
  245. sh: dot: command not found
  246. error: Problems running dot: exit code=127, command='dot', arguments='"/home/david/mgarepo/audaspace/BUILD/audaspace-1.0/build/doc/Silence_8h__incl.dot" -Tpng -o "/home/david/mgarepo/audaspace/BUILD/audaspace-1.0/build/doc/Silence_8h__incl.png"'
  247. sh: dot: command not found
  248. error: Problems running dot: exit code=127, command='dot', arguments='"/home/david/mgarepo/audaspace/BUILD/audaspace-1.0/build/doc/SawtoothReader_8h__incl.dot" -Tpng -o "/home/david/mgarepo/audaspace/BUILD/audaspace-1.0/build/doc/SawtoothReader_8h__incl.png"'
  249. sh: dot: command not found
  250. error: Problems running dot: exit code=127, command='dot', arguments='"/home/david/mgarepo/audaspace/BUILD/audaspace-1.0/build/doc/SineReader_8h__incl.dot" -Tpng -o "/home/david/mgarepo/audaspace/BUILD/audaspace-1.0/build/doc/SineReader_8h__incl.png"'
  251. sh: dot: command not found
  252. error: Problems running dot: exit code=127, command='dot', arguments='"/home/david/mgarepo/audaspace/BUILD/audaspace-1.0/build/doc/Sawtooth_8h__incl.dot" -Tpng -o "/home/david/mgarepo/audaspace/BUILD/audaspace-1.0/build/doc/Sawtooth_8h__incl.png"'
  253. sh: dot: command not found
  254. error: Problems running dot: exit code=127, command='dot', arguments='"/home/david/mgarepo/audaspace/BUILD/audaspace-1.0/build/doc/SilenceReader_8h__incl.dot" -Tpng -o "/home/david/mgarepo/audaspace/BUILD/audaspace-1.0/build/doc/SilenceReader_8h__incl.png"'
  255. sh: dot: command not found
  256. error: Problems running dot: exit code=127, command='dot', arguments='"/home/david/mgarepo/audaspace/BUILD/audaspace-1.0/build/doc/SquareReader_8h__incl.dot" -Tpng -o "/home/david/mgarepo/audaspace/BUILD/audaspace-1.0/build/doc/SquareReader_8h__incl.png"'
  257. sh: dot: command not found
  258. sh: dot: command not found
  259. error: Problems running dot: exit code=127, command='dot', arguments='"/home/david/mgarepo/audaspace/BUILD/audaspace-1.0/build/doc/Square_8h__incl.dot" -Tpng -o "/home/david/mgarepo/audaspace/BUILD/audaspace-1.0/build/doc/Square_8h__incl.png"'
  260. error: Problems running dot: exit code=127, command='dot', arguments='"/home/david/mgarepo/audaspace/BUILD/audaspace-1.0/build/doc/Sine_8h__incl.dot" -Tpng -o "/home/david/mgarepo/audaspace/BUILD/audaspace-1.0/build/doc/Sine_8h__incl.png"'
  261. sh: dot: command not found
  262. error: Problems running dot: exit code=127, command='dot', arguments='"/home/david/mgarepo/audaspace/BUILD/audaspace-1.0/build/doc/Triangle_8h__incl.dot" -Tpng -o "/home/david/mgarepo/audaspace/BUILD/audaspace-1.0/build/doc/Triangle_8h__incl.png"'
  263. sh: dot: command not found
  264. error: Problems running dot: exit code=127, command='dot', arguments='"/home/david/mgarepo/audaspace/BUILD/audaspace-1.0/build/doc/IReader_8h__incl.dot" -Tpng -o "/home/david/mgarepo/audaspace/BUILD/audaspace-1.0/build/doc/IReader_8h__incl.png"'
  265. sh: dot: command not found
  266. error: Problems running dot: exit code=127, command='dot', arguments='"/home/david/mgarepo/audaspace/BUILD/audaspace-1.0/build/doc/TriangleReader_8h__incl.dot" -Tpng -o "/home/david/mgarepo/audaspace/BUILD/audaspace-1.0/build/doc/TriangleReader_8h__incl.png"'
  267. sh: dot: command not found
  268. error: Problems running dot: exit code=127, command='dot', arguments='"/home/david/mgarepo/audaspace/BUILD/audaspace-1.0/build/doc/ISound_8h__dep__incl.dot" -Tpng -o "/home/david/mgarepo/audaspace/BUILD/audaspace-1.0/build/doc/ISound_8h__dep__incl.png"'
  269. sh: dot: command not found
  270. sh: dot: command not found
  271. error: Problems running dot: exit code=127, command='dot', arguments='"/home/david/mgarepo/audaspace/BUILD/audaspace-1.0/build/doc/PluginManager_8h__incl.dot" -Tpng -o "/home/david/mgarepo/audaspace/BUILD/audaspace-1.0/build/doc/PluginManager_8h__incl.png"'
  272. error: Problems running dot: exit code=127, command='dot', arguments='"/home/david/mgarepo/audaspace/BUILD/audaspace-1.0/build/doc/ISound_8h__incl.dot" -Tpng -o "/home/david/mgarepo/audaspace/BUILD/audaspace-1.0/build/doc/ISound_8h__incl.png"'
  273. sh: dot: command not found
  274. error: Problems running dot: exit code=127, command='dot', arguments='"/home/david/mgarepo/audaspace/BUILD/audaspace-1.0/build/doc/IReader_8h__dep__incl.dot" -Tpng -o "/home/david/mgarepo/audaspace/BUILD/audaspace-1.0/build/doc/IReader_8h__dep__incl.png"'
  275. sh: dot: command not found
  276. error: Problems running dot: exit code=127, command='dot', arguments='"/home/david/mgarepo/audaspace/BUILD/audaspace-1.0/build/doc/ChannelMapper_8h__incl.dot" -Tpng -o "/home/david/mgarepo/audaspace/BUILD/audaspace-1.0/build/doc/ChannelMapper_8h__incl.png"'
  277. sh: dot: command not found
  278. error: Problems running dot: exit code=127, command='dot', arguments='"/home/david/mgarepo/audaspace/BUILD/audaspace-1.0/build/doc/ConverterFunctions_8h__incl.dot" -Tpng -o "/home/david/mgarepo/audaspace/BUILD/audaspace-1.0/build/doc/ConverterFunctions_8h__incl.png"'
  279. sh: dot: command not found
  280. sh: dot: command not found
  281. error: Problems running dot: exit code=127, command='dot', arguments='"/home/david/mgarepo/audaspace/BUILD/audaspace-1.0/build/doc/ChannelMapperReader_8h__incl.dot" -Tpng -o "/home/david/mgarepo/audaspace/BUILD/audaspace-1.0/build/doc/ChannelMapperReader_8h__incl.png"'
  282. error: Problems running dot: exit code=127, command='dot', arguments='"/home/david/mgarepo/audaspace/BUILD/audaspace-1.0/build/doc/Converter_8h__incl.dot" -Tpng -o "/home/david/mgarepo/audaspace/BUILD/audaspace-1.0/build/doc/Converter_8h__incl.png"'
  283. sh: dot: command not found
  284. error: Problems running dot: exit code=127, command='dot', arguments='"/home/david/mgarepo/audaspace/BUILD/audaspace-1.0/build/doc/ConverterFunctions_8h__dep__incl.dot" -Tpng -o "/home/david/mgarepo/audaspace/BUILD/audaspace-1.0/build/doc/ConverterFunctions_8h__dep__incl.png"'
  285. sh: dot: command not found
  286. error: Problems running dot: exit code=127, command='dot', arguments='"/home/david/mgarepo/audaspace/BUILD/audaspace-1.0/build/doc/ConverterReader_8h__incl.dot" -Tpng -o "/home/david/mgarepo/audaspace/BUILD/audaspace-1.0/build/doc/ConverterReader_8h__incl.png"'
  287. sh: dot: command not found
  288. error: Problems running dot: exit code=127, command='dot', arguments='"/home/david/mgarepo/audaspace/BUILD/audaspace-1.0/build/doc/JOSResampleReader_8h__incl.dot" -Tpng -o "/home/david/mgarepo/audaspace/BUILD/audaspace-1.0/build/doc/JOSResampleReader_8h__incl.png"'
  289. sh: dot: command not found
  290. error: Problems running dot: exit code=127, command='dot', arguments='"/home/david/mgarepo/audaspace/BUILD/audaspace-1.0/build/doc/LinearResampleReader_8h__incl.dot" -Tpng -o "/home/david/mgarepo/audaspace/BUILD/audaspace-1.0/build/doc/LinearResampleReader_8h__incl.png"'
  291. sh: dot: command not found
  292. error: Problems running dot: exit code=127, command='dot', arguments='"/home/david/mgarepo/audaspace/BUILD/audaspace-1.0/build/doc/JOSResample_8h__incl.dot" -Tpng -o "/home/david/mgarepo/audaspace/BUILD/audaspace-1.0/build/doc/JOSResample_8h__incl.png"'
  293. sh: dot: command not found
  294. error: Problems running dot: exit code=127, command='dot', arguments='"/home/david/mgarepo/audaspace/BUILD/audaspace-1.0/build/doc/LinearResample_8h__incl.dot" -Tpng -o "/home/david/mgarepo/audaspace/BUILD/audaspace-1.0/build/doc/LinearResample_8h__incl.png"'
  295. sh: dot: command not found
  296. error: Problems running dot: exit code=127, command='dot', arguments='"/home/david/mgarepo/audaspace/BUILD/audaspace-1.0/build/doc/Mixer_8h__incl.dot" -Tpng -o "/home/david/mgarepo/audaspace/BUILD/audaspace-1.0/build/doc/Mixer_8h__incl.png"'
  297. sh: dot: command not found
  298. error: Problems running dot: exit code=127, command='dot', arguments='"/home/david/mgarepo/audaspace/BUILD/audaspace-1.0/build/doc/ResampleReader_8h__incl.dot" -Tpng -o "/home/david/mgarepo/audaspace/BUILD/audaspace-1.0/build/doc/ResampleReader_8h__incl.png"'
  299. sh: dot: command not found
  300. error: Problems running dot: exit code=127, command='dot', arguments='"/home/david/mgarepo/audaspace/BUILD/audaspace-1.0/build/doc/Specification_8h__incl.dot" -Tpng -o "/home/david/mgarepo/audaspace/BUILD/audaspace-1.0/build/doc/Specification_8h__incl.png"'
  301. sh: dot: command not found
  302. error: Problems running dot: exit code=127, command='dot', arguments='"/home/david/mgarepo/audaspace/BUILD/audaspace-1.0/build/doc/ResampleReader_8h__dep__incl.dot" -Tpng -o "/home/david/mgarepo/audaspace/BUILD/audaspace-1.0/build/doc/ResampleReader_8h__dep__incl.png"'
  303. sh: dot: command not found
  304. error: Problems running dot: exit code=127, command='dot', arguments='"/home/david/mgarepo/audaspace/BUILD/audaspace-1.0/build/doc/Specification_8h__dep__incl.dot" -Tpng -o "/home/david/mgarepo/audaspace/BUILD/audaspace-1.0/build/doc/Specification_8h__dep__incl.png"'
  305. sh: dot: command not found
  306. sh: dot: command not found
  307. error: Problems running dot: exit code=127, command='dot', arguments='"/home/david/mgarepo/audaspace/BUILD/audaspace-1.0/build/doc/SpecsChanger_8h__dep__incl.dot" -Tpng -o "/home/david/mgarepo/audaspace/BUILD/audaspace-1.0/build/doc/SpecsChanger_8h__dep__incl.png"'
  308. sh: dot: command not found
  309. error: Problems running dot: exit code=127, command='dot', arguments='"/home/david/mgarepo/audaspace/BUILD/audaspace-1.0/build/doc/Double_8h__incl.dot" -Tpng -o "/home/david/mgarepo/audaspace/BUILD/audaspace-1.0/build/doc/Double_8h__incl.png"'
  310. error: Problems running dot: exit code=127, command='dot', arguments='"/home/david/mgarepo/audaspace/BUILD/audaspace-1.0/build/doc/SpecsChanger_8h__incl.dot" -Tpng -o "/home/david/mgarepo/audaspace/BUILD/audaspace-1.0/build/doc/SpecsChanger_8h__incl.png"'
  311. sh: dot: command not found
  312. sh: dot: command not found
  313. error: Problems running dot: exit code=127, command='dot', arguments='"/home/david/mgarepo/audaspace/BUILD/audaspace-1.0/build/doc/AnimateableProperty_8h__dep__incl.dot" -Tpng -o "/home/david/mgarepo/audaspace/BUILD/audaspace-1.0/build/doc/AnimateableProperty_8h__dep__incl.png"'
  314. error: Problems running dot: exit code=127, command='dot', arguments='"/home/david/mgarepo/audaspace/BUILD/audaspace-1.0/build/doc/DoubleReader_8h__incl.dot" -Tpng -o "/home/david/mgarepo/audaspace/BUILD/audaspace-1.0/build/doc/DoubleReader_8h__incl.png"'
  315. sh: dot: command not found
  316. error: Problems running dot: exit code=127, command='dot', arguments='"/home/david/mgarepo/audaspace/BUILD/audaspace-1.0/build/doc/AnimateableProperty_8h__incl.dot" -Tpng -o "/home/david/mgarepo/audaspace/BUILD/audaspace-1.0/build/doc/AnimateableProperty_8h__incl.png"'
  317. sh: dot: command not found
  318. error: Problems running dot: exit code=127, command='dot', arguments='"/home/david/mgarepo/audaspace/BUILD/audaspace-1.0/build/doc/PingPong_8h__incl.dot" -Tpng -o "/home/david/mgarepo/audaspace/BUILD/audaspace-1.0/build/doc/PingPong_8h__incl.png"'
  319. sh: dot: command not found
  320. error: Problems running dot: exit code=127, command='dot', arguments='"/home/david/mgarepo/audaspace/BUILD/audaspace-1.0/build/doc/Sequence_8h__incl.dot" -Tpng -o "/home/david/mgarepo/audaspace/BUILD/audaspace-1.0/build/doc/Sequence_8h__incl.png"'
  321. sh: dot: command not found
  322. error: Problems running dot: exit code=127, command='dot', arguments='"/home/david/mgarepo/audaspace/BUILD/audaspace-1.0/build/doc/SequenceData_8h__incl.dot" -Tpng -o "/home/david/mgarepo/audaspace/BUILD/audaspace-1.0/build/doc/SequenceData_8h__incl.png"'
  323. sh: dot: command not found
  324. error: Problems running dot: exit code=127, command='dot', arguments='"/home/david/mgarepo/audaspace/BUILD/audaspace-1.0/build/doc/Superpose_8h__incl.dot" -Tpng -o "/home/david/mgarepo/audaspace/BUILD/audaspace-1.0/build/doc/Superpose_8h__incl.png"'
  325. sh: dot: command not found
  326. sh: dot: command not found
  327. error: Problems running dot: exit code=127, command='dot', arguments='"/home/david/mgarepo/audaspace/BUILD/audaspace-1.0/build/doc/SequenceEntry_8h__incl.dot" -Tpng -o "/home/david/mgarepo/audaspace/BUILD/audaspace-1.0/build/doc/SequenceEntry_8h__incl.png"'
  328. error: Problems running dot: exit code=127, command='dot', arguments='"/home/david/mgarepo/audaspace/BUILD/audaspace-1.0/build/doc/SequenceReader_8h__incl.dot" -Tpng -o "/home/david/mgarepo/audaspace/BUILD/audaspace-1.0/build/doc/SequenceReader_8h__incl.png"'
  329. sh: dot: command not found
  330. error: Problems running dot: exit code=127, command='dot', arguments='"/home/david/mgarepo/audaspace/BUILD/audaspace-1.0/build/doc/Buffer_8h__incl.dot" -Tpng -o "/home/david/mgarepo/audaspace/BUILD/audaspace-1.0/build/doc/Buffer_8h__incl.png"'
  331. sh: dot: command not found
  332. error: Problems running dot: exit code=127, command='dot', arguments='"/home/david/mgarepo/audaspace/BUILD/audaspace-1.0/build/doc/ILockable_8h__incl.dot" -Tpng -o "/home/david/mgarepo/audaspace/BUILD/audaspace-1.0/build/doc/ILockable_8h__incl.png"'
  333. sh: dot: command not found
  334. sh: dot: command not found
  335. error: Problems running dot: exit code=127, command='dot', arguments='"/home/david/mgarepo/audaspace/BUILD/audaspace-1.0/build/doc/SuperposeReader_8h__incl.dot" -Tpng -o "/home/david/mgarepo/audaspace/BUILD/audaspace-1.0/build/doc/SuperposeReader_8h__incl.png"'
  336. error: Problems running dot: exit code=127, command='dot', arguments='"/home/david/mgarepo/audaspace/BUILD/audaspace-1.0/build/doc/BufferReader_8h__incl.dot" -Tpng -o "/home/david/mgarepo/audaspace/BUILD/audaspace-1.0/build/doc/BufferReader_8h__incl.png"'
  337. sh: dot: command not found
  338. error: Problems running dot: exit code=127, command='dot', arguments='"/home/david/mgarepo/audaspace/BUILD/audaspace-1.0/build/doc/ILockable_8h__dep__incl.dot" -Tpng -o "/home/david/mgarepo/audaspace/BUILD/audaspace-1.0/build/doc/ILockable_8h__dep__incl.png"'
  339. sh: dot: command not found
  340. error: Problems running dot: exit code=127, command='dot', arguments='"/home/david/mgarepo/audaspace/BUILD/audaspace-1.0/build/doc/Math3D_8h__dep__incl.dot" -Tpng -o "/home/david/mgarepo/audaspace/BUILD/audaspace-1.0/build/doc/Math3D_8h__dep__incl.png"'
  341. sh: dot: command not found
  342. error: Problems running dot: exit code=127, command='dot', arguments='"/home/david/mgarepo/audaspace/BUILD/audaspace-1.0/build/doc/FFMPEGReader_8h__incl.dot" -Tpng -o "/home/david/mgarepo/audaspace/BUILD/audaspace-1.0/build/doc/FFMPEGReader_8h__incl.png"'
  343. sh: dot: command not found
  344. error: Problems running dot: exit code=127, command='dot', arguments='"/home/david/mgarepo/audaspace/BUILD/audaspace-1.0/build/doc/FFMPEG_8h__incl.dot" -Tpng -o "/home/david/mgarepo/audaspace/BUILD/audaspace-1.0/build/doc/FFMPEG_8h__incl.png"'
  345. sh: dot: command not found
  346. error: Problems running dot: exit code=127, command='dot', arguments='"/home/david/mgarepo/audaspace/BUILD/audaspace-1.0/build/doc/Buffer_8h__dep__incl.dot" -Tpng -o "/home/david/mgarepo/audaspace/BUILD/audaspace-1.0/build/doc/Buffer_8h__dep__incl.png"'
  347. sh: dot: command not found
  348. error: Problems running dot: exit code=127, command='dot', arguments='"/home/david/mgarepo/audaspace/BUILD/audaspace-1.0/build/doc/StreamBuffer_8h__incl.dot" -Tpng -o "/home/david/mgarepo/audaspace/BUILD/audaspace-1.0/build/doc/StreamBuffer_8h__incl.png"'
  349. sh: dot: command not found
  350. error: Problems running dot: exit code=127, command='dot', arguments='"/home/david/mgarepo/audaspace/BUILD/audaspace-1.0/build/doc/JackDevice_8h__incl.dot" -Tpng -o "/home/david/mgarepo/audaspace/BUILD/audaspace-1.0/build/doc/JackDevice_8h__incl.png"'
  351. sh: dot: command not found
  352. error: Problems running dot: exit code=127, command='dot', arguments='"/home/david/mgarepo/audaspace/BUILD/audaspace-1.0/build/doc/FFMPEGWriter_8h__incl.dot" -Tpng -o "/home/david/mgarepo/audaspace/BUILD/audaspace-1.0/build/doc/FFMPEGWriter_8h__incl.png"'
  353. sh: dot: command not found
  354. error: Problems running dot: exit code=127, command='dot', arguments='"/home/david/mgarepo/audaspace/BUILD/audaspace-1.0/build/doc/JackSynchronizer_8h__dep__incl.dot" -Tpng -o "/home/david/mgarepo/audaspace/BUILD/audaspace-1.0/build/doc/JackSynchronizer_8h__dep__incl.png"'
  355. sh: dot: command not found
  356. error: Problems running dot: exit code=127, command='dot', arguments='"/home/david/mgarepo/audaspace/BUILD/audaspace-1.0/build/doc/Math3D_8h__incl.dot" -Tpng -o "/home/david/mgarepo/audaspace/BUILD/audaspace-1.0/build/doc/Math3D_8h__incl.png"'
  357. sh: dot: command not found
  358. error: Problems running dot: exit code=127, command='dot', arguments='"/home/david/mgarepo/audaspace/BUILD/audaspace-1.0/build/doc/SndFileReader_8h__incl.dot" -Tpng -o "/home/david/mgarepo/audaspace/BUILD/audaspace-1.0/build/doc/SndFileReader_8h__incl.png"'
  359. sh: dot: command not found
  360. error: Problems running dot: exit code=127, command='dot', arguments='"/home/david/mgarepo/audaspace/BUILD/audaspace-1.0/build/doc/SndFile_8h__incl.dot" -Tpng -o "/home/david/mgarepo/audaspace/BUILD/audaspace-1.0/build/doc/SndFile_8h__incl.png"'
  361. sh: dot: command not found
  362. error: Problems running dot: exit code=127, command='dot', arguments='"/home/david/mgarepo/audaspace/BUILD/audaspace-1.0/build/doc/JackSynchronizer_8h__incl.dot" -Tpng -o "/home/david/mgarepo/audaspace/BUILD/audaspace-1.0/build/doc/JackSynchronizer_8h__incl.png"'
  363. sh: dot: command not found
  364. error: Problems running dot: exit code=127, command='dot', arguments='"/home/david/mgarepo/audaspace/BUILD/audaspace-1.0/build/doc/OpenALReader_8h__incl.dot" -Tpng -o "/home/david/mgarepo/audaspace/BUILD/audaspace-1.0/build/doc/OpenALReader_8h__incl.png"'
  365. sh: dot: command not found
  366. sh: dot: command not found
  367. error: Problems running dot: exit code=127, command='dot', arguments='"/home/david/mgarepo/audaspace/BUILD/audaspace-1.0/build/doc/SDLDevice_8h__incl.dot" -Tpng -o "/home/david/mgarepo/audaspace/BUILD/audaspace-1.0/build/doc/SDLDevice_8h__incl.png"'
  368. error: Problems running dot: exit code=127, command='dot', arguments='"/home/david/mgarepo/audaspace/BUILD/audaspace-1.0/build/doc/OpenALDevice_8h__incl.dot" -Tpng -o "/home/david/mgarepo/audaspace/BUILD/audaspace-1.0/build/doc/OpenALDevice_8h__incl.png"'
  369. sh: dot: command not found
  370. error: Problems running dot: exit code=127, command='dot', arguments='"/home/david/mgarepo/audaspace/BUILD/audaspace-1.0/build/doc/classADSR__inherit__graph.dot" -Tpng -o "/home/david/mgarepo/audaspace/BUILD/audaspace-1.0/build/doc/classADSR__inherit__graph.png"'
  371. sh: dot: command not found
  372. error: Problems running dot: exit code=127, command='dot', arguments='"/home/david/mgarepo/audaspace/BUILD/audaspace-1.0/build/doc/classADSRReader__inherit__graph.dot" -Tpng -o "/home/david/mgarepo/audaspace/BUILD/audaspace-1.0/build/doc/classADSRReader__inherit__graph.png"'
  373. sh: dot: command not found
  374. error: Problems running dot: exit code=127, command='dot', arguments='"/home/david/mgarepo/audaspace/BUILD/audaspace-1.0/build/doc/SndFileWriter_8h__incl.dot" -Tpng -o "/home/david/mgarepo/audaspace/BUILD/audaspace-1.0/build/doc/SndFileWriter_8h__incl.png"'
  375. sh: dot: command not found
  376. sh: dot: command not found
  377. error: Problems running dot: exit code=127, command='dot', arguments='"/home/david/mgarepo/audaspace/BUILD/audaspace-1.0/build/doc/classBuffer__inherit__graph.dot" -Tpng -o "/home/david/mgarepo/audaspace/BUILD/audaspace-1.0/build/doc/classBuffer__inherit__graph.png"'
  378. error: Problems running dot: exit code=127, command='dot', arguments='"/home/david/mgarepo/audaspace/BUILD/audaspace-1.0/build/doc/classAccumulator__inherit__graph.dot" -Tpng -o "/home/david/mgarepo/audaspace/BUILD/audaspace-1.0/build/doc/classAccumulator__inherit__graph.png"'
  379. sh: dot: command not found
  380. sh: dot: command not found
  381. error: Problems running dot: exit code=127, command='dot', arguments='"/home/david/mgarepo/audaspace/BUILD/audaspace-1.0/build/doc/classBaseIIRFilterReader__inherit__graph.dot" -Tpng -o "/home/david/mgarepo/audaspace/BUILD/audaspace-1.0/build/doc/classBaseIIRFilterReader__inherit__graph.png"'
  382. error: Problems running dot: exit code=127, command='dot', arguments='"/home/david/mgarepo/audaspace/BUILD/audaspace-1.0/build/doc/classButterworth__inherit__graph.dot" -Tpng -o "/home/david/mgarepo/audaspace/BUILD/audaspace-1.0/build/doc/classButterworth__inherit__graph.png"'
  383. sh: dot: command not found
  384. error: Problems running dot: exit code=127, command='dot', arguments='"/home/david/mgarepo/audaspace/BUILD/audaspace-1.0/build/doc/classAnimateableProperty__inherit__graph.dot" -Tpng -o "/home/david/mgarepo/audaspace/BUILD/audaspace-1.0/build/doc/classAnimateableProperty__inherit__graph.png"'
  385. sh: dot: command not found
  386. error: Problems running dot: exit code=127, command='dot', arguments='"/home/david/mgarepo/audaspace/BUILD/audaspace-1.0/build/doc/classCallbackIIRFilterReader__inherit__graph.dot" -Tpng -o "/home/david/mgarepo/audaspace/BUILD/audaspace-1.0/build/doc/classCallbackIIRFilterReader__inherit__graph.png"'
  387. sh: dot: command not found
  388. error: Problems running dot: exit code=127, command='dot', arguments='"/home/david/mgarepo/audaspace/BUILD/audaspace-1.0/build/doc/classButterworthCalculator__inherit__graph.dot" -Tpng -o "/home/david/mgarepo/audaspace/BUILD/audaspace-1.0/build/doc/classButterworthCalculator__inherit__graph.png"'
  389. sh: dot: command not found
  390. error: Problems running dot: exit code=127, command='dot', arguments='"/home/david/mgarepo/audaspace/BUILD/audaspace-1.0/build/doc/classConverterReader__inherit__graph.dot" -Tpng -o "/home/david/mgarepo/audaspace/BUILD/audaspace-1.0/build/doc/classConverterReader__inherit__graph.png"'
  391. sh: dot: command not found
  392. error: Problems running dot: exit code=127, command='dot', arguments='"/home/david/mgarepo/audaspace/BUILD/audaspace-1.0/build/doc/classChannelMapper__inherit__graph.dot" -Tpng -o "/home/david/mgarepo/audaspace/BUILD/audaspace-1.0/build/doc/classChannelMapper__inherit__graph.png"'
  393. sh: dot: command not found
  394. sh: dot: command not found
  395. error: Problems running dot: exit code=127, command='dot', arguments='"/home/david/mgarepo/audaspace/BUILD/audaspace-1.0/build/doc/classConverter__inherit__graph.dot" -Tpng -o "/home/david/mgarepo/audaspace/BUILD/audaspace-1.0/build/doc/classConverter__inherit__graph.png"'
  396. error: Problems running dot: exit code=127, command='dot', arguments='"/home/david/mgarepo/audaspace/BUILD/audaspace-1.0/build/doc/classBufferReader__inherit__graph.dot" -Tpng -o "/home/david/mgarepo/audaspace/BUILD/audaspace-1.0/build/doc/classBufferReader__inherit__graph.png"'
  397. sh: dot: command not found
  398. sh: dot: command not found
  399. error: Problems running dot: exit code=127, command='dot', arguments='"/home/david/mgarepo/audaspace/BUILD/audaspace-1.0/build/doc/classDefaultSynchronizer__inherit__graph.dot" -Tpng -o "/home/david/mgarepo/audaspace/BUILD/audaspace-1.0/build/doc/classDefaultSynchronizer__inherit__graph.png"'
  400. error: Problems running dot: exit code=127, command='dot', arguments='"/home/david/mgarepo/audaspace/BUILD/audaspace-1.0/build/doc/classChannelMapperReader__inherit__graph.dot" -Tpng -o "/home/david/mgarepo/audaspace/BUILD/audaspace-1.0/build/doc/classChannelMapperReader__inherit__graph.png"'
  401. sh: dot: command not found
  402. error: Problems running dot: exit code=127, command='dot', arguments='"/home/david/mgarepo/audaspace/BUILD/audaspace-1.0/build/doc/classDelayReader__inherit__graph.dot" -Tpng -o "/home/david/mgarepo/audaspace/BUILD/audaspace-1.0/build/doc/classDelayReader__inherit__graph.png"'
  403. sh: dot: command not found
  404. error: Problems running dot: exit code=127, command='dot', arguments='"/home/david/mgarepo/audaspace/BUILD/audaspace-1.0/build/doc/classDouble__inherit__graph.dot" -Tpng -o "/home/david/mgarepo/audaspace/BUILD/audaspace-1.0/build/doc/classDouble__inherit__graph.png"'
  405. sh: dot: command not found
  406. error: Problems running dot: exit code=127, command='dot', arguments='"/home/david/mgarepo/audaspace/BUILD/audaspace-1.0/build/doc/classDelay__inherit__graph.dot" -Tpng -o "/home/david/mgarepo/audaspace/BUILD/audaspace-1.0/build/doc/classDelay__inherit__graph.png"'
  407. sh: dot: command not found
  408. error: Problems running dot: exit code=127, command='dot', arguments='"/home/david/mgarepo/audaspace/BUILD/audaspace-1.0/build/doc/classDeviceException__inherit__graph.dot" -Tpng -o "/home/david/mgarepo/audaspace/BUILD/audaspace-1.0/build/doc/classDeviceException__inherit__graph.png"'
  409. sh: dot: command not found
  410. sh: dot: command not found
  411. error: Problems running dot: exit code=127, command='dot', arguments='"/home/david/mgarepo/audaspace/BUILD/audaspace-1.0/build/doc/classDynamicIIRFilter__inherit__graph.dot" -Tpng -o "/home/david/mgarepo/audaspace/BUILD/audaspace-1.0/build/doc/classDynamicIIRFilter__inherit__graph.png"'
  412. error: Problems running dot: exit code=127, command='dot', arguments='"/home/david/mgarepo/audaspace/BUILD/audaspace-1.0/build/doc/classDoubleReader__inherit__graph.dot" -Tpng -o "/home/david/mgarepo/audaspace/BUILD/audaspace-1.0/build/doc/classDoubleReader__inherit__graph.png"'
  413. sh: dot: command not found
  414. error: Problems running dot: exit code=127, command='dot', arguments='"/home/david/mgarepo/audaspace/BUILD/audaspace-1.0/build/doc/classEffect__inherit__graph.dot" -Tpng -o "/home/david/mgarepo/audaspace/BUILD/audaspace-1.0/build/doc/classEffect__inherit__graph.png"'
  415. sh: dot: command not found
  416. error: Problems running dot: exit code=127, command='dot', arguments='"/home/david/mgarepo/audaspace/BUILD/audaspace-1.0/build/doc/classEffectReader__inherit__graph.dot" -Tpng -o "/home/david/mgarepo/audaspace/BUILD/audaspace-1.0/build/doc/classEffectReader__inherit__graph.png"'
  417. sh: dot: command not found
  418. error: Problems running dot: exit code=127, command='dot', arguments='"/home/david/mgarepo/audaspace/BUILD/audaspace-1.0/build/doc/classDynamicIIRFilterReader__inherit__graph.dot" -Tpng -o "/home/david/mgarepo/audaspace/BUILD/audaspace-1.0/build/doc/classDynamicIIRFilterReader__inherit__graph.png"'
  419. sh: dot: command not found
  420. sh: dot: command not found
  421. error: Problems running dot: exit code=127, command='dot', arguments='"/home/david/mgarepo/audaspace/BUILD/audaspace-1.0/build/doc/classEnvelope__inherit__graph.dot" -Tpng -o "/home/david/mgarepo/audaspace/BUILD/audaspace-1.0/build/doc/classEnvelope__inherit__graph.png"'
  422. error: Problems running dot: exit code=127, command='dot', arguments='"/home/david/mgarepo/audaspace/BUILD/audaspace-1.0/build/doc/classFader__inherit__graph.dot" -Tpng -o "/home/david/mgarepo/audaspace/BUILD/audaspace-1.0/build/doc/classFader__inherit__graph.png"'
  423. sh: dot: command not found
  424. error: Problems running dot: exit code=127, command='dot', arguments='"/home/david/mgarepo/audaspace/BUILD/audaspace-1.0/build/doc/classFaderReader__inherit__graph.dot" -Tpng -o "/home/david/mgarepo/audaspace/BUILD/audaspace-1.0/build/doc/classFaderReader__inherit__graph.png"'
  425. sh: dot: command not found
  426. sh: dot: command not found
  427. error: Problems running dot: exit code=127, command='dot', arguments='"/home/david/mgarepo/audaspace/BUILD/audaspace-1.0/build/doc/classException__inherit__graph.dot" -Tpng -o "/home/david/mgarepo/audaspace/BUILD/audaspace-1.0/build/doc/classException__inherit__graph.png"'
  428. sh: dot: command not found
  429. error: Problems running dot: exit code=127, command='dot', arguments='"/home/david/mgarepo/audaspace/BUILD/audaspace-1.0/build/doc/classFileException__inherit__graph.dot" -Tpng -o "/home/david/mgarepo/audaspace/BUILD/audaspace-1.0/build/doc/classFileException__inherit__graph.png"'
  430. error: Problems running dot: exit code=127, command='dot', arguments='"/home/david/mgarepo/audaspace/BUILD/audaspace-1.0/build/doc/classFFMPEGReader__inherit__graph.dot" -Tpng -o "/home/david/mgarepo/audaspace/BUILD/audaspace-1.0/build/doc/classFFMPEGReader__inherit__graph.png"'
  431. sh: dot: command not found
  432. error: Problems running dot: exit code=127, command='dot', arguments='"/home/david/mgarepo/audaspace/BUILD/audaspace-1.0/build/doc/classFile__inherit__graph.dot" -Tpng -o "/home/david/mgarepo/audaspace/BUILD/audaspace-1.0/build/doc/classFile__inherit__graph.png"'
  433. sh: dot: command not found
  434. error: Problems running dot: exit code=127, command='dot', arguments='"/home/david/mgarepo/audaspace/BUILD/audaspace-1.0/build/doc/classFFMPEG__inherit__graph.dot" -Tpng -o "/home/david/mgarepo/audaspace/BUILD/audaspace-1.0/build/doc/classFFMPEG__inherit__graph.png"'
  435. sh: dot: command not found
  436. error: Problems running dot: exit code=127, command='dot', arguments='"/home/david/mgarepo/audaspace/BUILD/audaspace-1.0/build/doc/classFFMPEGWriter__inherit__graph.dot" -Tpng -o "/home/david/mgarepo/audaspace/BUILD/audaspace-1.0/build/doc/classFFMPEGWriter__inherit__graph.png"'
  437. sh: dot: command not found
  438. error: Problems running dot: exit code=127, command='dot', arguments='"/home/david/mgarepo/audaspace/BUILD/audaspace-1.0/build/doc/classHighpass__inherit__graph.dot" -Tpng -o "/home/david/mgarepo/audaspace/BUILD/audaspace-1.0/build/doc/classHighpass__inherit__graph.png"'
  439. sh: dot: command not found
  440. error: Problems running dot: exit code=127, command='dot', arguments='"/home/david/mgarepo/audaspace/BUILD/audaspace-1.0/build/doc/classHighpassCalculator__inherit__graph.dot" -Tpng -o "/home/david/mgarepo/audaspace/BUILD/audaspace-1.0/build/doc/classHighpassCalculator__inherit__graph.png"'
  441. sh: dot: command not found
  442. error: Problems running dot: exit code=127, command='dot', arguments='"/home/david/mgarepo/audaspace/BUILD/audaspace-1.0/build/doc/classI3DHandle__inherit__graph.dot" -Tpng -o "/home/david/mgarepo/audaspace/BUILD/audaspace-1.0/build/doc/classI3DHandle__inherit__graph.png"'
  443. sh: dot: command not found
  444. error: Problems running dot: exit code=127, command='dot', arguments='"/home/david/mgarepo/audaspace/BUILD/audaspace-1.0/build/doc/classIDevice__inherit__graph.dot" -Tpng -o "/home/david/mgarepo/audaspace/BUILD/audaspace-1.0/build/doc/classIDevice__inherit__graph.png"'
  445. sh: dot: command not found
  446. error: Problems running dot: exit code=127, command='dot', arguments='"/home/david/mgarepo/audaspace/BUILD/audaspace-1.0/build/doc/classI3DDevice__inherit__graph.dot" -Tpng -o "/home/david/mgarepo/audaspace/BUILD/audaspace-1.0/build/doc/classI3DDevice__inherit__graph.png"'
  447. sh: dot: command not found
  448. error: Problems running dot: exit code=127, command='dot', arguments='"/home/david/mgarepo/audaspace/BUILD/audaspace-1.0/build/doc/classIIRFilter__inherit__graph.dot" -Tpng -o "/home/david/mgarepo/audaspace/BUILD/audaspace-1.0/build/doc/classIIRFilter__inherit__graph.png"'
  449. sh: dot: command not found
  450. error: Problems running dot: exit code=127, command='dot', arguments='"/home/david/mgarepo/audaspace/BUILD/audaspace-1.0/build/doc/classIFileOutput__inherit__graph.dot" -Tpng -o "/home/david/mgarepo/audaspace/BUILD/audaspace-1.0/build/doc/classIFileOutput__inherit__graph.png"'
  451. sh: dot: command not found
  452. error: Problems running dot: exit code=127, command='dot', arguments='"/home/david/mgarepo/audaspace/BUILD/audaspace-1.0/build/doc/classIHandle__inherit__graph.dot" -Tpng -o "/home/david/mgarepo/audaspace/BUILD/audaspace-1.0/build/doc/classIHandle__inherit__graph.png"'
  453. sh: dot: command not found
  454. error: Problems running dot: exit code=127, command='dot', arguments='"/home/david/mgarepo/audaspace/BUILD/audaspace-1.0/build/doc/classIFileInput__inherit__graph.dot" -Tpng -o "/home/david/mgarepo/audaspace/BUILD/audaspace-1.0/build/doc/classIFileInput__inherit__graph.png"'
  455. sh: dot: command not found
  456. error: Problems running dot: exit code=127, command='dot', arguments='"/home/david/mgarepo/audaspace/BUILD/audaspace-1.0/build/doc/classIDynamicIIRFilterCalculator__inherit__graph.dot" -Tpng -o "/home/david/mgarepo/audaspace/BUILD/audaspace-1.0/build/doc/classIDynamicIIRFilterCalculator__inherit__graph.png"'
  457. sh: dot: command not found
  458. error: Problems running dot: exit code=127, command='dot', arguments='"/home/david/mgarepo/audaspace/BUILD/audaspace-1.0/build/doc/classIReader__inherit__graph.dot" -Tpng -o "/home/david/mgarepo/audaspace/BUILD/audaspace-1.0/build/doc/classIReader__inherit__graph.png"'
  459. sh: dot: command not found
  460. error: Problems running dot: exit code=127, command='dot', arguments='"/home/david/mgarepo/audaspace/BUILD/audaspace-1.0/build/doc/classISynchronizer__inherit__graph.dot" -Tpng -o "/home/david/mgarepo/audaspace/BUILD/audaspace-1.0/build/doc/classISynchronizer__inherit__graph.png"'
  461. sh: dot: command not found
  462. sh: dot: command not found
  463. error: Problems running dot: exit code=127, command='dot', arguments='"/home/david/mgarepo/audaspace/BUILD/audaspace-1.0/build/doc/classIIRFilterReader__inherit__graph.dot" -Tpng -o "/home/david/mgarepo/audaspace/BUILD/audaspace-1.0/build/doc/classIIRFilterReader__inherit__graph.png"'
  464. sh: dot: command not found
  465. error: Problems running dot: exit code=127, command='dot', arguments='"/home/david/mgarepo/audaspace/BUILD/audaspace-1.0/build/doc/classISound__inherit__graph.dot" -Tpng -o "/home/david/mgarepo/audaspace/BUILD/audaspace-1.0/build/doc/classISound__inherit__graph.png"'
  466. sh: dot: command not found
  467. error: Problems running dot: exit code=127, command='dot', arguments='"/home/david/mgarepo/audaspace/BUILD/audaspace-1.0/build/doc/classJackSynchronizer__inherit__graph.dot" -Tpng -o "/home/david/mgarepo/audaspace/BUILD/audaspace-1.0/build/doc/classJackSynchronizer__inherit__graph.png"'
  468. error: Problems running dot: exit code=127, command='dot', arguments='"/home/david/mgarepo/audaspace/BUILD/audaspace-1.0/build/doc/classILockable__inherit__graph.dot" -Tpng -o "/home/david/mgarepo/audaspace/BUILD/audaspace-1.0/build/doc/classILockable__inherit__graph.png"'
  469. sh: dot: command not found
  470. error: Problems running dot: exit code=127, command='dot', arguments='"/home/david/mgarepo/audaspace/BUILD/audaspace-1.0/build/doc/classJackDevice__inherit__graph.dot" -Tpng -o "/home/david/mgarepo/audaspace/BUILD/audaspace-1.0/build/doc/classJackDevice__inherit__graph.png"'
  471. sh: dot: command not found
  472. error: Problems running dot: exit code=127, command='dot', arguments='"/home/david/mgarepo/audaspace/BUILD/audaspace-1.0/build/doc/classJOSResample__inherit__graph.dot" -Tpng -o "/home/david/mgarepo/audaspace/BUILD/audaspace-1.0/build/doc/classJOSResample__inherit__graph.png"'
  473. sh: dot: command not found
  474. error: Problems running dot: exit code=127, command='dot', arguments='"/home/david/mgarepo/audaspace/BUILD/audaspace-1.0/build/doc/classLimiter__inherit__graph.dot" -Tpng -o "/home/david/mgarepo/audaspace/BUILD/audaspace-1.0/build/doc/classLimiter__inherit__graph.png"'
  475. sh: dot: command not found
  476. error: Problems running dot: exit code=127, command='dot', arguments='"/home/david/mgarepo/audaspace/BUILD/audaspace-1.0/build/doc/classIWriter__inherit__graph.dot" -Tpng -o "/home/david/mgarepo/audaspace/BUILD/audaspace-1.0/build/doc/classIWriter__inherit__graph.png"'
  477. sh: dot: command not found
  478. error: Problems running dot: exit code=127, command='dot', arguments='"/home/david/mgarepo/audaspace/BUILD/audaspace-1.0/build/doc/classLimiterReader__inherit__graph.dot" -Tpng -o "/home/david/mgarepo/audaspace/BUILD/audaspace-1.0/build/doc/classLimiterReader__inherit__graph.png"'
  479. sh: dot: command not found
  480. error: Problems running dot: exit code=127, command='dot', arguments='"/home/david/mgarepo/audaspace/BUILD/audaspace-1.0/build/doc/classJOSResampleReader__inherit__graph.dot" -Tpng -o "/home/david/mgarepo/audaspace/BUILD/audaspace-1.0/build/doc/classJOSResampleReader__inherit__graph.png"'
  481. sh: dot: command not found
  482. error: Problems running dot: exit code=127, command='dot', arguments='"/home/david/mgarepo/audaspace/BUILD/audaspace-1.0/build/doc/classLinearResample__inherit__graph.dot" -Tpng -o "/home/david/mgarepo/audaspace/BUILD/audaspace-1.0/build/doc/classLinearResample__inherit__graph.png"'
  483. sh: dot: command not found
  484. error: Problems running dot: exit code=127, command='dot', arguments='"/home/david/mgarepo/audaspace/BUILD/audaspace-1.0/build/doc/classLoop__inherit__graph.dot" -Tpng -o "/home/david/mgarepo/audaspace/BUILD/audaspace-1.0/build/doc/classLoop__inherit__graph.png"'
  485. sh: dot: command not found
  486. error: Problems running dot: exit code=127, command='dot', arguments='"/home/david/mgarepo/audaspace/BUILD/audaspace-1.0/build/doc/classLinearResampleReader__inherit__graph.dot" -Tpng -o "/home/david/mgarepo/audaspace/BUILD/audaspace-1.0/build/doc/classLinearResampleReader__inherit__graph.png"'
  487. sh: dot: command not found
  488. error: Problems running dot: exit code=127, command='dot', arguments='"/home/david/mgarepo/audaspace/BUILD/audaspace-1.0/build/doc/classLoopReader__inherit__graph.dot" -Tpng -o "/home/david/mgarepo/audaspace/BUILD/audaspace-1.0/build/doc/classLoopReader__inherit__graph.png"'
  489. sh: dot: command not found
  490. error: Problems running dot: exit code=127, command='dot', arguments='"/home/david/mgarepo/audaspace/BUILD/audaspace-1.0/build/doc/classNULLDevice__inherit__graph.dot" -Tpng -o "/home/david/mgarepo/audaspace/BUILD/audaspace-1.0/build/doc/classNULLDevice__inherit__graph.png"'
  491. sh: dot: command not found
  492. error: Problems running dot: exit code=127, command='dot', arguments='"/home/david/mgarepo/audaspace/BUILD/audaspace-1.0/build/doc/classLowpass__inherit__graph.dot" -Tpng -o "/home/david/mgarepo/audaspace/BUILD/audaspace-1.0/build/doc/classLowpass__inherit__graph.png"'
  493. sh: dot: command not found
  494. error: Problems running dot: exit code=127, command='dot', arguments='"/home/david/mgarepo/audaspace/BUILD/audaspace-1.0/build/doc/classLowpassCalculator__inherit__graph.dot" -Tpng -o "/home/david/mgarepo/audaspace/BUILD/audaspace-1.0/build/doc/classLowpassCalculator__inherit__graph.png"'
  495. sh: dot: command not found
  496. error: Problems running dot: exit code=127, command='dot', arguments='"/home/david/mgarepo/audaspace/BUILD/audaspace-1.0/build/doc/classOpenALReader__inherit__graph.dot" -Tpng -o "/home/david/mgarepo/audaspace/BUILD/audaspace-1.0/build/doc/classOpenALReader__inherit__graph.png"'
  497. sh: dot: command not found
  498. error: Problems running dot: exit code=127, command='dot', arguments='"/home/david/mgarepo/audaspace/BUILD/audaspace-1.0/build/doc/classPingPong__inherit__graph.dot" -Tpng -o "/home/david/mgarepo/audaspace/BUILD/audaspace-1.0/build/doc/classPingPong__inherit__graph.png"'
  499. sh: dot: command not found
  500. error: Problems running dot: exit code=127, command='dot', arguments='"/home/david/mgarepo/audaspace/BUILD/audaspace-1.0/build/doc/classOpenALDevice__inherit__graph.dot" -Tpng -o "/home/david/mgarepo/audaspace/BUILD/audaspace-1.0/build/doc/classOpenALDevice__inherit__graph.png"'
  501. sh: dot: command not found
  502. error: Problems running dot: exit code=127, command='dot', arguments='"/home/david/mgarepo/audaspace/BUILD/audaspace-1.0/build/doc/classPitch__inherit__graph.dot" -Tpng -o "/home/david/mgarepo/audaspace/BUILD/audaspace-1.0/build/doc/classPitch__inherit__graph.png"'
  503. sh: dot: command not found
  504. error: Problems running dot: exit code=127, command='dot', arguments='"/home/david/mgarepo/audaspace/BUILD/audaspace-1.0/build/doc/classResampleReader__inherit__graph.dot" -Tpng -o "/home/david/mgarepo/audaspace/BUILD/audaspace-1.0/build/doc/classResampleReader__inherit__graph.png"'
  505. sh: dot: command not found
  506. error: Problems running dot: exit code=127, command='dot', arguments='"/home/david/mgarepo/audaspace/BUILD/audaspace-1.0/build/doc/classReadDevice__inherit__graph.dot" -Tpng -o "/home/david/mgarepo/audaspace/BUILD/audaspace-1.0/build/doc/classReadDevice__inherit__graph.png"'
  507. sh: dot: command not found
  508. error: Problems running dot: exit code=127, command='dot', arguments='"/home/david/mgarepo/audaspace/BUILD/audaspace-1.0/build/doc/classPitchReader__inherit__graph.dot" -Tpng -o "/home/david/mgarepo/audaspace/BUILD/audaspace-1.0/build/doc/classPitchReader__inherit__graph.png"'
  509. sh: dot: command not found
  510. sh: dot: command not found
  511. sh: dot: command not found
  512. error: Problems running dot: exit code=127, command='dot', arguments='"/home/david/mgarepo/audaspace/BUILD/audaspace-1.0/build/doc/classReverseReader__inherit__graph.dot" -Tpng -o "/home/david/mgarepo/audaspace/BUILD/audaspace-1.0/build/doc/classReverseReader__inherit__graph.png"'
  513. error: Problems running dot: exit code=127, command='dot', arguments='"/home/david/mgarepo/audaspace/BUILD/audaspace-1.0/build/doc/classSawtooth__inherit__graph.dot" -Tpng -o "/home/david/mgarepo/audaspace/BUILD/audaspace-1.0/build/doc/classSawtooth__inherit__graph.png"'
  514. sh: dot: command not found
  515. sh: dot: command not found
  516. error: Problems running dot: exit code=127, command='dot', arguments='"/home/david/mgarepo/audaspace/BUILD/audaspace-1.0/build/doc/classReverse__inherit__graph.dot" -Tpng -o "/home/david/mgarepo/audaspace/BUILD/audaspace-1.0/build/doc/classReverse__inherit__graph.png"'
  517. error: Problems running dot: exit code=127, command='dot', arguments='"/home/david/mgarepo/audaspace/BUILD/audaspace-1.0/build/doc/classSDLDevice__inherit__graph.dot" -Tpng -o "/home/david/mgarepo/audaspace/BUILD/audaspace-1.0/build/doc/classSDLDevice__inherit__graph.png"'
  518. error: Problems running dot: exit code=127, command='dot', arguments='"/home/david/mgarepo/audaspace/BUILD/audaspace-1.0/build/doc/classSawtoothReader__inherit__graph.dot" -Tpng -o "/home/david/mgarepo/audaspace/BUILD/audaspace-1.0/build/doc/classSawtoothReader__inherit__graph.png"'
  519. sh: dot: command not found
  520. error: Problems running dot: exit code=127, command='dot', arguments='"/home/david/mgarepo/audaspace/BUILD/audaspace-1.0/build/doc/classSequenceEntry__inherit__graph.dot" -Tpng -o "/home/david/mgarepo/audaspace/BUILD/audaspace-1.0/build/doc/classSequenceEntry__inherit__graph.png"'
  521. sh: dot: command not found
  522. error: Problems running dot: exit code=127, command='dot', arguments='"/home/david/mgarepo/audaspace/BUILD/audaspace-1.0/build/doc/classSequence__inherit__graph.dot" -Tpng -o "/home/david/mgarepo/audaspace/BUILD/audaspace-1.0/build/doc/classSequence__inherit__graph.png"'
  523. sh: dot: command not found
  524. error: Problems running dot: exit code=127, command='dot', arguments='"/home/david/mgarepo/audaspace/BUILD/audaspace-1.0/build/doc/classSilenceReader__inherit__graph.dot" -Tpng -o "/home/david/mgarepo/audaspace/BUILD/audaspace-1.0/build/doc/classSilenceReader__inherit__graph.png"'
  525. sh: dot: command not found
  526. error: Problems running dot: exit code=127, command='dot', arguments='"/home/david/mgarepo/audaspace/BUILD/audaspace-1.0/build/doc/classSequenceData__inherit__graph.dot" -Tpng -o "/home/david/mgarepo/audaspace/BUILD/audaspace-1.0/build/doc/classSequenceData__inherit__graph.png"'
  527. sh: dot: command not found
  528. error: Problems running dot: exit code=127, command='dot', arguments='"/home/david/mgarepo/audaspace/BUILD/audaspace-1.0/build/doc/classSequenceReader__inherit__graph.dot" -Tpng -o "/home/david/mgarepo/audaspace/BUILD/audaspace-1.0/build/doc/classSequenceReader__inherit__graph.png"'
  529. sh: dot: command not found
  530. error: Problems running dot: exit code=127, command='dot', arguments='"/home/david/mgarepo/audaspace/BUILD/audaspace-1.0/build/doc/classSilence__inherit__graph.dot" -Tpng -o "/home/david/mgarepo/audaspace/BUILD/audaspace-1.0/build/doc/classSilence__inherit__graph.png"'
  531. sh: dot: command not found
  532. error: Problems running dot: exit code=127, command='dot', arguments='"/home/david/mgarepo/audaspace/BUILD/audaspace-1.0/build/doc/classSineReader__inherit__graph.dot" -Tpng -o "/home/david/mgarepo/audaspace/BUILD/audaspace-1.0/build/doc/classSineReader__inherit__graph.png"'
  533. sh: dot: command not found
  534. sh: dot: command not found
  535. error: Problems running dot: exit code=127, command='dot', arguments='"/home/david/mgarepo/audaspace/BUILD/audaspace-1.0/build/doc/classSndFileReader__inherit__graph.dot" -Tpng -o "/home/david/mgarepo/audaspace/BUILD/audaspace-1.0/build/doc/classSndFileReader__inherit__graph.png"'
  536. error: Problems running dot: exit code=127, command='dot', arguments='"/home/david/mgarepo/audaspace/BUILD/audaspace-1.0/build/doc/classSine__inherit__graph.dot" -Tpng -o "/home/david/mgarepo/audaspace/BUILD/audaspace-1.0/build/doc/classSine__inherit__graph.png"'
  537. sh: dot: command not found
  538. sh: dot: command not found
  539. error: Problems running dot: exit code=127, command='dot', arguments='"/home/david/mgarepo/audaspace/BUILD/audaspace-1.0/build/doc/classSndFile__inherit__graph.dot" -Tpng -o "/home/david/mgarepo/audaspace/BUILD/audaspace-1.0/build/doc/classSndFile__inherit__graph.png"'
  540. error: Problems running dot: exit code=127, command='dot', arguments='"/home/david/mgarepo/audaspace/BUILD/audaspace-1.0/build/doc/classSndFileWriter__inherit__graph.dot" -Tpng -o "/home/david/mgarepo/audaspace/BUILD/audaspace-1.0/build/doc/classSndFileWriter__inherit__graph.png"'
  541. sh: dot: command not found
  542. error: Problems running dot: exit code=127, command='dot', arguments='"/home/david/mgarepo/audaspace/BUILD/audaspace-1.0/build/doc/classSquare__inherit__graph.dot" -Tpng -o "/home/david/mgarepo/audaspace/BUILD/audaspace-1.0/build/doc/classSquare__inherit__graph.png"'
  543. sh: dot: command not found
  544. error: Problems running dot: exit code=127, command='dot', arguments='"/home/david/mgarepo/audaspace/BUILD/audaspace-1.0/build/doc/classSoftwareDevice__inherit__graph.dot" -Tpng -o "/home/david/mgarepo/audaspace/BUILD/audaspace-1.0/build/doc/classSoftwareDevice__inherit__graph.png"'
  545. sh: dot: command not found
  546. error: Problems running dot: exit code=127, command='dot', arguments='"/home/david/mgarepo/audaspace/BUILD/audaspace-1.0/build/doc/classSpecsChanger__inherit__graph.dot" -Tpng -o "/home/david/mgarepo/audaspace/BUILD/audaspace-1.0/build/doc/classSpecsChanger__inherit__graph.png"'
  547. sh: dot: command not found
  548. error: Problems running dot: exit code=127, command='dot', arguments='"/home/david/mgarepo/audaspace/BUILD/audaspace-1.0/build/doc/classSoftwareDevice_1_1SoftwareHandle__inherit__graph.dot" -Tpng -o "/home/david/mgarepo/audaspace/BUILD/audaspace-1.0/build/doc/classSoftwareDevice_1_1SoftwareHandle__inherit__graph.png"'
  549. sh: dot: command not found
  550. error: Problems running dot: exit code=127, command='dot', arguments='"/home/david/mgarepo/audaspace/BUILD/audaspace-1.0/build/doc/classSuperpose__inherit__graph.dot" -Tpng -o "/home/david/mgarepo/audaspace/BUILD/audaspace-1.0/build/doc/classSuperpose__inherit__graph.png"'
  551. sh: dot: command not found
  552. error: Problems running dot: exit code=127, command='dot', arguments='"/home/david/mgarepo/audaspace/BUILD/audaspace-1.0/build/doc/classStateException__inherit__graph.dot" -Tpng -o "/home/david/mgarepo/audaspace/BUILD/audaspace-1.0/build/doc/classStateException__inherit__graph.png"'
  553. sh: dot: command not found
  554. sh: dot: command not found
  555. error: Problems running dot: exit code=127, command='dot', arguments='"/home/david/mgarepo/audaspace/BUILD/audaspace-1.0/build/doc/classSum__inherit__graph.dot" -Tpng -o "/home/david/mgarepo/audaspace/BUILD/audaspace-1.0/build/doc/classSum__inherit__graph.png"'
  556. sh: dot: command not found
  557. error: Problems running dot: exit code=127, command='dot', arguments='"/home/david/mgarepo/audaspace/BUILD/audaspace-1.0/build/doc/classStreamBuffer__inherit__graph.dot" -Tpng -o "/home/david/mgarepo/audaspace/BUILD/audaspace-1.0/build/doc/classStreamBuffer__inherit__graph.png"'
  558. error: Problems running dot: exit code=127, command='dot', arguments='"/home/david/mgarepo/audaspace/BUILD/audaspace-1.0/build/doc/classSquareReader__inherit__graph.dot" -Tpng -o "/home/david/mgarepo/audaspace/BUILD/audaspace-1.0/build/doc/classSquareReader__inherit__graph.png"'
  559. sh: dot: command not found
  560. error: Problems running dot: exit code=127, command='dot', arguments='"/home/david/mgarepo/audaspace/BUILD/audaspace-1.0/build/doc/classSuperposeReader__inherit__graph.dot" -Tpng -o "/home/david/mgarepo/audaspace/BUILD/audaspace-1.0/build/doc/classSuperposeReader__inherit__graph.png"'
  561. sh: dot: command not found
  562. error: Problems running dot: exit code=127, command='dot', arguments='"/home/david/mgarepo/audaspace/BUILD/audaspace-1.0/build/doc/classThreshold__inherit__graph.dot" -Tpng -o "/home/david/mgarepo/audaspace/BUILD/audaspace-1.0/build/doc/classThreshold__inherit__graph.png"'
  563. sh: dot: command not found
  564. sh: dot: command not found
  565. error: Problems running dot: exit code=127, command='dot', arguments='"/home/david/mgarepo/audaspace/BUILD/audaspace-1.0/build/doc/classTriangleReader__inherit__graph.dot" -Tpng -o "/home/david/mgarepo/audaspace/BUILD/audaspace-1.0/build/doc/classTriangleReader__inherit__graph.png"'
  566. error: Problems running dot: exit code=127, command='dot', arguments='"/home/david/mgarepo/audaspace/BUILD/audaspace-1.0/build/doc/classTriangle__inherit__graph.dot" -Tpng -o "/home/david/mgarepo/audaspace/BUILD/audaspace-1.0/build/doc/classTriangle__inherit__graph.png"'
  567. sh: dot: command not found
  568. error: Problems running dot: exit code=127, command='dot', arguments='"/home/david/mgarepo/audaspace/BUILD/audaspace-1.0/build/doc/classVolume__inherit__graph.dot" -Tpng -o "/home/david/mgarepo/audaspace/BUILD/audaspace-1.0/build/doc/classVolume__inherit__graph.png"'
  569. sh: dot: command not found
  570. error: Problems running dot: exit code=127, command='dot', arguments='"/home/david/mgarepo/audaspace/BUILD/audaspace-1.0/build/doc/dir_4fef79e7177ba769987a8da36c892c5f_dep.dot" -Tpng -o "/home/david/mgarepo/audaspace/BUILD/audaspace-1.0/build/doc/dir_4fef79e7177ba769987a8da36c892c5f_dep.png"'
  571. sh: dot: command not found
  572. error: Problems running dot: exit code=127, command='dot', arguments='"/home/david/mgarepo/audaspace/BUILD/audaspace-1.0/build/doc/dir_0ae5fd04a9b991f2c376fafa197d3147_dep.dot" -Tpng -o "/home/david/mgarepo/audaspace/BUILD/audaspace-1.0/build/doc/dir_0ae5fd04a9b991f2c376fafa197d3147_dep.png"'
  573. sh: dot: command not found
  574. sh: dot: command not found
  575. sh: dot: command not found
  576. error: Problems running dot: exit code=127, command='dot', arguments='"/home/david/mgarepo/audaspace/BUILD/audaspace-1.0/build/doc/dir_f53420cbb3587c1aee7123f1754f1105_dep.dot" -Tpng -o "/home/david/mgarepo/audaspace/BUILD/audaspace-1.0/build/doc/dir_f53420cbb3587c1aee7123f1754f1105_dep.png"'
  577. error: Problems running dot: exit code=127, command='dot', arguments='"/home/david/mgarepo/audaspace/BUILD/audaspace-1.0/build/doc/dir_463be3d517f3a07d432fe36db9434e91_dep.dot" -Tpng -o "/home/david/mgarepo/audaspace/BUILD/audaspace-1.0/build/doc/dir_463be3d517f3a07d432fe36db9434e91_dep.png"'
  578. sh: dot: command not found
  579. error: Problems running dot: exit code=127, command='dot', arguments='"/home/david/mgarepo/audaspace/BUILD/audaspace-1.0/build/doc/dir_49abe4789985cc6a85622e26efb335d2_dep.dot" -Tpng -o "/home/david/mgarepo/audaspace/BUILD/audaspace-1.0/build/doc/dir_49abe4789985cc6a85622e26efb335d2_dep.png"'
  580. sh: dot: command not found
  581. error: Problems running dot: exit code=127, command='dot', arguments='"/home/david/mgarepo/audaspace/BUILD/audaspace-1.0/build/doc/graph_legend.dot" -Tpng -o "/home/david/mgarepo/audaspace/BUILD/audaspace-1.0/build/doc/graph_legend.png"'
  582. error: Problems running dot: exit code=127, command='dot', arguments='"/home/david/mgarepo/audaspace/BUILD/audaspace-1.0/build/doc/dir_30e585b4d0cb3ab23653c9522967a3ec_dep.dot" -Tpng -o "/home/david/mgarepo/audaspace/BUILD/audaspace-1.0/build/doc/dir_30e585b4d0cb3ab23653c9522967a3ec_dep.png"'
  583. sh: dot: command not found
  584. error: Problems running dot: exit code=127, command='dot', arguments='"/home/david/mgarepo/audaspace/BUILD/audaspace-1.0/build/doc/dir_1e60f77674db49603f90ecbfafaa8328_dep.dot" -Tpng -o "/home/david/mgarepo/audaspace/BUILD/audaspace-1.0/build/doc/dir_1e60f77674db49603f90ecbfafaa8328_dep.png"'
  585. sh: dot: command not found
  586. error: Problems running dot: exit code=127, command='dot', arguments='"/home/david/mgarepo/audaspace/BUILD/audaspace-1.0/build/doc/dir_768b9b14c1d73c4aafb6a52b1268efd9_dep.dot" -Tpng -o "/home/david/mgarepo/audaspace/BUILD/audaspace-1.0/build/doc/dir_768b9b14c1d73c4aafb6a52b1268efd9_dep.png"'
  587. sh: dot: command not found
  588. error: Problems running dot: exit code=127, command='dot', arguments='"/home/david/mgarepo/audaspace/BUILD/audaspace-1.0/build/doc/dir_0ebc243ab7eede109b5f049ea619cf3d_dep.dot" -Tpng -o "/home/david/mgarepo/audaspace/BUILD/audaspace-1.0/build/doc/dir_0ebc243ab7eede109b5f049ea619cf3d_dep.png"'
  589. sh: dot: command not found
  590. error: Problems running dot: exit code=127, command='dot', arguments='"/home/david/mgarepo/audaspace/BUILD/audaspace-1.0/build/doc/dir_994ee0afe77535e0243d8facd5f6f306_dep.dot" -Tpng -o "/home/david/mgarepo/audaspace/BUILD/audaspace-1.0/build/doc/dir_994ee0afe77535e0243d8facd5f6f306_dep.png"'
  591. sh: dot: command not found
  592. error: Problems running dot: exit code=127, command='dot', arguments='"/home/david/mgarepo/audaspace/BUILD/audaspace-1.0/build/doc/dir_0062cd10d3f5282b731ea31b26d469c4_dep.dot" -Tpng -o "/home/david/mgarepo/audaspace/BUILD/audaspace-1.0/build/doc/dir_0062cd10d3f5282b731ea31b26d469c4_dep.png"'
  593. sh: dot: command not found
  594. error: Problems running dot: exit code=127, command='dot', arguments='"/home/david/mgarepo/audaspace/BUILD/audaspace-1.0/build/doc/dir_f3f9eec4201a02bb5cab5b60add364d7_dep.dot" -Tpng -o "/home/david/mgarepo/audaspace/BUILD/audaspace-1.0/build/doc/dir_f3f9eec4201a02bb5cab5b60add364d7_dep.png"'
  595. sh: dot: command not found
  596. error: Problems running dot: exit code=127, command='dot', arguments='"/home/david/mgarepo/audaspace/BUILD/audaspace-1.0/build/doc/inherit_graph_0.dot" -Tpng -o "/home/david/mgarepo/audaspace/BUILD/audaspace-1.0/build/doc/inherit_graph_0.png"'
  597. sh: dot: command not found
  598. error: Problems running dot: exit code=127, command='dot', arguments='"/home/david/mgarepo/audaspace/BUILD/audaspace-1.0/build/doc/inherit_graph_1.dot" -Tpng -o "/home/david/mgarepo/audaspace/BUILD/audaspace-1.0/build/doc/inherit_graph_1.png"'
  599. sh: dot: command not found
  600. error: Problems running dot: exit code=127, command='dot', arguments='"/home/david/mgarepo/audaspace/BUILD/audaspace-1.0/build/doc/dir_f765346efce1a3a011bd69b313493e3c_dep.dot" -Tpng -o "/home/david/mgarepo/audaspace/BUILD/audaspace-1.0/build/doc/dir_f765346efce1a3a011bd69b313493e3c_dep.png"'
  601. sh: dot: command not found
  602. error: Problems running dot: exit code=127, command='dot', arguments='"/home/david/mgarepo/audaspace/BUILD/audaspace-1.0/build/doc/inherit_graph_2.dot" -Tpng -o "/home/david/mgarepo/audaspace/BUILD/audaspace-1.0/build/doc/inherit_graph_2.png"'
  603. sh: dot: command not found
  604. error: Problems running dot: exit code=127, command='dot', arguments='"/home/david/mgarepo/audaspace/BUILD/audaspace-1.0/build/doc/dir_586ad3c2f85d776b984733890d824e3e_dep.dot" -Tpng -o "/home/david/mgarepo/audaspace/BUILD/audaspace-1.0/build/doc/dir_586ad3c2f85d776b984733890d824e3e_dep.png"'
  605. sh: dot: command not found
  606. error: Problems running dot: exit code=127, command='dot', arguments='"/home/david/mgarepo/audaspace/BUILD/audaspace-1.0/build/doc/inherit_graph_4.dot" -Tpng -o "/home/david/mgarepo/audaspace/BUILD/audaspace-1.0/build/doc/inherit_graph_4.png"'
  607. sh: dot: command not found
  608. error: Problems running dot: exit code=127, command='dot', arguments='"/home/david/mgarepo/audaspace/BUILD/audaspace-1.0/build/doc/inherit_graph_3.dot" -Tpng -o "/home/david/mgarepo/audaspace/BUILD/audaspace-1.0/build/doc/inherit_graph_3.png"'
  609. sh: dot: command not found
  610. sh: dot: command not found
  611. sh: dot: command not found
  612. error: Problems running dot: exit code=127, command='dot', arguments='"/home/david/mgarepo/audaspace/BUILD/audaspace-1.0/build/doc/inherit_graph_5.dot" -Tpng -o "/home/david/mgarepo/audaspace/BUILD/audaspace-1.0/build/doc/inherit_graph_5.png"'
  613. error: Problems running dot: exit code=127, command='dot', arguments='"/home/david/mgarepo/audaspace/BUILD/audaspace-1.0/build/doc/inherit_graph_8.dot" -Tpng -o "/home/david/mgarepo/audaspace/BUILD/audaspace-1.0/build/doc/inherit_graph_8.png"'
  614. error: Problems running dot: exit code=127, command='dot', arguments='"/home/david/mgarepo/audaspace/BUILD/audaspace-1.0/build/doc/inherit_graph_6.dot" -Tpng -o "/home/david/mgarepo/audaspace/BUILD/audaspace-1.0/build/doc/inherit_graph_6.png"'
  615. sh: dot: command not found
  616. error: Problems running dot: exit code=127, command='dot', arguments='"/home/david/mgarepo/audaspace/BUILD/audaspace-1.0/build/doc/inherit_graph_9.dot" -Tpng -o "/home/david/mgarepo/audaspace/BUILD/audaspace-1.0/build/doc/inherit_graph_9.png"'
  617. sh: dot: command not found
  618. error: Problems running dot: exit code=127, command='dot', arguments='"/home/david/mgarepo/audaspace/BUILD/audaspace-1.0/build/doc/inherit_graph_10.dot" -Tpng -o "/home/david/mgarepo/audaspace/BUILD/audaspace-1.0/build/doc/inherit_graph_10.png"'
  619. sh: dot: command not found
  620. error: Problems running dot: exit code=127, command='dot', arguments='"/home/david/mgarepo/audaspace/BUILD/audaspace-1.0/build/doc/inherit_graph_11.dot" -Tpng -o "/home/david/mgarepo/audaspace/BUILD/audaspace-1.0/build/doc/inherit_graph_11.png"'
  621. sh: dot: command not found
  622. error: Problems running dot: exit code=127, command='dot', arguments='"/home/david/mgarepo/audaspace/BUILD/audaspace-1.0/build/doc/inherit_graph_7.dot" -Tpng -o "/home/david/mgarepo/audaspace/BUILD/audaspace-1.0/build/doc/inherit_graph_7.png"'
  623. sh: dot: command not found
  624. sh: dot: command not found
  625. error: Problems running dot: exit code=127, command='dot', arguments='"/home/david/mgarepo/audaspace/BUILD/audaspace-1.0/build/doc/inherit_graph_14.dot" -Tpng -o "/home/david/mgarepo/audaspace/BUILD/audaspace-1.0/build/doc/inherit_graph_14.png"'
  626. sh: dot: command not found
  627. error: Problems running dot: exit code=127, command='dot', arguments='"/home/david/mgarepo/audaspace/BUILD/audaspace-1.0/build/doc/inherit_graph_12.dot" -Tpng -o "/home/david/mgarepo/audaspace/BUILD/audaspace-1.0/build/doc/inherit_graph_12.png"'
  628. error: Problems running dot: exit code=127, command='dot', arguments='"/home/david/mgarepo/audaspace/BUILD/audaspace-1.0/build/doc/inherit_graph_13.dot" -Tpng -o "/home/david/mgarepo/audaspace/BUILD/audaspace-1.0/build/doc/inherit_graph_13.png"'
  629. sh: dot: command not found
  630. error: Problems running dot: exit code=127, command='dot', arguments='"/home/david/mgarepo/audaspace/BUILD/audaspace-1.0/build/doc/inherit_graph_16.dot" -Tpng -o "/home/david/mgarepo/audaspace/BUILD/audaspace-1.0/build/doc/inherit_graph_16.png"'
  631. sh: dot: command not found
  632. sh: dot: command not found
  633. error: Problems running dot: exit code=127, command='dot', arguments='"/home/david/mgarepo/audaspace/BUILD/audaspace-1.0/build/doc/inherit_graph_17.dot" -Tpng -o "/home/david/mgarepo/audaspace/BUILD/audaspace-1.0/build/doc/inherit_graph_17.png"'
  634. error: Problems running dot: exit code=127, command='dot', arguments='"/home/david/mgarepo/audaspace/BUILD/audaspace-1.0/build/doc/inherit_graph_15.dot" -Tpng -o "/home/david/mgarepo/audaspace/BUILD/audaspace-1.0/build/doc/inherit_graph_15.png"'
  635. sh: dot: command not found
  636. error: Problems running dot: exit code=127, command='dot', arguments='"/home/david/mgarepo/audaspace/BUILD/audaspace-1.0/build/doc/inherit_graph_19.dot" -Tpng -o "/home/david/mgarepo/audaspace/BUILD/audaspace-1.0/build/doc/inherit_graph_19.png"'
  637. sh: dot: command not found
  638. error: Problems running dot: exit code=127, command='dot', arguments='"/home/david/mgarepo/audaspace/BUILD/audaspace-1.0/build/doc/inherit_graph_18.dot" -Tpng -o "/home/david/mgarepo/audaspace/BUILD/audaspace-1.0/build/doc/inherit_graph_18.png"'
  639. error: problems opening map file /home/david/mgarepo/audaspace/BUILD/audaspace-1.0/build/doc/Audaspace_8h__dep__incl.map for inclusion in the docs!
  640. If you installed Graphviz/dot after a previous failing run,
  641. try deleting the output directory and rerun doxygen.
  642. error: problems opening map file /home/david/mgarepo/audaspace/BUILD/audaspace-1.0/build/doc/DefaultSynchronizer_8h__incl.map for inclusion in the docs!
  643. If you installed Graphviz/dot after a previous failing run,
  644. try deleting the output directory and rerun doxygen.
  645. error: problems opening map file /home/david/mgarepo/audaspace/BUILD/audaspace-1.0/build/doc/DefaultSynchronizer_8h__dep__incl.map for inclusion in the docs!
  646. If you installed Graphviz/dot after a previous failing run,
  647. try deleting the output directory and rerun doxygen.
  648. error: problems opening map file /home/david/mgarepo/audaspace/BUILD/audaspace-1.0/build/doc/DeviceManager_8h__incl.map for inclusion in the docs!
  649. If you installed Graphviz/dot after a previous failing run,
  650. try deleting the output directory and rerun doxygen.
  651. error: problems opening map file /home/david/mgarepo/audaspace/BUILD/audaspace-1.0/build/doc/I3DDevice_8h__incl.map for inclusion in the docs!
  652. If you installed Graphviz/dot after a previous failing run,
  653. try deleting the output directory and rerun doxygen.
  654. error: problems opening map file /home/david/mgarepo/audaspace/BUILD/audaspace-1.0/build/doc/I3DDevice_8h__dep__incl.map for inclusion in the docs!
  655. If you installed Graphviz/dot after a previous failing run,
  656. try deleting the output directory and rerun doxygen.
  657. error: problems opening map file /home/david/mgarepo/audaspace/BUILD/audaspace-1.0/build/doc/I3DHandle_8h__incl.map for inclusion in the docs!
  658. If you installed Graphviz/dot after a previous failing run,
  659. try deleting the output directory and rerun doxygen.
  660. error: problems opening map file /home/david/mgarepo/audaspace/BUILD/audaspace-1.0/build/doc/I3DHandle_8h__dep__incl.map for inclusion in the docs!
  661. If you installed Graphviz/dot after a previous failing run,
  662. try deleting the output directory and rerun doxygen.
  663. error: problems opening map file /home/david/mgarepo/audaspace/BUILD/audaspace-1.0/build/doc/IDevice_8h__incl.map for inclusion in the docs!
  664. If you installed Graphviz/dot after a previous failing run,
  665. try deleting the output directory and rerun doxygen.
  666. error: problems opening map file /home/david/mgarepo/audaspace/BUILD/audaspace-1.0/build/doc/IDevice_8h__dep__incl.map for inclusion in the docs!
  667. If you installed Graphviz/dot after a previous failing run,
  668. try deleting the output directory and rerun doxygen.
  669. error: problems opening map file /home/david/mgarepo/audaspace/BUILD/audaspace-1.0/build/doc/IDeviceFactory_8h__incl.map for inclusion in the docs!
  670. If you installed Graphviz/dot after a previous failing run,
  671. try deleting the output directory and rerun doxygen.
  672. error: problems opening map file /home/david/mgarepo/audaspace/BUILD/audaspace-1.0/build/doc/IHandle_8h__incl.map for inclusion in the docs!
  673. If you installed Graphviz/dot after a previous failing run,
  674. try deleting the output directory and rerun doxygen.
  675. error: problems opening map file /home/david/mgarepo/audaspace/BUILD/audaspace-1.0/build/doc/IHandle_8h__dep__incl.map for inclusion in the docs!
  676. If you installed Graphviz/dot after a previous failing run,
  677. try deleting the output directory and rerun doxygen.
  678. error: problems opening map file /home/david/mgarepo/audaspace/BUILD/audaspace-1.0/build/doc/ISynchronizer_8h__incl.map for inclusion in the docs!
  679. If you installed Graphviz/dot after a previous failing run,
  680. try deleting the output directory and rerun doxygen.
  681. error: problems opening map file /home/david/mgarepo/audaspace/BUILD/audaspace-1.0/build/doc/ISynchronizer_8h__dep__incl.map for inclusion in the docs!
  682. If you installed Graphviz/dot after a previous failing run,
  683. try deleting the output directory and rerun doxygen.
  684. error: problems opening map file /home/david/mgarepo/audaspace/BUILD/audaspace-1.0/build/doc/NULLDevice_8h__incl.map for inclusion in the docs!
  685. If you installed Graphviz/dot after a previous failing run,
  686. try deleting the output directory and rerun doxygen.
  687. error: problems opening map file /home/david/mgarepo/audaspace/BUILD/audaspace-1.0/build/doc/ReadDevice_8h__incl.map for inclusion in the docs!
  688. If you installed Graphviz/dot after a previous failing run,
  689. try deleting the output directory and rerun doxygen.
  690. error: problems opening map file /home/david/mgarepo/audaspace/BUILD/audaspace-1.0/build/doc/ReadDevice_8h__dep__incl.map for inclusion in the docs!
  691. If you installed Graphviz/dot after a previous failing run,
  692. try deleting the output directory and rerun doxygen.
  693. error: problems opening map file /home/david/mgarepo/audaspace/BUILD/audaspace-1.0/build/doc/SoftwareDevice_8h__incl.map for inclusion in the docs!
  694. If you installed Graphviz/dot after a previous failing run,
  695. try deleting the output directory and rerun doxygen.
  696. error: problems opening map file /home/david/mgarepo/audaspace/BUILD/audaspace-1.0/build/doc/SoftwareDevice_8h__dep__incl.map for inclusion in the docs!
  697. If you installed Graphviz/dot after a previous failing run,
  698. try deleting the output directory and rerun doxygen.
  699. error: problems opening map file /home/david/mgarepo/audaspace/BUILD/audaspace-1.0/build/doc/Exception_8h__incl.map for inclusion in the docs!
  700. If you installed Graphviz/dot after a previous failing run,
  701. try deleting the output directory and rerun doxygen.
  702. error: problems opening map file /home/david/mgarepo/audaspace/BUILD/audaspace-1.0/build/doc/File_8h__incl.map for inclusion in the docs!
  703. If you installed Graphviz/dot after a previous failing run,
  704. try deleting the output directory and rerun doxygen.
  705. error: problems opening map file /home/david/mgarepo/audaspace/BUILD/audaspace-1.0/build/doc/FileManager_8h__incl.map for inclusion in the docs!
  706. If you installed Graphviz/dot after a previous failing run,
  707. try deleting the output directory and rerun doxygen.
  708. error: problems opening map file /home/david/mgarepo/audaspace/BUILD/audaspace-1.0/build/doc/FileWriter_8h__incl.map for inclusion in the docs!
  709. If you installed Graphviz/dot after a previous failing run,
  710. try deleting the output directory and rerun doxygen.
  711. error: problems opening map file /home/david/mgarepo/audaspace/BUILD/audaspace-1.0/build/doc/IFileInput_8h__incl.map for inclusion in the docs!
  712. If you installed Graphviz/dot after a previous failing run,
  713. try deleting the output directory and rerun doxygen.
  714. error: problems opening map file /home/david/mgarepo/audaspace/BUILD/audaspace-1.0/build/doc/IFileInput_8h__dep__incl.map for inclusion in the docs!
  715. If you installed Graphviz/dot after a previous failing run,
  716. try deleting the output directory and rerun doxygen.
  717. error: problems opening map file /home/david/mgarepo/audaspace/BUILD/audaspace-1.0/build/doc/IFileOutput_8h__incl.map for inclusion in the docs!
  718. If you installed Graphviz/dot after a previous failing run,
  719. try deleting the output directory and rerun doxygen.
  720. error: problems opening map file /home/david/mgarepo/audaspace/BUILD/audaspace-1.0/build/doc/IFileOutput_8h__dep__incl.map for inclusion in the docs!
  721. If you installed Graphviz/dot after a previous failing run,
  722. try deleting the output directory and rerun doxygen.
  723. error: problems opening map file /home/david/mgarepo/audaspace/BUILD/audaspace-1.0/build/doc/IWriter_8h__incl.map for inclusion in the docs!
  724. If you installed Graphviz/dot after a previous failing run,
  725. try deleting the output directory and rerun doxygen.
  726. error: problems opening map file /home/david/mgarepo/audaspace/BUILD/audaspace-1.0/build/doc/IWriter_8h__dep__incl.map for inclusion in the docs!
  727. If you installed Graphviz/dot after a previous failing run,
  728. try deleting the output directory and rerun doxygen.
  729. error: problems opening map file /home/david/mgarepo/audaspace/BUILD/audaspace-1.0/build/doc/Accumulator_8h__incl.map for inclusion in the docs!
  730. If you installed Graphviz/dot after a previous failing run,
  731. try deleting the output directory and rerun doxygen.
  732. error: problems opening map file /home/david/mgarepo/audaspace/BUILD/audaspace-1.0/build/doc/ADSR_8h__incl.map for inclusion in the docs!
  733. If you installed Graphviz/dot after a previous failing run,
  734. try deleting the output directory and rerun doxygen.
  735. error: problems opening map file /home/david/mgarepo/audaspace/BUILD/audaspace-1.0/build/doc/ADSRReader_8h__incl.map for inclusion in the docs!
  736. If you installed Graphviz/dot after a previous failing run,
  737. try deleting the output directory and rerun doxygen.
  738. error: problems opening map file /home/david/mgarepo/audaspace/BUILD/audaspace-1.0/build/doc/BaseIIRFilterReader_8h__incl.map for inclusion in the docs!
  739. If you installed Graphviz/dot after a previous failing run,
  740. try deleting the output directory and rerun doxygen.
  741. error: problems opening map file /home/david/mgarepo/audaspace/BUILD/audaspace-1.0/build/doc/BaseIIRFilterReader_8h__dep__incl.map for inclusion in the docs!
  742. If you installed Graphviz/dot after a previous failing run,
  743. try deleting the output directory and rerun doxygen.
  744. error: problems opening map file /home/david/mgarepo/audaspace/BUILD/audaspace-1.0/build/doc/Butterworth_8h__incl.map for inclusion in the docs!
  745. If you installed Graphviz/dot after a previous failing run,
  746. try deleting the output directory and rerun doxygen.
  747. error: problems opening map file /home/david/mgarepo/audaspace/BUILD/audaspace-1.0/build/doc/ButterworthCalculator_8h__incl.map for inclusion in the docs!
  748. If you installed Graphviz/dot after a previous failing run,
  749. try deleting the output directory and rerun doxygen.
  750. error: problems opening map file /home/david/mgarepo/audaspace/BUILD/audaspace-1.0/build/doc/CallbackIIRFilterReader_8h__incl.map for inclusion in the docs!
  751. If you installed Graphviz/dot after a previous failing run,
  752. try deleting the output directory and rerun doxygen.
  753. error: problems opening map file /home/david/mgarepo/audaspace/BUILD/audaspace-1.0/build/doc/Delay_8h__incl.map for inclusion in the docs!
  754. If you installed Graphviz/dot after a previous failing run,
  755. try deleting the output directory and rerun doxygen.
  756. error: problems opening map file /home/david/mgarepo/audaspace/BUILD/audaspace-1.0/build/doc/DelayReader_8h__incl.map for inclusion in the docs!
  757. If you installed Graphviz/dot after a previous failing run,
  758. try deleting the output directory and rerun doxygen.
  759. error: problems opening map file /home/david/mgarepo/audaspace/BUILD/audaspace-1.0/build/doc/DynamicIIRFilter_8h__incl.map for inclusion in the docs!
  760. If you installed Graphviz/dot after a previous failing run,
  761. try deleting the output directory and rerun doxygen.
  762. error: problems opening map file /home/david/mgarepo/audaspace/BUILD/audaspace-1.0/build/doc/DynamicIIRFilter_8h__dep__incl.map for inclusion in the docs!
  763. If you installed Graphviz/dot after a previous failing run,
  764. try deleting the output directory and rerun doxygen.
  765. error: problems opening map file /home/david/mgarepo/audaspace/BUILD/audaspace-1.0/build/doc/DynamicIIRFilterReader_8h__incl.map for inclusion in the docs!
  766. If you installed Graphviz/dot after a previous failing run,
  767. try deleting the output directory and rerun doxygen.
  768. error: problems opening map file /home/david/mgarepo/audaspace/BUILD/audaspace-1.0/build/doc/Effect_8h__incl.map for inclusion in the docs!
  769. If you installed Graphviz/dot after a previous failing run,
  770. try deleting the output directory and rerun doxygen.
  771. error: problems opening map file /home/david/mgarepo/audaspace/BUILD/audaspace-1.0/build/doc/Effect_8h__dep__incl.map for inclusion in the docs!
  772. If you installed Graphviz/dot after a previous failing run,
  773. try deleting the output directory and rerun doxygen.
  774. error: problems opening map file /home/david/mgarepo/audaspace/BUILD/audaspace-1.0/build/doc/EffectReader_8h__incl.map for inclusion in the docs!
  775. If you installed Graphviz/dot after a previous failing run,
  776. try deleting the output directory and rerun doxygen.
  777. error: problems opening map file /home/david/mgarepo/audaspace/BUILD/audaspace-1.0/build/doc/EffectReader_8h__dep__incl.map for inclusion in the docs!
  778. If you installed Graphviz/dot after a previous failing run,
  779. try deleting the output directory and rerun doxygen.
  780. error: problems opening map file /home/david/mgarepo/audaspace/BUILD/audaspace-1.0/build/doc/Envelope_8h__incl.map for inclusion in the docs!
  781. If you installed Graphviz/dot after a previous failing run,
  782. try deleting the output directory and rerun doxygen.
  783. error: problems opening map file /home/david/mgarepo/audaspace/BUILD/audaspace-1.0/build/doc/Fader_8h__incl.map for inclusion in the docs!
  784. If you installed Graphviz/dot after a previous failing run,
  785. try deleting the output directory and rerun doxygen.
  786. error: problems opening map file /home/david/mgarepo/audaspace/BUILD/audaspace-1.0/build/doc/FaderReader_8h__incl.map for inclusion in the docs!
  787. If you installed Graphviz/dot after a previous failing run,
  788. try deleting the output directory and rerun doxygen.
  789. error: problems opening map file /home/david/mgarepo/audaspace/BUILD/audaspace-1.0/build/doc/FaderReader_8h__dep__incl.map for inclusion in the docs!
  790. If you installed Graphviz/dot after a previous failing run,
  791. try deleting the output directory and rerun doxygen.
  792. error: problems opening map file /home/david/mgarepo/audaspace/BUILD/audaspace-1.0/build/doc/Highpass_8h__incl.map for inclusion in the docs!
  793. If you installed Graphviz/dot after a previous failing run,
  794. try deleting the output directory and rerun doxygen.
  795. error: problems opening map file /home/david/mgarepo/audaspace/BUILD/audaspace-1.0/build/doc/HighpassCalculator_8h__incl.map for inclusion in the docs!
  796. If you installed Graphviz/dot after a previous failing run,
  797. try deleting the output directory and rerun doxygen.
  798. error: problems opening map file /home/david/mgarepo/audaspace/BUILD/audaspace-1.0/build/doc/IDynamicIIRFilterCalculator_8h__incl.map for inclusion in the docs!
  799. If you installed Graphviz/dot after a previous failing run,
  800. try deleting the output directory and rerun doxygen.
  801. error: problems opening map file /home/david/mgarepo/audaspace/BUILD/audaspace-1.0/build/doc/IDynamicIIRFilterCalculator_8h__dep__incl.map for inclusion in the docs!
  802. If you installed Graphviz/dot after a previous failing run,
  803. try deleting the output directory and rerun doxygen.
  804. error: problems opening map file /home/david/mgarepo/audaspace/BUILD/audaspace-1.0/build/doc/IIRFilter_8h__incl.map for inclusion in the docs!
  805. If you installed Graphviz/dot after a previous failing run,
  806. try deleting the output directory and rerun doxygen.
  807. error: problems opening map file /home/david/mgarepo/audaspace/BUILD/audaspace-1.0/build/doc/IIRFilterReader_8h__incl.map for inclusion in the docs!
  808. If you installed Graphviz/dot after a previous failing run,
  809. try deleting the output directory and rerun doxygen.
  810. error: problems opening map file /home/david/mgarepo/audaspace/BUILD/audaspace-1.0/build/doc/IIRFilterReader_8h__dep__incl.map for inclusion in the docs!
  811. If you installed Graphviz/dot after a previous failing run,
  812. try deleting the output directory and rerun doxygen.
  813. error: problems opening map file /home/david/mgarepo/audaspace/BUILD/audaspace-1.0/build/doc/Limiter_8h__incl.map for inclusion in the docs!
  814. If you installed Graphviz/dot after a previous failing run,
  815. try deleting the output directory and rerun doxygen.
  816. error: problems opening map file /home/david/mgarepo/audaspace/BUILD/audaspace-1.0/build/doc/LimiterReader_8h__incl.map for inclusion in the docs!
  817. If you installed Graphviz/dot after a previous failing run,
  818. try deleting the output directory and rerun doxygen.
  819. error: problems opening map file /home/david/mgarepo/audaspace/BUILD/audaspace-1.0/build/doc/Loop_8h__incl.map for inclusion in the docs!
  820. If you installed Graphviz/dot after a previous failing run,
  821. try deleting the output directory and rerun doxygen.
  822. error: problems opening map file /home/david/mgarepo/audaspace/BUILD/audaspace-1.0/build/doc/LoopReader_8h__incl.map for inclusion in the docs!
  823. If you installed Graphviz/dot after a previous failing run,
  824. try deleting the output directory and rerun doxygen.
  825. error: problems opening map file /home/david/mgarepo/audaspace/BUILD/audaspace-1.0/build/doc/Lowpass_8h__incl.map for inclusion in the docs!
  826. If you installed Graphviz/dot after a previous failing run,
  827. try deleting the output directory and rerun doxygen.
  828. error: problems opening map file /home/david/mgarepo/audaspace/BUILD/audaspace-1.0/build/doc/LowpassCalculator_8h__incl.map for inclusion in the docs!
  829. If you installed Graphviz/dot after a previous failing run,
  830. try deleting the output directory and rerun doxygen.
  831. error: problems opening map file /home/david/mgarepo/audaspace/BUILD/audaspace-1.0/build/doc/Pitch_8h__incl.map for inclusion in the docs!
  832. If you installed Graphviz/dot after a previous failing run,
  833. try deleting the output directory and rerun doxygen.
  834. error: problems opening map file /home/david/mgarepo/audaspace/BUILD/audaspace-1.0/build/doc/PitchReader_8h__incl.map for inclusion in the docs!
  835. If you installed Graphviz/dot after a previous failing run,
  836. try deleting the output directory and rerun doxygen.
  837. error: problems opening map file /home/david/mgarepo/audaspace/BUILD/audaspace-1.0/build/doc/Reverse_8h__incl.map for inclusion in the docs!
  838. If you installed Graphviz/dot after a previous failing run,
  839. try deleting the output directory and rerun doxygen.
  840. error: problems opening map file /home/david/mgarepo/audaspace/BUILD/audaspace-1.0/build/doc/ReverseReader_8h__incl.map for inclusion in the docs!
  841. If you installed Graphviz/dot after a previous failing run,
  842. try deleting the output directory and rerun doxygen.
  843. error: problems opening map file /home/david/mgarepo/audaspace/BUILD/audaspace-1.0/build/doc/Sum_8h__incl.map for inclusion in the docs!
  844. If you installed Graphviz/dot after a previous failing run,
  845. try deleting the output directory and rerun doxygen.
  846. error: problems opening map file /home/david/mgarepo/audaspace/BUILD/audaspace-1.0/build/doc/Threshold_8h__incl.map for inclusion in the docs!
  847. If you installed Graphviz/dot after a previous failing run,
  848. try deleting the output directory and rerun doxygen.
  849. error: problems opening map file /home/david/mgarepo/audaspace/BUILD/audaspace-1.0/build/doc/Volume_8h__incl.map for inclusion in the docs!
  850. If you installed Graphviz/dot after a previous failing run,
  851. try deleting the output directory and rerun doxygen.
  852. error: problems opening map file /home/david/mgarepo/audaspace/BUILD/audaspace-1.0/build/doc/Sawtooth_8h__incl.map for inclusion in the docs!
  853. If you installed Graphviz/dot after a previous failing run,
  854. try deleting the output directory and rerun doxygen.
  855. error: problems opening map file /home/david/mgarepo/audaspace/BUILD/audaspace-1.0/build/doc/SawtoothReader_8h__incl.map for inclusion in the docs!
  856. If you installed Graphviz/dot after a previous failing run,
  857. try deleting the output directory and rerun doxygen.
  858. error: problems opening map file /home/david/mgarepo/audaspace/BUILD/audaspace-1.0/build/doc/Silence_8h__incl.map for inclusion in the docs!
  859. If you installed Graphviz/dot after a previous failing run,
  860. try deleting the output directory and rerun doxygen.
  861. error: problems opening map file /home/david/mgarepo/audaspace/BUILD/audaspace-1.0/build/doc/SilenceReader_8h__incl.map for inclusion in the docs!
  862. If you installed Graphviz/dot after a previous failing run,
  863. try deleting the output directory and rerun doxygen.
  864. error: problems opening map file /home/david/mgarepo/audaspace/BUILD/audaspace-1.0/build/doc/Sine_8h__incl.map for inclusion in the docs!
  865. If you installed Graphviz/dot after a previous failing run,
  866. try deleting the output directory and rerun doxygen.
  867. error: problems opening map file /home/david/mgarepo/audaspace/BUILD/audaspace-1.0/build/doc/SineReader_8h__incl.map for inclusion in the docs!
  868. If you installed Graphviz/dot after a previous failing run,
  869. try deleting the output directory and rerun doxygen.
  870. error: problems opening map file /home/david/mgarepo/audaspace/BUILD/audaspace-1.0/build/doc/Square_8h__incl.map for inclusion in the docs!
  871. If you installed Graphviz/dot after a previous failing run,
  872. try deleting the output directory and rerun doxygen.
  873. error: problems opening map file /home/david/mgarepo/audaspace/BUILD/audaspace-1.0/build/doc/SquareReader_8h__incl.map for inclusion in the docs!
  874. If you installed Graphviz/dot after a previous failing run,
  875. try deleting the output directory and rerun doxygen.
  876. error: problems opening map file /home/david/mgarepo/audaspace/BUILD/audaspace-1.0/build/doc/Triangle_8h__incl.map for inclusion in the docs!
  877. If you installed Graphviz/dot after a previous failing run,
  878. try deleting the output directory and rerun doxygen.
  879. error: problems opening map file /home/david/mgarepo/audaspace/BUILD/audaspace-1.0/build/doc/TriangleReader_8h__incl.map for inclusion in the docs!
  880. If you installed Graphviz/dot after a previous failing run,
  881. try deleting the output directory and rerun doxygen.
  882. error: problems opening map file /home/david/mgarepo/audaspace/BUILD/audaspace-1.0/build/doc/IReader_8h__incl.map for inclusion in the docs!
  883. If you installed Graphviz/dot after a previous failing run,
  884. try deleting the output directory and rerun doxygen.
  885. error: problems opening map file /home/david/mgarepo/audaspace/BUILD/audaspace-1.0/build/doc/IReader_8h__dep__incl.map for inclusion in the docs!
  886. If you installed Graphviz/dot after a previous failing run,
  887. try deleting the output directory and rerun doxygen.
  888. error: problems opening map file /home/david/mgarepo/audaspace/BUILD/audaspace-1.0/build/doc/ISound_8h__incl.map for inclusion in the docs!
  889. If you installed Graphviz/dot after a previous failing run,
  890. try deleting the output directory and rerun doxygen.
  891. error: problems opening map file /home/david/mgarepo/audaspace/BUILD/audaspace-1.0/build/doc/ISound_8h__dep__incl.map for inclusion in the docs!
  892. If you installed Graphviz/dot after a previous failing run,
  893. try deleting the output directory and rerun doxygen.
  894. error: problems opening map file /home/david/mgarepo/audaspace/BUILD/audaspace-1.0/build/doc/PluginManager_8h__incl.map for inclusion in the docs!
  895. If you installed Graphviz/dot after a previous failing run,
  896. try deleting the output directory and rerun doxygen.
  897. error: problems opening map file /home/david/mgarepo/audaspace/BUILD/audaspace-1.0/build/doc/ChannelMapper_8h__incl.map for inclusion in the docs!
  898. If you installed Graphviz/dot after a previous failing run,
  899. try deleting the output directory and rerun doxygen.
  900. error: problems opening map file /home/david/mgarepo/audaspace/BUILD/audaspace-1.0/build/doc/ChannelMapperReader_8h__incl.map for inclusion in the docs!
  901. If you installed Graphviz/dot after a previous failing run,
  902. try deleting the output directory and rerun doxygen.
  903. error: problems opening map file /home/david/mgarepo/audaspace/BUILD/audaspace-1.0/build/doc/Converter_8h__incl.map for inclusion in the docs!
  904. If you installed Graphviz/dot after a previous failing run,
  905. try deleting the output directory and rerun doxygen.
  906. error: problems opening map file /home/david/mgarepo/audaspace/BUILD/audaspace-1.0/build/doc/ConverterFunctions_8h__incl.map for inclusion in the docs!
  907. If you installed Graphviz/dot after a previous failing run,
  908. try deleting the output directory and rerun doxygen.
  909. error: problems opening map file /home/david/mgarepo/audaspace/BUILD/audaspace-1.0/build/doc/ConverterFunctions_8h__dep__incl.map for inclusion in the docs!
  910. If you installed Graphviz/dot after a previous failing run,
  911. try deleting the output directory and rerun doxygen.
  912. error: problems opening map file /home/david/mgarepo/audaspace/BUILD/audaspace-1.0/build/doc/ConverterReader_8h__incl.map for inclusion in the docs!
  913. If you installed Graphviz/dot after a previous failing run,
  914. try deleting the output directory and rerun doxygen.
  915. error: problems opening map file /home/david/mgarepo/audaspace/BUILD/audaspace-1.0/build/doc/JOSResample_8h__incl.map for inclusion in the docs!
  916. If you installed Graphviz/dot after a previous failing run,
  917. try deleting the output directory and rerun doxygen.
  918. error: problems opening map file /home/david/mgarepo/audaspace/BUILD/audaspace-1.0/build/doc/JOSResampleReader_8h__incl.map for inclusion in the docs!
  919. If you installed Graphviz/dot after a previous failing run,
  920. try deleting the output directory and rerun doxygen.
  921. error: problems opening map file /home/david/mgarepo/audaspace/BUILD/audaspace-1.0/build/doc/LinearResample_8h__incl.map for inclusion in the docs!
  922. If you installed Graphviz/dot after a previous failing run,
  923. try deleting the output directory and rerun doxygen.
  924. error: problems opening map file /home/david/mgarepo/audaspace/BUILD/audaspace-1.0/build/doc/LinearResampleReader_8h__incl.map for inclusion in the docs!
  925. If you installed Graphviz/dot after a previous failing run,
  926. try deleting the output directory and rerun doxygen.
  927. error: problems opening map file /home/david/mgarepo/audaspace/BUILD/audaspace-1.0/build/doc/Mixer_8h__incl.map for inclusion in the docs!
  928. If you installed Graphviz/dot after a previous failing run,
  929. try deleting the output directory and rerun doxygen.
  930. error: problems opening map file /home/david/mgarepo/audaspace/BUILD/audaspace-1.0/build/doc/ResampleReader_8h__incl.map for inclusion in the docs!
  931. If you installed Graphviz/dot after a previous failing run,
  932. try deleting the output directory and rerun doxygen.
  933. error: problems opening map file /home/david/mgarepo/audaspace/BUILD/audaspace-1.0/build/doc/ResampleReader_8h__dep__incl.map for inclusion in the docs!
  934. If you installed Graphviz/dot after a previous failing run,
  935. try deleting the output directory and rerun doxygen.
  936. error: problems opening map file /home/david/mgarepo/audaspace/BUILD/audaspace-1.0/build/doc/Specification_8h__incl.map for inclusion in the docs!
  937. If you installed Graphviz/dot after a previous failing run,
  938. try deleting the output directory and rerun doxygen.
  939. error: problems opening map file /home/david/mgarepo/audaspace/BUILD/audaspace-1.0/build/doc/Specification_8h__dep__incl.map for inclusion in the docs!
  940. If you installed Graphviz/dot after a previous failing run,
  941. try deleting the output directory and rerun doxygen.
  942. error: problems opening map file /home/david/mgarepo/audaspace/BUILD/audaspace-1.0/build/doc/SpecsChanger_8h__incl.map for inclusion in the docs!
  943. If you installed Graphviz/dot after a previous failing run,
  944. try deleting the output directory and rerun doxygen.
  945. error: problems opening map file /home/david/mgarepo/audaspace/BUILD/audaspace-1.0/build/doc/SpecsChanger_8h__dep__incl.map for inclusion in the docs!
  946. If you installed Graphviz/dot after a previous failing run,
  947. try deleting the output directory and rerun doxygen.
  948. error: problems opening map file /home/david/mgarepo/audaspace/BUILD/audaspace-1.0/build/doc/AnimateableProperty_8h__incl.map for inclusion in the docs!
  949. If you installed Graphviz/dot after a previous failing run,
  950. try deleting the output directory and rerun doxygen.
  951. error: problems opening map file /home/david/mgarepo/audaspace/BUILD/audaspace-1.0/build/doc/AnimateableProperty_8h__dep__incl.map for inclusion in the docs!
  952. If you installed Graphviz/dot after a previous failing run,
  953. try deleting the output directory and rerun doxygen.
  954. error: problems opening map file /home/david/mgarepo/audaspace/BUILD/audaspace-1.0/build/doc/Double_8h__incl.map for inclusion in the docs!
  955. If you installed Graphviz/dot after a previous failing run,
  956. try deleting the output directory and rerun doxygen.
  957. error: problems opening map file /home/david/mgarepo/audaspace/BUILD/audaspace-1.0/build/doc/DoubleReader_8h__incl.map for inclusion in the docs!
  958. If you installed Graphviz/dot after a previous failing run,
  959. try deleting the output directory and rerun doxygen.
  960. error: problems opening map file /home/david/mgarepo/audaspace/BUILD/audaspace-1.0/build/doc/PingPong_8h__incl.map for inclusion in the docs!
  961. If you installed Graphviz/dot after a previous failing run,
  962. try deleting the output directory and rerun doxygen.
  963. error: problems opening map file /home/david/mgarepo/audaspace/BUILD/audaspace-1.0/build/doc/Sequence_8h__incl.map for inclusion in the docs!
  964. If you installed Graphviz/dot after a previous failing run,
  965. try deleting the output directory and rerun doxygen.
  966. error: problems opening map file /home/david/mgarepo/audaspace/BUILD/audaspace-1.0/build/doc/SequenceData_8h__incl.map for inclusion in the docs!
  967. If you installed Graphviz/dot after a previous failing run,
  968. try deleting the output directory and rerun doxygen.
  969. error: problems opening map file /home/david/mgarepo/audaspace/BUILD/audaspace-1.0/build/doc/SequenceEntry_8h__incl.map for inclusion in the docs!
  970. If you installed Graphviz/dot after a previous failing run,
  971. try deleting the output directory and rerun doxygen.
  972. error: problems opening map file /home/david/mgarepo/audaspace/BUILD/audaspace-1.0/build/doc/SequenceReader_8h__incl.map for inclusion in the docs!
  973. If you installed Graphviz/dot after a previous failing run,
  974. try deleting the output directory and rerun doxygen.
  975. error: problems opening map file /home/david/mgarepo/audaspace/BUILD/audaspace-1.0/build/doc/Superpose_8h__incl.map for inclusion in the docs!
  976. If you installed Graphviz/dot after a previous failing run,
  977. try deleting the output directory and rerun doxygen.
  978. error: problems opening map file /home/david/mgarepo/audaspace/BUILD/audaspace-1.0/build/doc/SuperposeReader_8h__incl.map for inclusion in the docs!
  979. If you installed Graphviz/dot after a previous failing run,
  980. try deleting the output directory and rerun doxygen.
  981. error: problems opening map file /home/david/mgarepo/audaspace/BUILD/audaspace-1.0/build/doc/Buffer_8h__incl.map for inclusion in the docs!
  982. If you installed Graphviz/dot after a previous failing run,
  983. try deleting the output directory and rerun doxygen.
  984. error: problems opening map file /home/david/mgarepo/audaspace/BUILD/audaspace-1.0/build/doc/Buffer_8h__dep__incl.map for inclusion in the docs!
  985. If you installed Graphviz/dot after a previous failing run,
  986. try deleting the output directory and rerun doxygen.
  987. error: problems opening map file /home/david/mgarepo/audaspace/BUILD/audaspace-1.0/build/doc/BufferReader_8h__incl.map for inclusion in the docs!
  988. If you installed Graphviz/dot after a previous failing run,
  989. try deleting the output directory and rerun doxygen.
  990. error: problems opening map file /home/david/mgarepo/audaspace/BUILD/audaspace-1.0/build/doc/ILockable_8h__incl.map for inclusion in the docs!
  991. If you installed Graphviz/dot after a previous failing run,
  992. try deleting the output directory and rerun doxygen.
  993. error: problems opening map file /home/david/mgarepo/audaspace/BUILD/audaspace-1.0/build/doc/ILockable_8h__dep__incl.map for inclusion in the docs!
  994. If you installed Graphviz/dot after a previous failing run,
  995. try deleting the output directory and rerun doxygen.
  996. error: problems opening map file /home/david/mgarepo/audaspace/BUILD/audaspace-1.0/build/doc/Math3D_8h__incl.map for inclusion in the docs!
  997. If you installed Graphviz/dot after a previous failing run,
  998. try deleting the output directory and rerun doxygen.
  999. error: problems opening map file /home/david/mgarepo/audaspace/BUILD/audaspace-1.0/build/doc/Math3D_8h__dep__incl.map for inclusion in the docs!
  1000. If you installed Graphviz/dot after a previous failing run,
  1001. try deleting the output directory and rerun doxygen.
  1002. error: problems opening map file /home/david/mgarepo/audaspace/BUILD/audaspace-1.0/build/doc/StreamBuffer_8h__incl.map for inclusion in the docs!
  1003. If you installed Graphviz/dot after a previous failing run,
  1004. try deleting the output directory and rerun doxygen.
  1005. error: problems opening map file /home/david/mgarepo/audaspace/BUILD/audaspace-1.0/build/doc/FFMPEG_8h__incl.map for inclusion in the docs!
  1006. If you installed Graphviz/dot after a previous failing run,
  1007. try deleting the output directory and rerun doxygen.
  1008. error: problems opening map file /home/david/mgarepo/audaspace/BUILD/audaspace-1.0/build/doc/FFMPEGReader_8h__incl.map for inclusion in the docs!
  1009. If you installed Graphviz/dot after a previous failing run,
  1010. try deleting the output directory and rerun doxygen.
  1011. error: problems opening map file /home/david/mgarepo/audaspace/BUILD/audaspace-1.0/build/doc/FFMPEGWriter_8h__incl.map for inclusion in the docs!
  1012. If you installed Graphviz/dot after a previous failing run,
  1013. try deleting the output directory and rerun doxygen.
  1014. error: problems opening map file /home/david/mgarepo/audaspace/BUILD/audaspace-1.0/build/doc/JackDevice_8h__incl.map for inclusion in the docs!
  1015. If you installed Graphviz/dot after a previous failing run,
  1016. try deleting the output directory and rerun doxygen.
  1017. error: problems opening map file /home/david/mgarepo/audaspace/BUILD/audaspace-1.0/build/doc/JackSynchronizer_8h__incl.map for inclusion in the docs!
  1018. If you installed Graphviz/dot after a previous failing run,
  1019. try deleting the output directory and rerun doxygen.
  1020. error: problems opening map file /home/david/mgarepo/audaspace/BUILD/audaspace-1.0/build/doc/JackSynchronizer_8h__dep__incl.map for inclusion in the docs!
  1021. If you installed Graphviz/dot after a previous failing run,
  1022. try deleting the output directory and rerun doxygen.
  1023. error: problems opening map file /home/david/mgarepo/audaspace/BUILD/audaspace-1.0/build/doc/SndFile_8h__incl.map for inclusion in the docs!
  1024. If you installed Graphviz/dot after a previous failing run,
  1025. try deleting the output directory and rerun doxygen.
  1026. error: problems opening map file /home/david/mgarepo/audaspace/BUILD/audaspace-1.0/build/doc/SndFileReader_8h__incl.map for inclusion in the docs!
  1027. If you installed Graphviz/dot after a previous failing run,
  1028. try deleting the output directory and rerun doxygen.
  1029. error: problems opening map file /home/david/mgarepo/audaspace/BUILD/audaspace-1.0/build/doc/SndFileWriter_8h__incl.map for inclusion in the docs!
  1030. If you installed Graphviz/dot after a previous failing run,
  1031. try deleting the output directory and rerun doxygen.
  1032. error: problems opening map file /home/david/mgarepo/audaspace/BUILD/audaspace-1.0/build/doc/OpenALDevice_8h__incl.map for inclusion in the docs!
  1033. If you installed Graphviz/dot after a previous failing run,
  1034. try deleting the output directory and rerun doxygen.
  1035. error: problems opening map file /home/david/mgarepo/audaspace/BUILD/audaspace-1.0/build/doc/OpenALReader_8h__incl.map for inclusion in the docs!
  1036. If you installed Graphviz/dot after a previous failing run,
  1037. try deleting the output directory and rerun doxygen.
  1038. error: problems opening map file /home/david/mgarepo/audaspace/BUILD/audaspace-1.0/build/doc/SDLDevice_8h__incl.map for inclusion in the docs!
  1039. If you installed Graphviz/dot after a previous failing run,
  1040. try deleting the output directory and rerun doxygen.
  1041. error: problems opening map file /home/david/mgarepo/audaspace/BUILD/audaspace-1.0/build/doc/classAccumulator__inherit__graph.map for inclusion in the docs!
  1042. If you installed Graphviz/dot after a previous failing run,
  1043. try deleting the output directory and rerun doxygen.
  1044. error: problems opening map file /home/david/mgarepo/audaspace/BUILD/audaspace-1.0/build/doc/classADSR__inherit__graph.map for inclusion in the docs!
  1045. If you installed Graphviz/dot after a previous failing run,
  1046. try deleting the output directory and rerun doxygen.
  1047. error: problems opening map file /home/david/mgarepo/audaspace/BUILD/audaspace-1.0/build/doc/classADSRReader__inherit__graph.map for inclusion in the docs!
  1048. If you installed Graphviz/dot after a previous failing run,
  1049. try deleting the output directory and rerun doxygen.
  1050. error: problems opening map file /home/david/mgarepo/audaspace/BUILD/audaspace-1.0/build/doc/classAnimateableProperty__inherit__graph.map for inclusion in the docs!
  1051. If you installed Graphviz/dot after a previous failing run,
  1052. try deleting the output directory and rerun doxygen.
  1053. error: problems opening map file /home/david/mgarepo/audaspace/BUILD/audaspace-1.0/build/doc/classBaseIIRFilterReader__inherit__graph.map for inclusion in the docs!
  1054. If you installed Graphviz/dot after a previous failing run,
  1055. try deleting the output directory and rerun doxygen.
  1056. error: problems opening map file /home/david/mgarepo/audaspace/BUILD/audaspace-1.0/build/doc/classBuffer__inherit__graph.map for inclusion in the docs!
  1057. If you installed Graphviz/dot after a previous failing run,
  1058. try deleting the output directory and rerun doxygen.
  1059. error: problems opening map file /home/david/mgarepo/audaspace/BUILD/audaspace-1.0/build/doc/classBufferReader__inherit__graph.map for inclusion in the docs!
  1060. If you installed Graphviz/dot after a previous failing run,
  1061. try deleting the output directory and rerun doxygen.
  1062. error: problems opening map file /home/david/mgarepo/audaspace/BUILD/audaspace-1.0/build/doc/classButterworth__inherit__graph.map for inclusion in the docs!
  1063. If you installed Graphviz/dot after a previous failing run,
  1064. try deleting the output directory and rerun doxygen.
  1065. error: problems opening map file /home/david/mgarepo/audaspace/BUILD/audaspace-1.0/build/doc/classButterworthCalculator__inherit__graph.map for inclusion in the docs!
  1066. If you installed Graphviz/dot after a previous failing run,
  1067. try deleting the output directory and rerun doxygen.
  1068. error: problems opening map file /home/david/mgarepo/audaspace/BUILD/audaspace-1.0/build/doc/classCallbackIIRFilterReader__inherit__graph.map for inclusion in the docs!
  1069. If you installed Graphviz/dot after a previous failing run,
  1070. try deleting the output directory and rerun doxygen.
  1071. error: problems opening map file /home/david/mgarepo/audaspace/BUILD/audaspace-1.0/build/doc/classChannelMapper__inherit__graph.map for inclusion in the docs!
  1072. If you installed Graphviz/dot after a previous failing run,
  1073. try deleting the output directory and rerun doxygen.
  1074. error: problems opening map file /home/david/mgarepo/audaspace/BUILD/audaspace-1.0/build/doc/classChannelMapperReader__inherit__graph.map for inclusion in the docs!
  1075. If you installed Graphviz/dot after a previous failing run,
  1076. try deleting the output directory and rerun doxygen.
  1077. error: problems opening map file /home/david/mgarepo/audaspace/BUILD/audaspace-1.0/build/doc/classConverter__inherit__graph.map for inclusion in the docs!
  1078. If you installed Graphviz/dot after a previous failing run,
  1079. try deleting the output directory and rerun doxygen.
  1080. error: problems opening map file /home/david/mgarepo/audaspace/BUILD/audaspace-1.0/build/doc/classConverterReader__inherit__graph.map for inclusion in the docs!
  1081. If you installed Graphviz/dot after a previous failing run,
  1082. try deleting the output directory and rerun doxygen.
  1083. error: problems opening map file /home/david/mgarepo/audaspace/BUILD/audaspace-1.0/build/doc/classDefaultSynchronizer__inherit__graph.map for inclusion in the docs!
  1084. If you installed Graphviz/dot after a previous failing run,
  1085. try deleting the output directory and rerun doxygen.
  1086. error: problems opening map file /home/david/mgarepo/audaspace/BUILD/audaspace-1.0/build/doc/classDelay__inherit__graph.map for inclusion in the docs!
  1087. If you installed Graphviz/dot after a previous failing run,
  1088. try deleting the output directory and rerun doxygen.
  1089. error: problems opening map file /home/david/mgarepo/audaspace/BUILD/audaspace-1.0/build/doc/classDelayReader__inherit__graph.map for inclusion in the docs!
  1090. If you installed Graphviz/dot after a previous failing run,
  1091. try deleting the output directory and rerun doxygen.
  1092. error: problems opening map file /home/david/mgarepo/audaspace/BUILD/audaspace-1.0/build/doc/classDeviceException__inherit__graph.map for inclusion in the docs!
  1093. If you installed Graphviz/dot after a previous failing run,
  1094. try deleting the output directory and rerun doxygen.
  1095. error: problems opening map file /home/david/mgarepo/audaspace/BUILD/audaspace-1.0/build/doc/classDouble__inherit__graph.map for inclusion in the docs!
  1096. If you installed Graphviz/dot after a previous failing run,
  1097. try deleting the output directory and rerun doxygen.
  1098. error: problems opening map file /home/david/mgarepo/audaspace/BUILD/audaspace-1.0/build/doc/classDoubleReader__inherit__graph.map for inclusion in the docs!
  1099. If you installed Graphviz/dot after a previous failing run,
  1100. try deleting the output directory and rerun doxygen.
  1101. error: problems opening map file /home/david/mgarepo/audaspace/BUILD/audaspace-1.0/build/doc/classDynamicIIRFilter__inherit__graph.map for inclusion in the docs!
  1102. If you installed Graphviz/dot after a previous failing run,
  1103. try deleting the output directory and rerun doxygen.
  1104. error: problems opening map file /home/david/mgarepo/audaspace/BUILD/audaspace-1.0/build/doc/classDynamicIIRFilterReader__inherit__graph.map for inclusion in the docs!
  1105. If you installed Graphviz/dot after a previous failing run,
  1106. try deleting the output directory and rerun doxygen.
  1107. error: problems opening map file /home/david/mgarepo/audaspace/BUILD/audaspace-1.0/build/doc/classEffect__inherit__graph.map for inclusion in the docs!
  1108. If you installed Graphviz/dot after a previous failing run,
  1109. try deleting the output directory and rerun doxygen.
  1110. error: problems opening map file /home/david/mgarepo/audaspace/BUILD/audaspace-1.0/build/doc/classEffectReader__inherit__graph.map for inclusion in the docs!
  1111. If you installed Graphviz/dot after a previous failing run,
  1112. try deleting the output directory and rerun doxygen.
  1113. error: problems opening map file /home/david/mgarepo/audaspace/BUILD/audaspace-1.0/build/doc/classEnvelope__inherit__graph.map for inclusion in the docs!
  1114. If you installed Graphviz/dot after a previous failing run,
  1115. try deleting the output directory and rerun doxygen.
  1116. error: problems opening map file /home/david/mgarepo/audaspace/BUILD/audaspace-1.0/build/doc/classException__inherit__graph.map for inclusion in the docs!
  1117. If you installed Graphviz/dot after a previous failing run,
  1118. try deleting the output directory and rerun doxygen.
  1119. error: problems opening map file /home/david/mgarepo/audaspace/BUILD/audaspace-1.0/build/doc/classFader__inherit__graph.map for inclusion in the docs!
  1120. If you installed Graphviz/dot after a previous failing run,
  1121. try deleting the output directory and rerun doxygen.
  1122. error: problems opening map file /home/david/mgarepo/audaspace/BUILD/audaspace-1.0/build/doc/classFaderReader__inherit__graph.map for inclusion in the docs!
  1123. If you installed Graphviz/dot after a previous failing run,
  1124. try deleting the output directory and rerun doxygen.
  1125. error: problems opening map file /home/david/mgarepo/audaspace/BUILD/audaspace-1.0/build/doc/classFFMPEG__inherit__graph.map for inclusion in the docs!
  1126. If you installed Graphviz/dot after a previous failing run,
  1127. try deleting the output directory and rerun doxygen.
  1128. error: problems opening map file /home/david/mgarepo/audaspace/BUILD/audaspace-1.0/build/doc/classFFMPEGReader__inherit__graph.map for inclusion in the docs!
  1129. If you installed Graphviz/dot after a previous failing run,
  1130. try deleting the output directory and rerun doxygen.
  1131. error: problems opening map file /home/david/mgarepo/audaspace/BUILD/audaspace-1.0/build/doc/classFFMPEGWriter__inherit__graph.map for inclusion in the docs!
  1132. If you installed Graphviz/dot after a previous failing run,
  1133. try deleting the output directory and rerun doxygen.
  1134. error: problems opening map file /home/david/mgarepo/audaspace/BUILD/audaspace-1.0/build/doc/classFile__inherit__graph.map for inclusion in the docs!
  1135. If you installed Graphviz/dot after a previous failing run,
  1136. try deleting the output directory and rerun doxygen.
  1137. error: problems opening map file /home/david/mgarepo/audaspace/BUILD/audaspace-1.0/build/doc/classFileException__inherit__graph.map for inclusion in the docs!
  1138. If you installed Graphviz/dot after a previous failing run,
  1139. try deleting the output directory and rerun doxygen.
  1140. error: problems opening map file /home/david/mgarepo/audaspace/BUILD/audaspace-1.0/build/doc/classHighpass__inherit__graph.map for inclusion in the docs!
  1141. If you installed Graphviz/dot after a previous failing run,
  1142. try deleting the output directory and rerun doxygen.
  1143. error: problems opening map file /home/david/mgarepo/audaspace/BUILD/audaspace-1.0/build/doc/classHighpassCalculator__inherit__graph.map for inclusion in the docs!
  1144. If you installed Graphviz/dot after a previous failing run,
  1145. try deleting the output directory and rerun doxygen.
  1146. error: problems opening map file /home/david/mgarepo/audaspace/BUILD/audaspace-1.0/build/doc/classI3DDevice__inherit__graph.map for inclusion in the docs!
  1147. If you installed Graphviz/dot after a previous failing run,
  1148. try deleting the output directory and rerun doxygen.
  1149. error: problems opening map file /home/david/mgarepo/audaspace/BUILD/audaspace-1.0/build/doc/classI3DHandle__inherit__graph.map for inclusion in the docs!
  1150. If you installed Graphviz/dot after a previous failing run,
  1151. try deleting the output directory and rerun doxygen.
  1152. error: problems opening map file /home/david/mgarepo/audaspace/BUILD/audaspace-1.0/build/doc/classIDevice__inherit__graph.map for inclusion in the docs!
  1153. If you installed Graphviz/dot after a previous failing run,
  1154. try deleting the output directory and rerun doxygen.
  1155. error: problems opening map file /home/david/mgarepo/audaspace/BUILD/audaspace-1.0/build/doc/classIDynamicIIRFilterCalculator__inherit__graph.map for inclusion in the docs!
  1156. If you installed Graphviz/dot after a previous failing run,
  1157. try deleting the output directory and rerun doxygen.
  1158. error: problems opening map file /home/david/mgarepo/audaspace/BUILD/audaspace-1.0/build/doc/classIFileInput__inherit__graph.map for inclusion in the docs!
  1159. If you installed Graphviz/dot after a previous failing run,
  1160. try deleting the output directory and rerun doxygen.
  1161. error: problems opening map file /home/david/mgarepo/audaspace/BUILD/audaspace-1.0/build/doc/classIFileOutput__inherit__graph.map for inclusion in the docs!
  1162. If you installed Graphviz/dot after a previous failing run,
  1163. try deleting the output directory and rerun doxygen.
  1164. error: problems opening map file /home/david/mgarepo/audaspace/BUILD/audaspace-1.0/build/doc/classIHandle__inherit__graph.map for inclusion in the docs!
  1165. If you installed Graphviz/dot after a previous failing run,
  1166. try deleting the output directory and rerun doxygen.
  1167. error: problems opening map file /home/david/mgarepo/audaspace/BUILD/audaspace-1.0/build/doc/classIIRFilter__inherit__graph.map for inclusion in the docs!
  1168. If you installed Graphviz/dot after a previous failing run,
  1169. try deleting the output directory and rerun doxygen.
  1170. error: problems opening map file /home/david/mgarepo/audaspace/BUILD/audaspace-1.0/build/doc/classIIRFilterReader__inherit__graph.map for inclusion in the docs!
  1171. If you installed Graphviz/dot after a previous failing run,
  1172. try deleting the output directory and rerun doxygen.
  1173. error: problems opening map file /home/david/mgarepo/audaspace/BUILD/audaspace-1.0/build/doc/classILockable__inherit__graph.map for inclusion in the docs!
  1174. If you installed Graphviz/dot after a previous failing run,
  1175. try deleting the output directory and rerun doxygen.
  1176. error: problems opening map file /home/david/mgarepo/audaspace/BUILD/audaspace-1.0/build/doc/classIReader__inherit__graph.map for inclusion in the docs!
  1177. If you installed Graphviz/dot after a previous failing run,
  1178. try deleting the output directory and rerun doxygen.
  1179. error: problems opening map file /home/david/mgarepo/audaspace/BUILD/audaspace-1.0/build/doc/classISound__inherit__graph.map for inclusion in the docs!
  1180. If you installed Graphviz/dot after a previous failing run,
  1181. try deleting the output directory and rerun doxygen.
  1182. error: problems opening map file /home/david/mgarepo/audaspace/BUILD/audaspace-1.0/build/doc/classISynchronizer__inherit__graph.map for inclusion in the docs!
  1183. If you installed Graphviz/dot after a previous failing run,
  1184. try deleting the output directory and rerun doxygen.
  1185. error: problems opening map file /home/david/mgarepo/audaspace/BUILD/audaspace-1.0/build/doc/classIWriter__inherit__graph.map for inclusion in the docs!
  1186. If you installed Graphviz/dot after a previous failing run,
  1187. try deleting the output directory and rerun doxygen.
  1188. error: problems opening map file /home/david/mgarepo/audaspace/BUILD/audaspace-1.0/build/doc/classJackDevice__inherit__graph.map for inclusion in the docs!
  1189. If you installed Graphviz/dot after a previous failing run,
  1190. try deleting the output directory and rerun doxygen.
  1191. error: problems opening map file /home/david/mgarepo/audaspace/BUILD/audaspace-1.0/build/doc/classJackSynchronizer__inherit__graph.map for inclusion in the docs!
  1192. If you installed Graphviz/dot after a previous failing run,
  1193. try deleting the output directory and rerun doxygen.
  1194. error: problems opening map file /home/david/mgarepo/audaspace/BUILD/audaspace-1.0/build/doc/classJOSResample__inherit__graph.map for inclusion in the docs!
  1195. If you installed Graphviz/dot after a previous failing run,
  1196. try deleting the output directory and rerun doxygen.
  1197. error: problems opening map file /home/david/mgarepo/audaspace/BUILD/audaspace-1.0/build/doc/classJOSResampleReader__inherit__graph.map for inclusion in the docs!
  1198. If you installed Graphviz/dot after a previous failing run,
  1199. try deleting the output directory and rerun doxygen.
  1200. error: problems opening map file /home/david/mgarepo/audaspace/BUILD/audaspace-1.0/build/doc/classLimiter__inherit__graph.map for inclusion in the docs!
  1201. If you installed Graphviz/dot after a previous failing run,
  1202. try deleting the output directory and rerun doxygen.
  1203. error: problems opening map file /home/david/mgarepo/audaspace/BUILD/audaspace-1.0/build/doc/classLimiterReader__inherit__graph.map for inclusion in the docs!
  1204. If you installed Graphviz/dot after a previous failing run,
  1205. try deleting the output directory and rerun doxygen.
  1206. error: problems opening map file /home/david/mgarepo/audaspace/BUILD/audaspace-1.0/build/doc/classLinearResample__inherit__graph.map for inclusion in the docs!
  1207. If you installed Graphviz/dot after a previous failing run,
  1208. try deleting the output directory and rerun doxygen.
  1209. error: problems opening map file /home/david/mgarepo/audaspace/BUILD/audaspace-1.0/build/doc/classLinearResampleReader__inherit__graph.map for inclusion in the docs!
  1210. If you installed Graphviz/dot after a previous failing run,
  1211. try deleting the output directory and rerun doxygen.
  1212. error: problems opening map file /home/david/mgarepo/audaspace/BUILD/audaspace-1.0/build/doc/classLoop__inherit__graph.map for inclusion in the docs!
  1213. If you installed Graphviz/dot after a previous failing run,
  1214. try deleting the output directory and rerun doxygen.
  1215. error: problems opening map file /home/david/mgarepo/audaspace/BUILD/audaspace-1.0/build/doc/classLoopReader__inherit__graph.map for inclusion in the docs!
  1216. If you installed Graphviz/dot after a previous failing run,
  1217. try deleting the output directory and rerun doxygen.
  1218. error: problems opening map file /home/david/mgarepo/audaspace/BUILD/audaspace-1.0/build/doc/classLowpass__inherit__graph.map for inclusion in the docs!
  1219. If you installed Graphviz/dot after a previous failing run,
  1220. try deleting the output directory and rerun doxygen.
  1221. error: problems opening map file /home/david/mgarepo/audaspace/BUILD/audaspace-1.0/build/doc/classLowpassCalculator__inherit__graph.map for inclusion in the docs!
  1222. If you installed Graphviz/dot after a previous failing run,
  1223. try deleting the output directory and rerun doxygen.
  1224. error: problems opening map file /home/david/mgarepo/audaspace/BUILD/audaspace-1.0/build/doc/classNULLDevice__inherit__graph.map for inclusion in the docs!
  1225. If you installed Graphviz/dot after a previous failing run,
  1226. try deleting the output directory and rerun doxygen.
  1227. error: problems opening map file /home/david/mgarepo/audaspace/BUILD/audaspace-1.0/build/doc/classOpenALDevice__inherit__graph.map for inclusion in the docs!
  1228. If you installed Graphviz/dot after a previous failing run,
  1229. try deleting the output directory and rerun doxygen.
  1230. error: problems opening map file /home/david/mgarepo/audaspace/BUILD/audaspace-1.0/build/doc/classOpenALReader__inherit__graph.map for inclusion in the docs!
  1231. If you installed Graphviz/dot after a previous failing run,
  1232. try deleting the output directory and rerun doxygen.
  1233. error: problems opening map file /home/david/mgarepo/audaspace/BUILD/audaspace-1.0/build/doc/classPingPong__inherit__graph.map for inclusion in the docs!
  1234. If you installed Graphviz/dot after a previous failing run,
  1235. try deleting the output directory and rerun doxygen.
  1236. error: problems opening map file /home/david/mgarepo/audaspace/BUILD/audaspace-1.0/build/doc/classPitch__inherit__graph.map for inclusion in the docs!
  1237. If you installed Graphviz/dot after a previous failing run,
  1238. try deleting the output directory and rerun doxygen.
  1239. error: problems opening map file /home/david/mgarepo/audaspace/BUILD/audaspace-1.0/build/doc/classPitchReader__inherit__graph.map for inclusion in the docs!
  1240. If you installed Graphviz/dot after a previous failing run,
  1241. try deleting the output directory and rerun doxygen.
  1242. error: problems opening map file /home/david/mgarepo/audaspace/BUILD/audaspace-1.0/build/doc/classReadDevice__inherit__graph.map for inclusion in the docs!
  1243. If you installed Graphviz/dot after a previous failing run,
  1244. try deleting the output directory and rerun doxygen.
  1245. error: problems opening map file /home/david/mgarepo/audaspace/BUILD/audaspace-1.0/build/doc/classResampleReader__inherit__graph.map for inclusion in the docs!
  1246. If you installed Graphviz/dot after a previous failing run,
  1247. try deleting the output directory and rerun doxygen.
  1248. error: problems opening map file /home/david/mgarepo/audaspace/BUILD/audaspace-1.0/build/doc/classReverse__inherit__graph.map for inclusion in the docs!
  1249. If you installed Graphviz/dot after a previous failing run,
  1250. try deleting the output directory and rerun doxygen.
  1251. error: problems opening map file /home/david/mgarepo/audaspace/BUILD/audaspace-1.0/build/doc/classReverseReader__inherit__graph.map for inclusion in the docs!
  1252. If you installed Graphviz/dot after a previous failing run,
  1253. try deleting the output directory and rerun doxygen.
  1254. error: problems opening map file /home/david/mgarepo/audaspace/BUILD/audaspace-1.0/build/doc/classSawtooth__inherit__graph.map for inclusion in the docs!
  1255. If you installed Graphviz/dot after a previous failing run,
  1256. try deleting the output directory and rerun doxygen.
  1257. error: problems opening map file /home/david/mgarepo/audaspace/BUILD/audaspace-1.0/build/doc/classSawtoothReader__inherit__graph.map for inclusion in the docs!
  1258. If you installed Graphviz/dot after a previous failing run,
  1259. try deleting the output directory and rerun doxygen.
  1260. error: problems opening map file /home/david/mgarepo/audaspace/BUILD/audaspace-1.0/build/doc/classSDLDevice__inherit__graph.map for inclusion in the docs!
  1261. If you installed Graphviz/dot after a previous failing run,
  1262. try deleting the output directory and rerun doxygen.
  1263. error: problems opening map file /home/david/mgarepo/audaspace/BUILD/audaspace-1.0/build/doc/classSequence__inherit__graph.map for inclusion in the docs!
  1264. If you installed Graphviz/dot after a previous failing run,
  1265. try deleting the output directory and rerun doxygen.
  1266. error: problems opening map file /home/david/mgarepo/audaspace/BUILD/audaspace-1.0/build/doc/classSequenceData__inherit__graph.map for inclusion in the docs!
  1267. If you installed Graphviz/dot after a previous failing run,
  1268. try deleting the output directory and rerun doxygen.
  1269. error: problems opening map file /home/david/mgarepo/audaspace/BUILD/audaspace-1.0/build/doc/classSequenceEntry__inherit__graph.map for inclusion in the docs!
  1270. If you installed Graphviz/dot after a previous failing run,
  1271. try deleting the output directory and rerun doxygen.
  1272. error: problems opening map file /home/david/mgarepo/audaspace/BUILD/audaspace-1.0/build/doc/classSequenceReader__inherit__graph.map for inclusion in the docs!
  1273. If you installed Graphviz/dot after a previous failing run,
  1274. try deleting the output directory and rerun doxygen.
  1275. error: problems opening map file /home/david/mgarepo/audaspace/BUILD/audaspace-1.0/build/doc/classSilence__inherit__graph.map for inclusion in the docs!
  1276. If you installed Graphviz/dot after a previous failing run,
  1277. try deleting the output directory and rerun doxygen.
  1278. error: problems opening map file /home/david/mgarepo/audaspace/BUILD/audaspace-1.0/build/doc/classSilenceReader__inherit__graph.map for inclusion in the docs!
  1279. If you installed Graphviz/dot after a previous failing run,
  1280. try deleting the output directory and rerun doxygen.
  1281. error: problems opening map file /home/david/mgarepo/audaspace/BUILD/audaspace-1.0/build/doc/classSine__inherit__graph.map for inclusion in the docs!
  1282. If you installed Graphviz/dot after a previous failing run,
  1283. try deleting the output directory and rerun doxygen.
  1284. error: problems opening map file /home/david/mgarepo/audaspace/BUILD/audaspace-1.0/build/doc/classSineReader__inherit__graph.map for inclusion in the docs!
  1285. If you installed Graphviz/dot after a previous failing run,
  1286. try deleting the output directory and rerun doxygen.
  1287. error: problems opening map file /home/david/mgarepo/audaspace/BUILD/audaspace-1.0/build/doc/classSndFile__inherit__graph.map for inclusion in the docs!
  1288. If you installed Graphviz/dot after a previous failing run,
  1289. try deleting the output directory and rerun doxygen.
  1290. error: problems opening map file /home/david/mgarepo/audaspace/BUILD/audaspace-1.0/build/doc/classSndFileReader__inherit__graph.map for inclusion in the docs!
  1291. If you installed Graphviz/dot after a previous failing run,
  1292. try deleting the output directory and rerun doxygen.
  1293. error: problems opening map file /home/david/mgarepo/audaspace/BUILD/audaspace-1.0/build/doc/classSndFileWriter__inherit__graph.map for inclusion in the docs!
  1294. If you installed Graphviz/dot after a previous failing run,
  1295. try deleting the output directory and rerun doxygen.
  1296. error: problems opening map file /home/david/mgarepo/audaspace/BUILD/audaspace-1.0/build/doc/classSoftwareDevice__inherit__graph.map for inclusion in the docs!
  1297. If you installed Graphviz/dot after a previous failing run,
  1298. try deleting the output directory and rerun doxygen.
  1299. error: problems opening map file /home/david/mgarepo/audaspace/BUILD/audaspace-1.0/build/doc/classSoftwareDevice_1_1SoftwareHandle__inherit__graph.map for inclusion in the docs!
  1300. If you installed Graphviz/dot after a previous failing run,
  1301. try deleting the output directory and rerun doxygen.
  1302. error: problems opening map file /home/david/mgarepo/audaspace/BUILD/audaspace-1.0/build/doc/classSpecsChanger__inherit__graph.map for inclusion in the docs!
  1303. If you installed Graphviz/dot after a previous failing run,
  1304. try deleting the output directory and rerun doxygen.
  1305. error: problems opening map file /home/david/mgarepo/audaspace/BUILD/audaspace-1.0/build/doc/classSquare__inherit__graph.map for inclusion in the docs!
  1306. If you installed Graphviz/dot after a previous failing run,
  1307. try deleting the output directory and rerun doxygen.
  1308. error: problems opening map file /home/david/mgarepo/audaspace/BUILD/audaspace-1.0/build/doc/classSquareReader__inherit__graph.map for inclusion in the docs!
  1309. If you installed Graphviz/dot after a previous failing run,
  1310. try deleting the output directory and rerun doxygen.
  1311. error: problems opening map file /home/david/mgarepo/audaspace/BUILD/audaspace-1.0/build/doc/classStateException__inherit__graph.map for inclusion in the docs!
  1312. If you installed Graphviz/dot after a previous failing run,
  1313. try deleting the output directory and rerun doxygen.
  1314. error: problems opening map file /home/david/mgarepo/audaspace/BUILD/audaspace-1.0/build/doc/classStreamBuffer__inherit__graph.map for inclusion in the docs!
  1315. If you installed Graphviz/dot after a previous failing run,
  1316. try deleting the output directory and rerun doxygen.
  1317. error: problems opening map file /home/david/mgarepo/audaspace/BUILD/audaspace-1.0/build/doc/classSum__inherit__graph.map for inclusion in the docs!
  1318. If you installed Graphviz/dot after a previous failing run,
  1319. try deleting the output directory and rerun doxygen.
  1320. error: problems opening map file /home/david/mgarepo/audaspace/BUILD/audaspace-1.0/build/doc/classSuperpose__inherit__graph.map for inclusion in the docs!
  1321. If you installed Graphviz/dot after a previous failing run,
  1322. try deleting the output directory and rerun doxygen.
  1323. error: problems opening map file /home/david/mgarepo/audaspace/BUILD/audaspace-1.0/build/doc/classSuperposeReader__inherit__graph.map for inclusion in the docs!
  1324. If you installed Graphviz/dot after a previous failing run,
  1325. try deleting the output directory and rerun doxygen.
  1326. error: problems opening map file /home/david/mgarepo/audaspace/BUILD/audaspace-1.0/build/doc/classThreshold__inherit__graph.map for inclusion in the docs!
  1327. If you installed Graphviz/dot after a previous failing run,
  1328. try deleting the output directory and rerun doxygen.
  1329. error: problems opening map file /home/david/mgarepo/audaspace/BUILD/audaspace-1.0/build/doc/classTriangle__inherit__graph.map for inclusion in the docs!
  1330. If you installed Graphviz/dot after a previous failing run,
  1331. try deleting the output directory and rerun doxygen.
  1332. error: problems opening map file /home/david/mgarepo/audaspace/BUILD/audaspace-1.0/build/doc/classTriangleReader__inherit__graph.map for inclusion in the docs!
  1333. If you installed Graphviz/dot after a previous failing run,
  1334. try deleting the output directory and rerun doxygen.
  1335. error: problems opening map file /home/david/mgarepo/audaspace/BUILD/audaspace-1.0/build/doc/classVolume__inherit__graph.map for inclusion in the docs!
  1336. If you installed Graphviz/dot after a previous failing run,
  1337. try deleting the output directory and rerun doxygen.
  1338. error: problems opening map file /home/david/mgarepo/audaspace/BUILD/audaspace-1.0/build/doc/dir_4fef79e7177ba769987a8da36c892c5f_dep.map for inclusion in the docs!
  1339. If you installed Graphviz/dot after a previous failing run,
  1340. try deleting the output directory and rerun doxygen.
  1341. error: problems opening map file /home/david/mgarepo/audaspace/BUILD/audaspace-1.0/build/doc/dir_0ae5fd04a9b991f2c376fafa197d3147_dep.map for inclusion in the docs!
  1342. If you installed Graphviz/dot after a previous failing run,
  1343. try deleting the output directory and rerun doxygen.
  1344. error: problems opening map file /home/david/mgarepo/audaspace/BUILD/audaspace-1.0/build/doc/dir_f53420cbb3587c1aee7123f1754f1105_dep.map for inclusion in the docs!
  1345. If you installed Graphviz/dot after a previous failing run,
  1346. try deleting the output directory and rerun doxygen.
  1347. error: problems opening map file /home/david/mgarepo/audaspace/BUILD/audaspace-1.0/build/doc/dir_30e585b4d0cb3ab23653c9522967a3ec_dep.map for inclusion in the docs!
  1348. If you installed Graphviz/dot after a previous failing run,
  1349. try deleting the output directory and rerun doxygen.
  1350. error: problems opening map file /home/david/mgarepo/audaspace/BUILD/audaspace-1.0/build/doc/dir_49abe4789985cc6a85622e26efb335d2_dep.map for inclusion in the docs!
  1351. If you installed Graphviz/dot after a previous failing run,
  1352. try deleting the output directory and rerun doxygen.
  1353. error: problems opening map file /home/david/mgarepo/audaspace/BUILD/audaspace-1.0/build/doc/dir_463be3d517f3a07d432fe36db9434e91_dep.map for inclusion in the docs!
  1354. If you installed Graphviz/dot after a previous failing run,
  1355. try deleting the output directory and rerun doxygen.
  1356. error: problems opening map file /home/david/mgarepo/audaspace/BUILD/audaspace-1.0/build/doc/dir_768b9b14c1d73c4aafb6a52b1268efd9_dep.map for inclusion in the docs!
  1357. If you installed Graphviz/dot after a previous failing run,
  1358. try deleting the output directory and rerun doxygen.
  1359. error: problems opening map file /home/david/mgarepo/audaspace/BUILD/audaspace-1.0/build/doc/dir_1e60f77674db49603f90ecbfafaa8328_dep.map for inclusion in the docs!
  1360. If you installed Graphviz/dot after a previous failing run,
  1361. try deleting the output directory and rerun doxygen.
  1362. error: problems opening map file /home/david/mgarepo/audaspace/BUILD/audaspace-1.0/build/doc/dir_0ebc243ab7eede109b5f049ea619cf3d_dep.map for inclusion in the docs!
  1363. If you installed Graphviz/dot after a previous failing run,
  1364. try deleting the output directory and rerun doxygen.
  1365. error: problems opening map file /home/david/mgarepo/audaspace/BUILD/audaspace-1.0/build/doc/dir_994ee0afe77535e0243d8facd5f6f306_dep.map for inclusion in the docs!
  1366. If you installed Graphviz/dot after a previous failing run,
  1367. try deleting the output directory and rerun doxygen.
  1368. error: problems opening map file /home/david/mgarepo/audaspace/BUILD/audaspace-1.0/build/doc/dir_f765346efce1a3a011bd69b313493e3c_dep.map for inclusion in the docs!
  1369. If you installed Graphviz/dot after a previous failing run,
  1370. try deleting the output directory and rerun doxygen.
  1371. error: problems opening map file /home/david/mgarepo/audaspace/BUILD/audaspace-1.0/build/doc/dir_0062cd10d3f5282b731ea31b26d469c4_dep.map for inclusion in the docs!
  1372. If you installed Graphviz/dot after a previous failing run,
  1373. try deleting the output directory and rerun doxygen.
  1374. error: problems opening map file /home/david/mgarepo/audaspace/BUILD/audaspace-1.0/build/doc/dir_f3f9eec4201a02bb5cab5b60add364d7_dep.map for inclusion in the docs!
  1375. If you installed Graphviz/dot after a previous failing run,
  1376. try deleting the output directory and rerun doxygen.
  1377. error: problems opening map file /home/david/mgarepo/audaspace/BUILD/audaspace-1.0/build/doc/dir_586ad3c2f85d776b984733890d824e3e_dep.map for inclusion in the docs!
  1378. If you installed Graphviz/dot after a previous failing run,
  1379. try deleting the output directory and rerun doxygen.
  1380. error: problems opening map file /home/david/mgarepo/audaspace/BUILD/audaspace-1.0/build/doc/inherit_graph_0.map for inclusion in the docs!
  1381. If you installed Graphviz/dot after a previous failing run,
  1382. try deleting the output directory and rerun doxygen.
  1383. error: problems opening map file /home/david/mgarepo/audaspace/BUILD/audaspace-1.0/build/doc/inherit_graph_1.map for inclusion in the docs!
  1384. If you installed Graphviz/dot after a previous failing run,
  1385. try deleting the output directory and rerun doxygen.
  1386. error: problems opening map file /home/david/mgarepo/audaspace/BUILD/audaspace-1.0/build/doc/inherit_graph_2.map for inclusion in the docs!
  1387. If you installed Graphviz/dot after a previous failing run,
  1388. try deleting the output directory and rerun doxygen.
  1389. error: problems opening map file /home/david/mgarepo/audaspace/BUILD/audaspace-1.0/build/doc/inherit_graph_3.map for inclusion in the docs!
  1390. If you installed Graphviz/dot after a previous failing run,
  1391. try deleting the output directory and rerun doxygen.
  1392. error: problems opening map file /home/david/mgarepo/audaspace/BUILD/audaspace-1.0/build/doc/inherit_graph_4.map for inclusion in the docs!
  1393. If you installed Graphviz/dot after a previous failing run,
  1394. try deleting the output directory and rerun doxygen.
  1395. error: problems opening map file /home/david/mgarepo/audaspace/BUILD/audaspace-1.0/build/doc/inherit_graph_5.map for inclusion in the docs!
  1396. If you installed Graphviz/dot after a previous failing run,
  1397. try deleting the output directory and rerun doxygen.
  1398. error: problems opening map file /home/david/mgarepo/audaspace/BUILD/audaspace-1.0/build/doc/inherit_graph_6.map for inclusion in the docs!
  1399. If you installed Graphviz/dot after a previous failing run,
  1400. try deleting the output directory and rerun doxygen.
  1401. error: problems opening map file /home/david/mgarepo/audaspace/BUILD/audaspace-1.0/build/doc/inherit_graph_7.map for inclusion in the docs!
  1402. If you installed Graphviz/dot after a previous failing run,
  1403. try deleting the output directory and rerun doxygen.
  1404. error: problems opening map file /home/david/mgarepo/audaspace/BUILD/audaspace-1.0/build/doc/inherit_graph_8.map for inclusion in the docs!
  1405. If you installed Graphviz/dot after a previous failing run,
  1406. try deleting the output directory and rerun doxygen.
  1407. error: problems opening map file /home/david/mgarepo/audaspace/BUILD/audaspace-1.0/build/doc/inherit_graph_9.map for inclusion in the docs!
  1408. If you installed Graphviz/dot after a previous failing run,
  1409. try deleting the output directory and rerun doxygen.
  1410. error: problems opening map file /home/david/mgarepo/audaspace/BUILD/audaspace-1.0/build/doc/inherit_graph_10.map for inclusion in the docs!
  1411. If you installed Graphviz/dot after a previous failing run,
  1412. try deleting the output directory and rerun doxygen.
  1413. error: problems opening map file /home/david/mgarepo/audaspace/BUILD/audaspace-1.0/build/doc/inherit_graph_11.map for inclusion in the docs!
  1414. If you installed Graphviz/dot after a previous failing run,
  1415. try deleting the output directory and rerun doxygen.
  1416. error: problems opening map file /home/david/mgarepo/audaspace/BUILD/audaspace-1.0/build/doc/inherit_graph_12.map for inclusion in the docs!
  1417. If you installed Graphviz/dot after a previous failing run,
  1418. try deleting the output directory and rerun doxygen.
  1419. error: problems opening map file /home/david/mgarepo/audaspace/BUILD/audaspace-1.0/build/doc/inherit_graph_13.map for inclusion in the docs!
  1420. If you installed Graphviz/dot after a previous failing run,
  1421. try deleting the output directory and rerun doxygen.
  1422. error: problems opening map file /home/david/mgarepo/audaspace/BUILD/audaspace-1.0/build/doc/inherit_graph_14.map for inclusion in the docs!
  1423. If you installed Graphviz/dot after a previous failing run,
  1424. try deleting the output directory and rerun doxygen.
  1425. error: problems opening map file /home/david/mgarepo/audaspace/BUILD/audaspace-1.0/build/doc/inherit_graph_15.map for inclusion in the docs!
  1426. If you installed Graphviz/dot after a previous failing run,
  1427. try deleting the output directory and rerun doxygen.
  1428. error: problems opening map file /home/david/mgarepo/audaspace/BUILD/audaspace-1.0/build/doc/inherit_graph_16.map for inclusion in the docs!
  1429. If you installed Graphviz/dot after a previous failing run,
  1430. try deleting the output directory and rerun doxygen.
  1431. error: problems opening map file /home/david/mgarepo/audaspace/BUILD/audaspace-1.0/build/doc/inherit_graph_17.map for inclusion in the docs!
  1432. If you installed Graphviz/dot after a previous failing run,
  1433. try deleting the output directory and rerun doxygen.
  1434. error: problems opening map file /home/david/mgarepo/audaspace/BUILD/audaspace-1.0/build/doc/inherit_graph_18.map for inclusion in the docs!
  1435. If you installed Graphviz/dot after a previous failing run,
  1436. try deleting the output directory and rerun doxygen.
  1437. error: problems opening map file /home/david/mgarepo/audaspace/BUILD/audaspace-1.0/build/doc/inherit_graph_19.map for inclusion in the docs!
  1438. If you installed Graphviz/dot after a previous failing run,
  1439. try deleting the output directory and rerun doxygen.
  1440. [ 9%] Built target audaspace_doc
  1441. [ 4%] Building CXX object CMakeFiles/audaspace.dir/src/devices/DeviceManager.cpp.o
  1442. [ 9%] Building CXX object CMakeFiles/audaspace.dir/src/file/File.cpp.o
  1443. [ 10%] Building CXX object CMakeFiles/audaspace.dir/src/file/FileManager.cpp.o
  1444. [ 10%] Building CXX object CMakeFiles/audaspace.dir/src/file/FileWriter.cpp.o
  1445. [ 11%] Building CXX object CMakeFiles/audaspace.dir/src/fx/Accumulator.cpp.o
  1446. [ 12%] Building CXX object CMakeFiles/audaspace.dir/src/fx/ADSR.cpp.o
  1447. [ 13%] Building CXX object CMakeFiles/audaspace.dir/src/fx/ADSRReader.cpp.o
  1448. [ 14%] Building CXX object CMakeFiles/audaspace.dir/src/fx/BaseIIRFilterReader.cpp.o
  1449. [ 15%] Building CXX object CMakeFiles/audaspace.dir/src/fx/ButterworthCalculator.cpp.o
  1450. [ 7%] Building CXX object CMakeFiles/audaspace.dir/src/devices/SoftwareDevice.cpp.o
  1451. [ 17%] Building CXX object CMakeFiles/audaspace.dir/src/fx/CallbackIIRFilterReader.cpp.o
  1452. [ 16%] Building CXX object CMakeFiles/audaspace.dir/src/fx/Butterworth.cpp.o
  1453. [ 18%] Building CXX object CMakeFiles/audaspace.dir/src/fx/Delay.cpp.o
  1454. [ 19%] Building CXX object CMakeFiles/audaspace.dir/src/fx/DelayReader.cpp.o
  1455. [ 20%] Building CXX object CMakeFiles/audaspace.dir/src/fx/DynamicIIRFilter.cpp.o
  1456. [ 21%] Building CXX object CMakeFiles/audaspace.dir/src/fx/Effect.cpp.o
  1457. [ 20%] Building CXX object CMakeFiles/audaspace.dir/src/fx/DynamicIIRFilterReader.cpp.o
  1458. [ 22%] Building CXX object CMakeFiles/audaspace.dir/src/fx/EffectReader.cpp.o
  1459. [ 23%] Building CXX object CMakeFiles/audaspace.dir/src/fx/Envelope.cpp.o
  1460. [ 24%] Building CXX object CMakeFiles/audaspace.dir/src/fx/Fader.cpp.o
  1461. [ 26%] Building CXX object CMakeFiles/audaspace.dir/src/fx/HighpassCalculator.cpp.o
  1462. [ 25%] Building CXX object CMakeFiles/audaspace.dir/src/fx/FaderReader.cpp.o
  1463. [ 30%] Building CXX object CMakeFiles/audaspace.dir/src/fx/Limiter.cpp.o
  1464. [ 27%] Building CXX object CMakeFiles/audaspace.dir/src/fx/Highpass.cpp.o
  1465. [ 28%] Building CXX object CMakeFiles/audaspace.dir/src/fx/IIRFilter.cpp.o
  1466. [ 29%] Building CXX object CMakeFiles/audaspace.dir/src/fx/IIRFilterReader.cpp.o
  1467. [ 33%] Building CXX object CMakeFiles/audaspace.dir/src/fx/LowpassCalculator.cpp.o
  1468. [ 31%] Building CXX object CMakeFiles/audaspace.dir/src/fx/Loop.cpp.o
  1469. [ 32%] Building CXX object CMakeFiles/audaspace.dir/src/fx/LoopReader.cpp.o
  1470. [ 35%] Building CXX object CMakeFiles/audaspace.dir/src/fx/Pitch.cpp.o
  1471. [ 34%] Building CXX object CMakeFiles/audaspace.dir/src/fx/Lowpass.cpp.o
  1472. [ 36%] Building CXX object CMakeFiles/audaspace.dir/src/fx/PitchReader.cpp.o
  1473. [ 30%] Building CXX object CMakeFiles/audaspace.dir/src/fx/LimiterReader.cpp.o
  1474. [ 37%] Building CXX object CMakeFiles/audaspace.dir/src/fx/Reverse.cpp.o
  1475. [ 38%] Building CXX object CMakeFiles/audaspace.dir/src/fx/ReverseReader.cpp.o
  1476. [ 39%] Building CXX object CMakeFiles/audaspace.dir/src/fx/Sum.cpp.o
  1477. [ 40%] Building CXX object CMakeFiles/audaspace.dir/src/fx/Threshold.cpp.o
  1478. [ 42%] Building CXX object CMakeFiles/audaspace.dir/src/generator/SawtoothReader.cpp.o
  1479. [ 44%] Building CXX object CMakeFiles/audaspace.dir/src/generator/SilenceReader.cpp.o
  1480. [ 41%] Building CXX object CMakeFiles/audaspace.dir/src/generator/Sawtooth.cpp.o
  1481. [ 46%] Building CXX object CMakeFiles/audaspace.dir/src/generator/SineReader.cpp.o
  1482. [ 40%] Building CXX object CMakeFiles/audaspace.dir/src/fx/Volume.cpp.o
  1483. [ 43%] Building CXX object CMakeFiles/audaspace.dir/src/generator/Silence.cpp.o
  1484. [ 48%] Building CXX object CMakeFiles/audaspace.dir/src/generator/SquareReader.cpp.o
  1485. [ 50%] Building CXX object CMakeFiles/audaspace.dir/src/generator/TriangleReader.cpp.o
  1486. [ 45%] Building CXX object CMakeFiles/audaspace.dir/src/generator/Sine.cpp.o
  1487. [ 47%] Building CXX object CMakeFiles/audaspace.dir/src/generator/Square.cpp.o
  1488. [ 49%] Building CXX object CMakeFiles/audaspace.dir/src/generator/Triangle.cpp.o
  1489. [ 51%] Building CXX object CMakeFiles/audaspace.dir/src/respec/ChannelMapper.cpp.o
  1490. [ 51%] Building CXX object CMakeFiles/audaspace.dir/src/respec/ChannelMapperReader.cpp.o
  1491. [ 52%] Building CXX object CMakeFiles/audaspace.dir/src/respec/Converter.cpp.o
  1492. [ 53%] Building CXX object CMakeFiles/audaspace.dir/src/respec/ConverterFunctions.cpp.o
  1493. [ 54%] Building CXX object CMakeFiles/audaspace.dir/src/respec/ConverterReader.cpp.o
  1494. [ 55%] Building CXX object CMakeFiles/audaspace.dir/src/respec/JOSResample.cpp.o
  1495. [ 58%] Building CXX object CMakeFiles/audaspace.dir/src/respec/LinearResample.cpp.o
  1496. [ 59%] Building CXX object CMakeFiles/audaspace.dir/src/respec/LinearResampleReader.cpp.o
  1497. [ 60%] Building CXX object CMakeFiles/audaspace.dir/src/respec/ResampleReader.cpp.o
  1498. [ 57%] Building CXX object CMakeFiles/audaspace.dir/src/respec/JOSResampleReader.cpp.o
  1499. [ 61%] Building CXX object CMakeFiles/audaspace.dir/src/respec/SpecsChanger.cpp.o
  1500. [ 60%] Building CXX object CMakeFiles/audaspace.dir/src/respec/Mixer.cpp.o
  1501. [ 62%] Building CXX object CMakeFiles/audaspace.dir/src/sequence/AnimateableProperty.cpp.o
  1502. [ 63%] Building CXX object CMakeFiles/audaspace.dir/src/sequence/Double.cpp.o
  1503. [ 64%] Building CXX object CMakeFiles/audaspace.dir/src/sequence/DoubleReader.cpp.o
  1504. [ 65%] Building CXX object CMakeFiles/audaspace.dir/src/sequence/PingPong.cpp.o
  1505. [ 66%] Building CXX object CMakeFiles/audaspace.dir/src/sequence/Sequence.cpp.o
  1506. [ 67%] Building CXX object CMakeFiles/audaspace.dir/src/sequence/SequenceData.cpp.o
  1507. [ 56%] Building CXX object CMakeFiles/audaspace.dir/src/respec/JOSResampleReaderCoeff.cpp.o
  1508. [ 68%] Building CXX object CMakeFiles/audaspace.dir/src/sequence/SequenceEntry.cpp.o
  1509. [ 69%] Building CXX object CMakeFiles/audaspace.dir/src/sequence/SequenceHandle.cpp.o
  1510. [ 70%] Building CXX object CMakeFiles/audaspace.dir/src/sequence/Superpose.cpp.o
  1511. [ 73%] Building CXX object CMakeFiles/audaspace.dir/src/util/BufferReader.cpp.o
  1512. [ 72%] Building CXX object CMakeFiles/audaspace.dir/src/util/Buffer.cpp.o
  1513. [ 74%] Building CXX object CMakeFiles/audaspace.dir/src/util/StreamBuffer.cpp.o
  1514. [ 71%] Building CXX object CMakeFiles/audaspace.dir/src/sequence/SuperposeReader.cpp.o
  1515. [ 70%] Building CXX object CMakeFiles/audaspace.dir/src/sequence/SequenceReader.cpp.o
  1516. [ 75%] Building CXX object CMakeFiles/audaspace.dir/PluginManager.cpp.o
  1517. Linking CXX shared library libaudaspace.so
  1518. [ 75%] Built target audaspace
  1519. Makefile:117: recipe for target 'all' failed
  1520. make: *** [all] Error 2
  1521. error: Bad exit status from /home/david/mgarepo/audaspace/BUILDROOT/rpm-tmp.5Z9Kq6 (%build)
  1522.  
  1523.  
  1524. RPM build errors:
  1525. Bad exit status from /home/david/mgarepo/audaspace/BUILDROOT/rpm-tmp.5Z9Kq6 (%build)
Advertisement
Add Comment
Please, Sign In to add comment