SHARE
TWEET

mach64drm build error

a guest Jun 15th, 2012 41 Never
Not a member of Pastebin yet? Sign Up, it unlocks many cool features!
  1. ismaelvc@archlinux ~ $ LANGUAGE=en pacs mach64drm
  2.  
  3. Aur Targets    (1): mach64drm
  4.  
  5. Proceed with installation? [Y/n]
  6.  
  7. Edit mach64drm PKGBUILD with $EDITOR? [Y/n]
  8.  
  9. Edit mach64drm.install with $EDITOR? [Y/n]
  10.  
  11. ==> Making package: mach64drm 20120119-1 (vie jun 15 19:35:53 CDT 2012)
  12. ==> Checking runtime dependencies...
  13. ==> Checking buildtime dependencies...
  14. ==> Retrieving Sources...
  15.   -> Found mach64-20120119.tar.gz
  16. ==> Validating source files with md5sums...
  17.     mach64-20120119.tar.gz ... Passed
  18. ==> Extracting Sources...
  19.   -> Extracting mach64-20120119.tar.gz with bsdtar
  20. ==> Removing existing pkg/ directory...
  21. ==> Starting build()...
  22. make -C /lib/modules/`uname -r`/build M=`pwd` modules
  23. make[1]: Entering directory `/usr/src/linux-3.4.2-2-ARCH'
  24.   CC [M]  /tmp/packerbuild-1000/mach64drm/mach64drm/src/mach64-20120119/mach64_drv.o
  25. /tmp/packerbuild-1000/mach64drm/mach64drm/src/mach64-20120119/mach64_drv.c:58:2: warning: braces around scalar initializer [enabled by default]
  26. /tmp/packerbuild-1000/mach64drm/mach64drm/src/mach64-20120119/mach64_drv.c:58:2: warning: (near initialization for ‘driver.fops’) [enabled by default]
  27. /tmp/packerbuild-1000/mach64drm/mach64drm/src/mach64-20120119/mach64_drv.c:59:3: error: field name not in record or union initializer
  28. /tmp/packerbuild-1000/mach64drm/mach64drm/src/mach64-20120119/mach64_drv.c:59:3: error: (near initialization for ‘driver.fops’)
  29. /tmp/packerbuild-1000/mach64drm/mach64drm/src/mach64-20120119/mach64_drv.c:59:3: warning: initialization from incompatible pointer type [enabled by default]
  30. /tmp/packerbuild-1000/mach64drm/mach64drm/src/mach64-20120119/mach64_drv.c:59:3: warning: (near initialization for ‘driver.fops’) [enabled by default]
  31. /tmp/packerbuild-1000/mach64drm/mach64drm/src/mach64-20120119/mach64_drv.c:60:3: error: field name not in record or union initializer
  32. /tmp/packerbuild-1000/mach64drm/mach64drm/src/mach64-20120119/mach64_drv.c:60:3: error: (near initialization for ‘driver.fops’)
  33. /tmp/packerbuild-1000/mach64drm/mach64drm/src/mach64-20120119/mach64_drv.c:60:3: warning: excess elements in scalar initializer [enabled by default]
  34. /tmp/packerbuild-1000/mach64drm/mach64drm/src/mach64-20120119/mach64_drv.c:60:3: warning: (near initialization for ‘driver.fops’) [enabled by default]
  35. /tmp/packerbuild-1000/mach64drm/mach64drm/src/mach64-20120119/mach64_drv.c:61:3: error: field name not in record or union initializer
  36. /tmp/packerbuild-1000/mach64drm/mach64drm/src/mach64-20120119/mach64_drv.c:61:3: error: (near initialization for ‘driver.fops’)
  37. /tmp/packerbuild-1000/mach64drm/mach64drm/src/mach64-20120119/mach64_drv.c:61:3: warning: excess elements in scalar initializer [enabled by default]
  38. /tmp/packerbuild-1000/mach64drm/mach64drm/src/mach64-20120119/mach64_drv.c:61:3: warning: (near initialization for ‘driver.fops’) [enabled by default]
  39. /tmp/packerbuild-1000/mach64drm/mach64drm/src/mach64-20120119/mach64_drv.c:62:3: error: field name not in record or union initializer
  40. /tmp/packerbuild-1000/mach64drm/mach64drm/src/mach64-20120119/mach64_drv.c:62:3: error: (near initialization for ‘driver.fops’)
  41. /tmp/packerbuild-1000/mach64drm/mach64drm/src/mach64-20120119/mach64_drv.c:62:3: warning: excess elements in scalar initializer [enabled by default]
  42. /tmp/packerbuild-1000/mach64drm/mach64drm/src/mach64-20120119/mach64_drv.c:62:3: warning: (near initialization for ‘driver.fops’) [enabled by default]
  43. /tmp/packerbuild-1000/mach64drm/mach64drm/src/mach64-20120119/mach64_drv.c:63:3: error: field name not in record or union initializer
  44. /tmp/packerbuild-1000/mach64drm/mach64drm/src/mach64-20120119/mach64_drv.c:63:3: error: (near initialization for ‘driver.fops’)
  45. /tmp/packerbuild-1000/mach64drm/mach64drm/src/mach64-20120119/mach64_drv.c:63:3: warning: excess elements in scalar initializer [enabled by default]
  46. /tmp/packerbuild-1000/mach64drm/mach64drm/src/mach64-20120119/mach64_drv.c:63:3: warning: (near initialization for ‘driver.fops’) [enabled by default]
  47. /tmp/packerbuild-1000/mach64drm/mach64drm/src/mach64-20120119/mach64_drv.c:64:3: error: field name not in record or union initializer
  48. /tmp/packerbuild-1000/mach64drm/mach64drm/src/mach64-20120119/mach64_drv.c:64:3: error: (near initialization for ‘driver.fops’)
  49. /tmp/packerbuild-1000/mach64drm/mach64drm/src/mach64-20120119/mach64_drv.c:64:3: warning: excess elements in scalar initializer [enabled by default]
  50. /tmp/packerbuild-1000/mach64drm/mach64drm/src/mach64-20120119/mach64_drv.c:64:3: warning: (near initialization for ‘driver.fops’) [enabled by default]
  51. /tmp/packerbuild-1000/mach64drm/mach64drm/src/mach64-20120119/mach64_drv.c:65:3: error: field name not in record or union initializer
  52. /tmp/packerbuild-1000/mach64drm/mach64drm/src/mach64-20120119/mach64_drv.c:65:3: error: (near initialization for ‘driver.fops’)
  53. /tmp/packerbuild-1000/mach64drm/mach64drm/src/mach64-20120119/mach64_drv.c:65:3: warning: excess elements in scalar initializer [enabled by default]
  54. /tmp/packerbuild-1000/mach64drm/mach64drm/src/mach64-20120119/mach64_drv.c:65:3: warning: (near initialization for ‘driver.fops’) [enabled by default]
  55. /tmp/packerbuild-1000/mach64drm/mach64drm/src/mach64-20120119/mach64_drv.c:66:3: error: field name not in record or union initializer
  56. /tmp/packerbuild-1000/mach64drm/mach64drm/src/mach64-20120119/mach64_drv.c:66:3: error: (near initialization for ‘driver.fops’)
  57. /tmp/packerbuild-1000/mach64drm/mach64drm/src/mach64-20120119/mach64_drv.c:66:3: warning: excess elements in scalar initializer [enabled by default]
  58. /tmp/packerbuild-1000/mach64drm/mach64drm/src/mach64-20120119/mach64_drv.c:66:3: warning: (near initialization for ‘driver.fops’) [enabled by default]
  59. make[2]: *** [/tmp/packerbuild-1000/mach64drm/mach64drm/src/mach64-20120119/mach64_drv.o] Error 1
  60. make[1]: *** [_module_/tmp/packerbuild-1000/mach64drm/mach64drm/src/mach64-20120119] Error 2
  61. make[1]: Leaving directory `/usr/src/linux-3.4.2-2-ARCH'
  62. make: *** [default] Error 2
  63. ==> ERROR: A failure occurred in build().
  64.     Aborting...
  65. The build failed.
RAW Paste Data
We use cookies for various purposes including analytics. By continuing to use Pastebin, you agree to our use of cookies as described in the Cookies Policy. OK, I Understand
 
Top