SHARE
TWEET

Untitled

a guest Oct 21st, 2019 69 Never
Not a member of Pastebin yet? Sign Up, it unlocks many cool features!
  1. /home/illusionww/Documents/GitHub/pygraphs/pygraphs/cluster/kkmeans.py:73: RuntimeWarning: invalid value encountered in true_divide
  2.   h = U.T / n_nodes_in_cluster[:, None]
  3. /home/illusionww/Documents/GitHub/pygraphs/pygraphs/cluster/kkmeans.py:73: RuntimeWarning: invalid value encountered in true_divide
  4.   h = U.T / n_nodes_in_cluster[:, None]
  5. /home/illusionww/Documents/GitHub/pygraphs/pygraphs/cluster/kkmeans.py:73: RuntimeWarning: invalid value encountered in true_divide
  6.   h = U.T / n_nodes_in_cluster[:, None]
  7. /home/illusionww/Documents/GitHub/pygraphs/pygraphs/cluster/kkmeans.py:73: RuntimeWarning: invalid value encountered in true_divide
  8.   h = U.T / n_nodes_in_cluster[:, None]
  9. /home/illusionww/Documents/GitHub/pygraphs/pygraphs/cluster/kkmeans.py:73: RuntimeWarning: invalid value encountered in true_divide
  10.   h = U.T / n_nodes_in_cluster[:, None]
  11. /home/illusionww/Documents/GitHub/pygraphs/pygraphs/cluster/kkmeans.py:73: RuntimeWarning: invalid value encountered in true_divide
  12.   h = U.T / n_nodes_in_cluster[:, None]
  13. /home/illusionww/Documents/GitHub/pygraphs/pygraphs/cluster/kkmeans.py:73: RuntimeWarning: invalid value encountered in true_divide
  14.   h = U.T / n_nodes_in_cluster[:, None]
  15. /home/illusionww/Documents/GitHub/pygraphs/pygraphs/cluster/kkmeans.py:73: RuntimeWarning: invalid value encountered in true_divide
  16.   h = U.T / n_nodes_in_cluster[:, None]
  17. /home/illusionww/Documents/GitHub/pygraphs/pygraphs/cluster/kkmeans.py:73: RuntimeWarning: invalid value encountered in true_divide
  18.   h = U.T / n_nodes_in_cluster[:, None]
  19. /home/illusionww/Documents/GitHub/pygraphs/pygraphs/cluster/kkmeans.py:73: RuntimeWarning: invalid value encountered in true_divide
  20.   h = U.T / n_nodes_in_cluster[:, None]
  21. INFO:SCCT   football    0.793   0.872   -0.079
  22. INFO:SCCT   football    0.875   0.033/home/illusionww/Documents/GitHub/pygraphs/pygraphs/cluster/kkmeans.py:73: RuntimeWarning: invalid value encountered in true_divide
  23.   h = U.T / n_nodes_in_cluster[:, None]
  24. /home/illusionww/Documents/GitHub/pygraphs/pygraphs/cluster/kkmeans.py:73: RuntimeWarning: invalid value encountered in true_divide
  25.   h = U.T / n_nodes_in_cluster[:, None]
  26. /home/illusionww/Documents/GitHub/pygraphs/pygraphs/cluster/kkmeans.py:73: RuntimeWarning: invalid value encountered in true_divide
  27.   h = U.T / n_nodes_in_cluster[:, None]
  28. /home/illusionww/Documents/GitHub/pygraphs/pygraphs/cluster/kkmeans.py:73: RuntimeWarning: invalid value encountered in true_divide
  29.   h = U.T / n_nodes_in_cluster[:, None]
  30. /home/illusionww/Documents/GitHub/pygraphs/pygraphs/cluster/kkmeans.py:73: RuntimeWarning: invalid value encountered in true_divide
  31.   h = U.T / n_nodes_in_cluster[:, None]
  32. /home/illusionww/Documents/GitHub/pygraphs/pygraphs/cluster/kkmeans.py:73: RuntimeWarning: invalid value encountered in true_divide
  33.   h = U.T / n_nodes_in_cluster[:, None]
  34. /home/illusionww/Documents/GitHub/pygraphs/pygraphs/cluster/kkmeans.py:73: RuntimeWarning: invalid value encountered in true_divide
  35.   h = U.T / n_nodes_in_cluster[:, None]
  36. /home/illusionww/Documents/GitHub/pygraphs/pygraphs/cluster/kkmeans.py:73: RuntimeWarning: invalid value encountered in true_divide
  37.   h = U.T / n_nodes_in_cluster[:, None]
  38. /home/illusionww/Documents/GitHub/pygraphs/pygraphs/cluster/kkmeans.py:73: RuntimeWarning: invalid value encountered in true_divide
  39.   h = U.T / n_nodes_in_cluster[:, None]
  40. /home/illusionww/Documents/GitHub/pygraphs/pygraphs/cluster/kkmeans.py:73: RuntimeWarning: invalid value encountered in true_divide
  41.   h = U.T / n_nodes_in_cluster[:, None]
  42. INFO:SCCT   football/_old   0.793   0.732   0.061
  43. INFO:SCCT   football/_old   0.717   0.111
  44. INFO:SCCT   karate  1.000   1.000   0.000
  45. INFO:SCCT   karate  1.000   0.000
  46. INFO:SCCT   news_2cl_1  0.794   0.794   -0.000
  47. INFO:SCCT   news_2cl_1  0.794   0.000
  48. INFO:SCCT   news_2cl_2  0.582   0.590   -0.008
  49. INFO:SCCT   news_2cl_2  0.591   0.007
  50. INFO:SCCT   news_2cl_3  0.758   0.755   0.002
  51. INFO:SCCT   news_2cl_3  0.758   0.004
  52. INFO:SCCT   news_3cl_1  0.778   0.779   -0.000
  53. INFO:SCCT   news_3cl_1  0.781   0.006
  54. INFO:SCCT   news_3cl_2  0.762   0.758   0.003
  55. INFO:SCCT   news_3cl_2  0.757   0.004
  56. INFO:SCCT   news_3cl_3  0.746   0.713   0.033
  57. INFO:SCCT   news_3cl_3  0.746   0.096
  58. INFO:SCCT   news_5cl_1  0.670   0.673   -0.003
  59. INFO:SCCT   news_5cl_1  0.674   0.001
  60. INFO:SCCT   news_5cl_2  0.618   0.591   0.027
  61. INFO:SCCT   news_5cl_2  0.592   0.025
  62. INFO:SCCT   news_5cl_3  0.627   0.603   0.023
  63. INFO:SCCT   news_5cl_3  0.626   0.036INFO:FE    football    0.906   0.862   0.044
  64. INFO:FE football    0.863   0.048
  65. INFO:FE football/_old   0.906   0.830   0.076
  66. INFO:FE football/_old   0.838   0.042
  67. INFO:FE karate  1.000   0.644   0.356
  68. INFO:FE karate  0.837   0.311
  69. INFO:FE news_2cl_1  0.805   0.811   -0.006
  70. INFO:FE news_2cl_1  0.811   0.013
  71. INFO:FE news_2cl_2  0.591   0.614   -0.023
  72. INFO:FE news_2cl_2  0.616   0.029
  73. INFO:FE news_2cl_3  0.811   0.819   -0.008
  74. INFO:FE news_2cl_3  0.819   0.010
  75. INFO:FE news_3cl_1  0.781   0.756   0.025
  76. INFO:FE news_3cl_1  0.776   0.057
  77. INFO:FE news_3cl_2  0.797   0.787   0.009
  78. INFO:FE news_3cl_2  0.789   0.014
  79. INFO:FE news_3cl_3  0.771   0.698   0.073
  80. INFO:FE news_3cl_3  0.758   0.124
  81. INFO:FE news_5cl_1  0.692   0.681   0.011
  82. INFO:FE news_5cl_1  0.698   0.051
  83. INFO:FE news_5cl_2  0.640   0.617   0.023
  84. INFO:FE news_5cl_2  0.637   0.061
  85. INFO:FE news_5cl_3  0.607   0.590   0.017
  86. INFO:FE news_5cl_3  0.588   0.022
  87. Failure
  88. Traceback (most recent call last):
  89.   File "/usr/lib/python3.6/unittest/case.py", line 59, in testPartExecutor
  90.     yield
  91.   File "/usr/lib/python3.6/unittest/case.py", line 605, in run
  92.     testMethod()
  93.   File "/home/illusionww/Documents/GitHub/pygraphs/tests/article_comparison/test_sommer.py", line 101, in test_FE
  94.     self.dataset_results(FE_K, 0.1, 1)
  95.   File "/home/illusionww/Documents/GitHub/pygraphs/tests/article_comparison/test_sommer.py", line 119, in dataset_results
  96.     dist_compensation_strategy='+40')
  97.   File "/home/illusionww/Documents/GitHub/pygraphs/tests/article_comparison/test_sommer.py", line 95, in _dataset_results
  98.     result['true_nmi'], result['diff']))
  99.   File "/usr/lib/python3.6/unittest/case.py", line 682, in assertTrue
  100.     raise self.failureException(msg)
  101. AssertionError: False is not true : karate, FE: 0.6439 != 1.0000, diff:0.3561
  102.  
  103. INFO:RSP    football    0.909   0.865   0.044
  104. INFO:RSP    football    0.877   0.041
  105. INFO:RSP    football/_old   0.909   0.832   0.077
  106. INFO:RSP    football/_old   0.845   0.038
  107. INFO:RSP    karate  1.000   0.647   0.353
  108. INFO:RSP    karate  0.837   0.307
  109. INFO:RSP    news_2cl_1  0.797   0.794   0.003
  110. INFO:RSP    news_2cl_1  0.796   0.014
  111. INFO:RSP    news_2cl_2  0.580   0.589   -0.010
  112. INFO:RSP    news_2cl_2  0.588   0.020
  113. INFO:RSP    news_2cl_3  0.796   0.792   0.004
  114. INFO:RSP    news_2cl_3  0.796   0.005
  115. INFO:RSP    news_3cl_1  0.781   0.723   0.058
  116. INFO:RSP    news_3cl_1  0.778   0.111
  117. INFO:RSP    news_3cl_2  0.776   0.740   0.036
  118. INFO:RSP    news_3cl_2  0.776   0.099
  119. INFO:RSP    news_3cl_3  0.730   0.651   0.079
  120. INFO:RSP    news_3cl_3  0.725   0.136
  121. INFO:RSP    news_5cl_1  0.708   0.673   0.035
  122. INFO:RSP    news_5cl_1  0.701   0.056
  123. INFO:RSP    news_5cl_2  0.624   0.629   -0.004
  124. INFO:RSP    news_5cl_2  0.627   0.015
  125. INFO:RSP    news_5cl_3  0.575   0.577   -0.002
  126. INFO:RSP    news_5cl_3  0.577   0.018
  127. Failure
  128. Traceback (most recent call last):
  129.   File "/usr/lib/python3.6/unittest/case.py", line 59, in testPartExecutor
  130.     yield
  131.   File "/usr/lib/python3.6/unittest/case.py", line 605, in run
  132.     testMethod()
  133.   File "/home/illusionww/Documents/GitHub/pygraphs/tests/article_comparison/test_sommer.py", line 107, in test_RSP
  134.     self.dataset_results(RSP_K, 0.03, 3)
  135.   File "/home/illusionww/Documents/GitHub/pygraphs/tests/article_comparison/test_sommer.py", line 119, in dataset_results
  136.     dist_compensation_strategy='+40')
  137.   File "/home/illusionww/Documents/GitHub/pygraphs/tests/article_comparison/test_sommer.py", line 95, in _dataset_results
  138.     result['true_nmi'], result['diff']))
  139.   File "/usr/lib/python3.6/unittest/case.py", line 682, in assertTrue
  140.     raise self.failureException(msg)
  141. AssertionError: False is not true : karate, RSP: 0.6471 != 1.0000, diff:0.3529
  142.  
  143. INFO:SCT    football    0.811   0.857   -0.045
  144. INFO:SCT    football    0.864   0.057
  145. INFO:SCT    football/_old   0.811   0.829   -0.018
  146. INFO:SCT    football/_old   0.832   0.055
  147. INFO:SCT    karate  1.000   1.000   0.000
  148. INFO:SCT    karate  1.000   0.000
  149. INFO:SCT    news_2cl_1  0.817   0.817   0.000
  150. INFO:SCT    news_2cl_1  0.820   0.011
  151. INFO:SCT    news_2cl_2  0.552   0.573   -0.021
  152. INFO:SCT    news_2cl_2  0.564   0.031
  153. INFO:SCT    news_2cl_3  0.786   0.803   -0.017
  154. INFO:SCT    news_2cl_3  0.824   0.028
  155. INFO:SCT    news_3cl_1  0.773   0.749   0.024
  156. INFO:SCT    news_3cl_1  0.765   0.053
  157. INFO:SCT    news_3cl_2  0.728   0.730   -0.002
  158. INFO:SCT    news_3cl_2  0.727   0.011
  159. INFO:SCT    news_3cl_3  0.763   0.689   0.073
  160. INFO:SCT    news_3cl_3  0.764   0.118
  161. INFO:SCT    news_5cl_1  0.666   0.645   0.021
  162. INFO:SCT    news_5cl_1  0.649   0.026
  163. INFO:SCT    news_5cl_2  0.615   0.549   0.066
  164. INFO:SCT    news_5cl_2  0.561   0.050
  165. INFO:SCT    news_5cl_3  0.571   0.557   0.015
  166. INFO:SCT    news_5cl_3  0.578   0.035INFO:SP-CT football    0.858   0.859   -0.002
  167. INFO:SP-CT  football    0.855   0.055
  168. INFO:SP-CT  football/_old   0.858   0.827   0.030
  169. INFO:SP-CT  football/_old   0.817   0.056
  170. INFO:SP-CT  karate  1.000   0.624   0.376
  171. INFO:SP-CT  karate  0.646   0.182
  172. INFO:SP-CT  news_2cl_1  0.654   0.576   0.078
  173. INFO:SP-CT  news_2cl_1  0.638   0.180
  174. INFO:SP-CT  news_2cl_2  0.516   0.524   -0.008
  175. INFO:SP-CT  news_2cl_2  0.522   0.007
  176. INFO:SP-CT  news_2cl_3  0.859   0.833   0.026
  177. INFO:SP-CT  news_2cl_3  0.825   0.018
  178. INFO:SP-CT  news_3cl_1  0.743   0.712   0.031
  179. INFO:SP-CT  news_3cl_1  0.737   0.077
  180. INFO:SP-CT  news_3cl_2  0.625   0.577   0.048
  181. INFO:SP-CT  news_3cl_2  0.626   0.107
  182. INFO:SP-CT  news_3cl_3  0.720   0.686   0.035
  183. INFO:SP-CT  news_3cl_3  0.713   0.083
  184. INFO:SP-CT  news_5cl_1  0.681   0.684   -0.002
  185. INFO:SP-CT  news_5cl_1  0.682   0.004
  186. INFO:SP-CT  news_5cl_2  0.597   0.569   0.028
  187. INFO:SP-CT  news_5cl_2  0.587   0.038
  188. INFO:SP-CT  news_5cl_3  0.480   0.457   0.023
  189. INFO:SP-CT  news_5cl_3  0.461   0.025
  190. Failure
  191. Traceback (most recent call last):
  192.   File "/usr/lib/python3.6/unittest/case.py", line 59, in testPartExecutor
  193.     yield
  194.   File "/usr/lib/python3.6/unittest/case.py", line 605, in run
  195.     testMethod()
  196.   File "/home/illusionww/Documents/GitHub/pygraphs/tests/article_comparison/test_sommer.py", line 113, in test_SP
  197.     self.dataset_results(SPCT_H, 1, 5)
  198.   File "/home/illusionww/Documents/GitHub/pygraphs/tests/article_comparison/test_sommer.py", line 119, in dataset_results
  199.     dist_compensation_strategy='+40')
  200.   File "/home/illusionww/Documents/GitHub/pygraphs/tests/article_comparison/test_sommer.py", line 95, in _dataset_results
  201.     result['true_nmi'], result['diff']))
  202.   File "/usr/lib/python3.6/unittest/case.py", line 682, in assertTrue
  203.     raise self.failureException(msg)
  204. AssertionError: False is not true : karate, SP-CT: 0.6243 != 1.0000, diff:0.3757
  205.  
  206. INFO:logFor football    0.903   0.867   0.036
  207. INFO:logFor football    0.870   0.047
  208. INFO:logFor football/_old   0.903   0.834   0.069
  209. INFO:logFor football/_old   0.838   0.040
  210. INFO:logFor karate  1.000   0.737   0.263
  211. INFO:logFor karate  0.837   0.303
  212. INFO:logFor news_2cl_1  0.838   0.659   0.179
  213. INFO:logFor news_2cl_1  0.807   0.294
  214. INFO:logFor news_2cl_2  0.584   0.422   0.162
  215. INFO:logFor news_2cl_2  0.581   0.266
  216. INFO:logFor news_2cl_3  0.748   0.568   0.180
  217. INFO:logFor news_2cl_3  0.751   0.320
  218. INFO:logFor news_3cl_1  0.753   0.569   0.184
  219. INFO:logFor news_3cl_1  0.550   0.127
  220. INFO:logFor news_3cl_2  0.758   0.625   0.134
  221. INFO:logFor news_3cl_2  0.570   0.090
  222. INFO:logFor news_3cl_3  0.749   0.536   0.213
  223. INFO:logFor news_3cl_3  0.533   0.124
  224. INFO:logFor news_5cl_1  0.614   0.474   0.140
  225. INFO:logFor news_5cl_1  0.516   0.151
  226. INFO:logFor news_5cl_2  0.598   0.477   0.120
  227. INFO:logFor news_5cl_2  0.470   0.079
  228.  
  229.  
  230. Ran 6 tests in 20062.713s
  231.  
  232. FAILED (failures=4)
  233. INFO:logFor news_5cl_3  0.573   0.501   0.072
  234. INFO:logFor news_5cl_3  0.501   0.059
  235. Failure
  236. Traceback (most recent call last):
  237.   File "/usr/lib/python3.6/unittest/case.py", line 59, in testPartExecutor
  238.     yield
  239.   File "/usr/lib/python3.6/unittest/case.py", line 605, in run
  240.     testMethod()
  241.   File "/home/illusionww/Documents/GitHub/pygraphs/tests/article_comparison/test_sommer.py", line 104, in test_logFor
  242.     self.dataset_results(logFor_H, 1, 2)
  243.   File "/home/illusionww/Documents/GitHub/pygraphs/tests/article_comparison/test_sommer.py", line 119, in dataset_results
  244.     dist_compensation_strategy='+40')
  245.   File "/home/illusionww/Documents/GitHub/pygraphs/tests/article_comparison/test_sommer.py", line 95, in _dataset_results
  246.     result['true_nmi'], result['diff']))
  247.   File "/usr/lib/python3.6/unittest/case.py", line 682, in assertTrue
  248.     raise self.failureException(msg)
  249. AssertionError: False is not true : karate, logFor: 0.7370 != 1.0000, diff:0.2630
  250.  
  251.  
  252. Assertion failed
RAW Paste Data
We use cookies for various purposes including analytics. By continuing to use Pastebin, you agree to our use of cookies as described in the Cookies Policy. OK, I Understand
 
Top