Guest User

Untitled

a guest
Jul 23rd, 2020
31
Never
Not a member of Pastebin yet? Sign Up, it unlocks many cool features!
  1. make: /usr/local/MATLAB/R2017b/bin/mexext: Command not found
  2. CXX src/caffe/blob.cpp
  3. In file included from ./include/caffe/util/device_alternate.hpp:40,
  4. from ./include/caffe/common.hpp:19,
  5. from ./include/caffe/blob.hpp:8,
  6. from src/caffe/blob.cpp:4:
  7. ./include/caffe/util/cudnn.hpp: In function ‘const char* cudnnGetErrorString(cudnnStatus_t)’:
  8. ./include/caffe/util/cudnn.hpp:21:10: warning: enumeration value ‘CUDNN_STATUS_RUNTIME_PREREQUISITE_MISSING’ not handled in switch [-Wswitch]
  9. 21 | switch (status) {
  10. | ^
  11. ./include/caffe/util/cudnn.hpp:21:10: warning: enumeration value ‘CUDNN_STATUS_RUNTIME_IN_PROGRESS’ not handled in switch [-Wswitch]
  12. ./include/caffe/util/cudnn.hpp:21:10: warning: enumeration value ‘CUDNN_STATUS_RUNTIME_FP_OVERFLOW’ not handled in switch [-Wswitch]
  13. ./include/caffe/util/cudnn.hpp:21:10: warning: enumeration value ‘CUDNN_STATUS_VERSION_MISMATCH’ not handled in switch [-Wswitch]
  14. ./include/caffe/util/cudnn.hpp: In function ‘void caffe::cudnn::setConvolutionDesc(cudnnConvolutionStruct**, cudnnTensorDescriptor_t, cudnnFilterDescriptor_t, int, int, int, int)’:
  15. ./include/caffe/util/cudnn.hpp:113:70: error: too few arguments to function ‘cudnnStatus_t cudnnSetConvolution2dDescriptor(cudnnConvolutionDescriptor_t, int, int, int, int, int, int, cudnnConvolutionMode_t, cudnnDataType_t)’
  16. 113 | pad_h, pad_w, stride_h, stride_w, 1, 1, CUDNN_CROSS_CORRELATION));
  17. | ^
  18. ./include/caffe/util/cudnn.hpp:15:28: note: in definition of macro ‘CUDNN_CHECK’
  19. 15 | cudnnStatus_t status = condition; \
  20. | ^~~~~~~~~
  21. In file included from /usr/include/cudnn.h:64,
  22. from ./include/caffe/util/cudnn.hpp:5,
  23. from ./include/caffe/util/device_alternate.hpp:40,
  24. from ./include/caffe/common.hpp:19,
  25. from ./include/caffe/blob.hpp:8,
  26. from src/caffe/blob.cpp:4:
  27. /usr/include/cudnn_cnn_infer.h:130:1: note: declared here
  28. 130 | cudnnSetConvolution2dDescriptor(cudnnConvolutionDescriptor_t convDesc,
  29. | ^~~~~~~~~~~~~~~~~~~~~~~~~~~~~~~
  30. make: *** [Makefile:576: .build_release/src/caffe/blob.o] Error 1
  31. (caffe) kam@kam:/media/kam/Main HDD/Documents/School/CP317/Project/ML/3Dpose_ssl/caffe-3dssl$ make all
  32. make: /usr/local/MATLAB/R2017b/bin/mexext: Command not found
  33. CXX src/caffe/blob.cpp
  34. In file included from ./include/caffe/util/device_alternate.hpp:40,
  35. from ./include/caffe/common.hpp:19,
  36. from ./include/caffe/blob.hpp:8,
  37. from src/caffe/blob.cpp:4:
  38. ./include/caffe/util/cudnn.hpp: In function ‘const char* cudnnGetErrorString(cudnnStatus_t)’:
  39. ./include/caffe/util/cudnn.hpp:21:10: warning: enumeration value ‘CUDNN_STATUS_RUNTIME_PREREQUISITE_MISSING’ not handled in switch [-Wswitch]
  40. 21 | switch (status) {
  41. | ^
  42. ./include/caffe/util/cudnn.hpp:21:10: warning: enumeration value ‘CUDNN_STATUS_RUNTIME_IN_PROGRESS’ not handled in switch [-Wswitch]
  43. ./include/caffe/util/cudnn.hpp:21:10: warning: enumeration value ‘CUDNN_STATUS_RUNTIME_FP_OVERFLOW’ not handled in switch [-Wswitch]
  44. ./include/caffe/util/cudnn.hpp:21:10: warning: enumeration value ‘CUDNN_STATUS_VERSION_MISMATCH’ not handled in switch [-Wswitch]
  45. ./include/caffe/util/cudnn.hpp: In function ‘void caffe::cudnn::setConvolutionDesc(cudnnConvolutionStruct**, cudnnTensorDescriptor_t, cudnnFilterDescriptor_t, int, int, int, int)’:
  46. ./include/caffe/util/cudnn.hpp:113:70: error: too few arguments to function ‘cudnnStatus_t cudnnSetConvolution2dDescriptor(cudnnConvolutionDescriptor_t, int, int, int, int, int, int, cudnnConvolutionMode_t, cudnnDataType_t)’
  47. 113 | pad_h, pad_w, stride_h, stride_w, 1, 1, CUDNN_CROSS_CORRELATION));
  48. | ^
  49. ./include/caffe/util/cudnn.hpp:15:28: note: in definition of macro ‘CUDNN_CHECK’
  50. 15 | cudnnStatus_t status = condition; \
  51. | ^~~~~~~~~
  52. In file included from /usr/include/cudnn.h:64,
  53. from ./include/caffe/util/cudnn.hpp:5,
  54. from ./include/caffe/util/device_alternate.hpp:40,
  55. from ./include/caffe/common.hpp:19,
  56. from ./include/caffe/blob.hpp:8,
  57. from src/caffe/blob.cpp:4:
  58. /usr/include/cudnn_cnn_infer.h:130:1: note: declared here
  59. 130 | cudnnSetConvolution2dDescriptor(cudnnConvolutionDescriptor_t convDesc,
  60. | ^~~~~~~~~~~~~~~~~~~~~~~~~~~~~~~
  61.  
RAW Paste Data