Kenjx

Jetty Run on OPENMRS platform 2.5.0-SNAPSHOT

Sep 24th, 2021 (edited)
134
0
Never
Not a member of Pastebin yet? Sign Up, it unlocks many cool features!
text 6.34 KB | None | 0 0
  1. Java HotSpot(TM) 64-Bit Server VM warning: Ignoring option MaxPermSize; support was removed in 8.0
  2. [INFO] Scanning for projects...
  3. [INFO]
  4. [INFO] -------------------< org.openmrs.web:openmrs-webapp >-------------------
  5. [INFO] Building openmrs-webapp 2.5.0-SNAPSHOT
  6. [INFO] --------------------------------[ war ]---------------------------------
  7. [INFO]
  8. [INFO] >>> jetty-maven-plugin:9.4.35.v20201120:run (default-cli) > test-compile @ openmrs-webapp >>>
  9. [INFO]
  10. [INFO] --- buildnumber-maven-plugin:1.4:create (default) @ openmrs-webapp ---
  11. [INFO] ShortRevision tag detected. The value is '6'.
  12. [INFO] Executing: cmd.exe /X /C "git rev-parse --verify --short=6 HEAD"
  13. [INFO] Working directory: E:\openmrs\code\openmrs-core\webapp
  14. [INFO] Storing buildNumber: dbec0f at timestamp: 1632521706270
  15. [INFO] Storing buildScmBranch: master
  16. [INFO]
  17. [INFO] --- build-helper-maven-plugin:3.2.0:parse-version (parse-version) @ openmrs-webapp ---
  18. [INFO]
  19. [INFO] --- maven-resources-plugin:3.2.0:resources (default-resources) @ openmrs-webapp ---
  20. [INFO] Using 'UTF-8' encoding to copy filtered resources.
  21. [INFO] Using 'UTF-8' encoding to copy filtered properties files.
  22. [INFO] Copying 2 resources
  23. [INFO] Copying 1 resource to ../jetty
  24. [INFO]
  25. [INFO] --- maven-antrun-plugin:3.0.0:run (default) @ openmrs-webapp ---
  26. [INFO] Executing tasks
  27. [INFO] [unzip] Expanding: E:\openmrs\code\openmrs-core\webapp\src\main\resources\liquibase-demo-data.zip into E:\ope
  28. nmrs\code\openmrs-core\webapp\target\classes
  29. [INFO] Executed tasks
  30. [INFO]
  31. [INFO] --- maven-compiler-plugin:3.8.1:compile (default-compile) @ openmrs-webapp ---
  32. [INFO] No sources to compile
  33. [INFO]
  34. [INFO] --- maven-resources-plugin:3.2.0:testResources (default-testResources) @ openmrs-webapp ---
  35. [INFO] Using 'UTF-8' encoding to copy filtered resources.
  36. [INFO] Using 'UTF-8' encoding to copy filtered properties files.
  37. [INFO] Copying 1 resource
  38. [INFO]
  39. [INFO] --- maven-compiler-plugin:3.8.1:testCompile (default-testCompile) @ openmrs-webapp ---
  40. [INFO] No sources to compile
  41. [INFO]
  42. [INFO] <<< jetty-maven-plugin:9.4.35.v20201120:run (default-cli) < test-compile @ openmrs-webapp <<<
  43. [INFO]
  44. [INFO]
  45. [INFO] --- jetty-maven-plugin:9.4.35.v20201120:run (default-cli) @ openmrs-webapp ---
  46. [INFO] Logging initialized @30025ms to org.eclipse.jetty.util.log.Slf4jLog
  47. [INFO] webAppSourceDirectory not set. Trying src\main\webapp
  48. [INFO] Reload Mechanic: automatic
  49. [INFO] nonBlocking:false
  50. [INFO] Classes = E:\openmrs\code\openmrs-core\webapp\target\classes
  51. [INFO] Configuring Jetty for project: openmrs-webapp
  52. [INFO] Context path = /openmrs
  53. [INFO] Tmp directory = E:\openmrs\code\openmrs-core\webapp\target\tmp
  54. [INFO] Web defaults = org/eclipse/jetty/webapp/webdefault.xml
  55. [INFO] Web overrides = src/test/resources/override-web.xml
  56. [INFO] web.xml file = E:\openmrs\code\openmrs-core\webapp\target/jetty/WEB-INF/web.xml
  57. [INFO] Webapp directory = E:\openmrs\code\openmrs-core\webapp\src\main\webapp
  58. [INFO] jetty-9.4.35.v20201120; built: 2020-11-20T21:17:03.964Z; git: bdc54f03a5e0a7e280fab27f55c3c75ee8da89fb; jvm 11.0.
  59. 7+8-LTS
  60. [INFO] Scanning elapsed time=328ms
  61. [INFO] No Spring WebApplicationInitializer types detected on classpath
  62. [INFO] DefaultSessionIdManager workerName=node0
  63. [INFO] No SessionScavenger set, using defaults
  64. [INFO] node0 Scavenging every 660000ms
  65. WARN - OpenmrsUtil.getRuntimePropertiesFilePathName(2128) |2021-09-25T01:15:26,073| Unable to find a runtime properties
  66. file at E:\openmrs\code\openmrs-core\webapp\openmrs-runtime.properties
  67. WARN - OpenmrsUtil.getRuntimePropertiesFilePathName(2156) |2021-09-25T01:15:26,202| Unable to find properties file: C:\U
  68. sers\JoelKiggwe_2\Application Data\OpenMRS\openmrs-runtime.properties
  69. WARN - OpenmrsUtil.getRuntimeProperties(2089) |2021-09-25T01:15:26,278| Unable to find a runtime properties file. Initia
  70. l setup is needed. View the webapp to run the setup wizard.
  71. WARN - OpenmrsUtil.getRuntimePropertiesFilePathName(2128) |2021-09-25T01:15:27,188| Unable to find a runtime properties
  72. file at E:\openmrs\code\openmrs-core\webapp\openmrs-runtime.properties
  73. WARN - OpenmrsUtil.getRuntimePropertiesFilePathName(2156) |2021-09-25T01:15:27,235| Unable to find properties file: C:\U
  74. sers\JoelKiggwe_2\Application Data\OpenMRS\openmrs-runtime.properties
  75. WARN - OpenmrsUtil.getRuntimeProperties(2089) |2021-09-25T01:15:27,277| Unable to find a runtime properties file. Initia
  76. l setup is needed. View the webapp to run the setup wizard.
  77. [INFO] Started o.e.j.m.p.JettyWebAppContext@d84b3a2{OpenMRS,/openmrs,file:///E:/openmrs/code/openmrs-core/webapp/src/mai
  78. n/webapp/,AVAILABLE}{file:///E:/openmrs/code/openmrs-core/webapp/src/main/webapp/}
  79. [INFO] Started ServerConnector@6bf28f61{HTTP/1.1, (http/1.1)}{0.0.0.0:8080}
  80. [INFO] Started @40280ms
  81. [INFO] Started Jetty Server
  82. [INFO] Jetty server exiting.
  83. [INFO] ------------------------------------------------------------------------
  84. [INFO] BUILD FAILURE
  85. [INFO] ------------------------------------------------------------------------
  86. [INFO] Total time: 35.465 s
  87. [INFO] Finished at: 2021-09-25T01:15:28+03:00
  88. [INFO] ------------------------------------------------------------------------
  89. [ERROR] Failed to execute goal org.eclipse.jetty:jetty-maven-plugin:9.4.35.v20201120:run (default-cli) on project openmr
  90. s-webapp: Failure: Error forming scan list: Not file or doesn't exist: E:\openmrs\code\openmrs-core\api\target\classes -
  91. > [Help 1]
  92. [ERROR]
  93. [ERROR] To see the full stack trace of the errors, re-run Maven with the -e switch.
  94. [ERROR] Re-run Maven using the -X switch to enable full debug logging.
  95. [ERROR]
  96. [ERROR] For more information about the errors and possible solutions, please read the following articles:
  97. [ERROR] [Help 1] http://cwiki.apache.org/confluence/display/MAVEN/MojoExecutionException
  98. [INFO] node0 Stopped scavenging
  99. ERROR - Context.getServiceContext(273) |2021-09-25T01:15:29,163| serviceContext is null. Creating new ServiceContext()
  100. WARN - LocaleUtility.getDefaultLocale(73) |2021-09-25T01:15:29,211| Unable to get locale global property value. Service
  101. not found: interface org.openmrs.api.AdministrationService
  102. [INFO] Stopped o.e.j.m.p.JettyWebAppContext@d84b3a2{OpenMRS,/openmrs,file:///E:/openmrs/code/openmrs-core/webapp/src/mai
  103. n/webapp/,STOPPED}{file:///E:/openmrs/code/openmrs-core/webapp/src/main/webapp/}
  104. [INFO] Stopped ServerConnector@6bf28f61{HTTP/1.1, (http/1.1)}{0.0.0.0:8080}
  105. [WARNING] java.nio.channels.ClosedSelectorException
Add Comment
Please, Sign In to add comment