Guest User

VirtualBox akmod build log

a guest
Sep 13th, 2018
44
Never
Not a member of Pastebin yet? Sign Up, it unlocks many cool features!
  1. 2018/09/13 11:20:08 akmods: Building RPM using the command '/sbin/akmodsbuild --target x86_64 --kernels 4.18.5-200.fc28.x86_64 /usr/src/akmods/VirtualBox-kmod.latest'
  2.                  from /tmp/akmodsbuild.XqKZWSnm/BUILD/VirtualBox-kmod-5.2.18/_kmod_build_4.18.5-200.fc28.x86_64/vboxsf/vfsmod.h:11,
  3.                  from /tmp/akmodsbuild.XqKZWSnm/BUILD/VirtualBox-kmod-5.2.18/_kmod_build_4.18.5-200.fc28.x86_64/vboxsf/utils.c:13:
  4. ./include/linux/time32.h:125:57: note: expected 'const struct timespec *' but argument is of type 'struct timespec64 *'
  5.  static inline s64 timespec_to_ns(const struct timespec *ts)
  6.                                   ~~~~~~~~~~~~~~~~~~~~~~~^~
  7. /tmp/akmodsbuild.XqKZWSnm/BUILD/VirtualBox-kmod-5.2.18/_kmod_build_4.18.5-200.fc28.x86_64/vboxsf/utils.c:248:25: error: passing argument 1 of 'timespec_to_ns' from incompatible pointer type [-Werror=incompatible-pointer-types]
  8.           timespec_to_ns(&iattr->ia_mtime);
  9.                          ^~~~~~~~~~~~~~~~
  10. In file included from ./include/linux/time.h:73,
  11.                  from ./include/linux/stat.h:19,
  12.                  from ./include/linux/fs.h:10,
  13.                  from ./include/linux/backing-dev.h:13,
  14.                  from /tmp/akmodsbuild.XqKZWSnm/BUILD/VirtualBox-kmod-5.2.18/_kmod_build_4.18.5-200.fc28.x86_64/vboxsf/vfsmod.h:11,
  15.                  from /tmp/akmodsbuild.XqKZWSnm/BUILD/VirtualBox-kmod-5.2.18/_kmod_build_4.18.5-200.fc28.x86_64/vboxsf/utils.c:13:
  16. ./include/linux/time32.h:125:57: note: expected 'const struct timespec *' but argument is of type 'struct timespec64 *'
  17.  static inline s64 timespec_to_ns(const struct timespec *ts)
  18.                                   ~~~~~~~~~~~~~~~~~~~~~~~^~
  19. cc1: some warnings being treated as errors
  20. make[1]: *** [scripts/Makefile.build:318: /tmp/akmodsbuild.XqKZWSnm/BUILD/VirtualBox-kmod-5.2.18/_kmod_build_4.18.5-200.fc28.x86_64/vboxsf/utils.o] Error 1
  21. make[1]: *** Waiting for unfinished jobs....
  22. make: *** [Makefile:1504: _module_/tmp/akmodsbuild.XqKZWSnm/BUILD/VirtualBox-kmod-5.2.18/_kmod_build_4.18.5-200.fc28.x86_64/vboxsf] Error 2
  23. make: Leaving directory '/usr/src/kernels/4.18.5-200.fc28.x86_64'
  24. error: Bad exit status from /var/tmp/rpm-tmp.zGw9Z5 (%build)
  25.  
  26.  
  27. RPM build errors:
  28.     user mockbuild does not exist - using root
  29.     group mockbuild does not exist - using root
  30.     user mockbuild does not exist - using root
  31.     group mockbuild does not exist - using root
  32.     user mockbuild does not exist - using root
  33.     group mockbuild does not exist - using root
  34.     user mockbuild does not exist - using root
  35.     group mockbuild does not exist - using root
  36.     Bad exit status from /var/tmp/rpm-tmp.zGw9Z5 (%build)
  37. 2018/09/13 11:20:19 akmodsbuild: * Rebuilding /usr/src/akmods/VirtualBox-kmod.latest for kernel(s) 4.18.5-200.fc28.x86_64: warning: user mockbuild does not exist - using root
  38. 2018/09/13 11:20:19 akmodsbuild: warning: group mockbuild does not exist - using root
  39. 2018/09/13 11:20:19 akmodsbuild: warning: user mockbuild does not exist - using root
  40. 2018/09/13 11:20:19 akmodsbuild: warning: group mockbuild does not exist - using root
  41. 2018/09/13 11:20:19 akmodsbuild: warning: user mockbuild does not exist - using root
  42. 2018/09/13 11:20:19 akmodsbuild: warning: group mockbuild does not exist - using root
  43. 2018/09/13 11:20:19 akmodsbuild: warning: user mockbuild does not exist - using root
  44. 2018/09/13 11:20:19 akmodsbuild: warning: group mockbuild does not exist - using root
  45. 2018/09/13 11:20:19 akmodsbuild: Installing /usr/src/akmods/VirtualBox-kmod.latest
  46. 2018/09/13 11:20:19 akmodsbuild: Building target platforms: x86_64
  47. 2018/09/13 11:20:19 akmodsbuild: Building for target x86_64
  48. 2018/09/13 11:20:19 akmodsbuild: Executing(%prep): /bin/sh -e /var/tmp/rpm-tmp.qGrfHI
  49. 2018/09/13 11:20:19 akmodsbuild: + umask 022
  50. 2018/09/13 11:20:19 akmodsbuild: + cd /tmp/akmodsbuild.XqKZWSnm//BUILD
  51. 2018/09/13 11:20:19 akmodsbuild: + cd /tmp/akmodsbuild.XqKZWSnm/BUILD
  52. 2018/09/13 11:20:19 akmodsbuild: + rm -rf VirtualBox-kmod-5.2.18
  53. 2018/09/13 11:20:19 akmodsbuild: + /usr/bin/mkdir -p VirtualBox-kmod-5.2.18
  54. 2018/09/13 11:20:19 akmodsbuild: + cd VirtualBox-kmod-5.2.18
  55. 2018/09/13 11:20:19 akmodsbuild: + /usr/bin/chmod -Rf a+rX,u+w,g-w,o-w .
  56. 2018/09/13 11:20:19 akmodsbuild: + tar --use-compress-program xz -xf /usr/share/VirtualBox-kmod-5.2.18/VirtualBox-kmod-5.2.18.tar.xz
  57. 2018/09/13 11:20:19 akmodsbuild: + pushd VirtualBox-kmod-5.2.18
  58. 2018/09/13 11:20:19 akmodsbuild: /tmp/akmodsbuild.XqKZWSnm/BUILD/VirtualBox-kmod-5.2.18/VirtualBox-kmod-5.2.18 /tmp/akmodsbuild.XqKZWSnm/BUILD/VirtualBox-kmod-5.2.18
  59. 2018/09/13 11:20:19 akmodsbuild: + echo 'Patch #1 (kernel-4.18.patch):'
  60. 2018/09/13 11:20:19 akmodsbuild: Patch #1 (kernel-4.18.patch):
  61. 2018/09/13 11:20:19 akmodsbuild: + /usr/bin/patch --no-backup-if-mismatch -p2 -b --suffix .kernel_4.18 --fuzz=0
  62. 2018/09/13 11:20:19 akmodsbuild: patching file vboxsf/utils.c
  63. 2018/09/13 11:20:19 akmodsbuild: + rm -rf vboxsf/
  64. 2018/09/13 11:20:19 akmodsbuild: + unzip /tmp/akmodsbuild.XqKZWSnm/SOURCES/master.zip
  65. 2018/09/13 11:20:19 akmodsbuild: Archive:  /tmp/akmodsbuild.XqKZWSnm/SOURCES/master.zip
  66. 2018/09/13 11:20:19 akmodsbuild: 6a782003ad95a383c8b19b570a532271f090ad35
  67. 2018/09/13 11:20:19 akmodsbuild: creating: vboxsf-master/
  68. 2018/09/13 11:20:19 akmodsbuild: inflating: vboxsf-master/Makefile
  69. 2018/09/13 11:20:19 akmodsbuild: inflating: vboxsf-master/dir.c
  70. 2018/09/13 11:20:19 akmodsbuild: inflating: vboxsf-master/file.c
  71. 2018/09/13 11:20:19 akmodsbuild: inflating: vboxsf-master/shfl_hostintf.h
  72. 2018/09/13 11:20:19 akmodsbuild: inflating: vboxsf-master/super.c
  73. 2018/09/13 11:20:19 akmodsbuild: inflating: vboxsf-master/utils.c
  74. 2018/09/13 11:20:19 akmodsbuild: inflating: vboxsf-master/vboxsf_wrappers.c
  75. 2018/09/13 11:20:19 akmodsbuild: inflating: vboxsf-master/vfsmod.h
  76. 2018/09/13 11:20:19 akmodsbuild: + mv vboxsf-master/ vboxsf/
  77. 2018/09/13 11:20:19 akmodsbuild: + popd
  78. 2018/09/13 11:20:19 akmodsbuild: /tmp/akmodsbuild.XqKZWSnm/BUILD/VirtualBox-kmod-5.2.18
  79. 2018/09/13 11:20:19 akmodsbuild: + kmodtool --target x86_64 --repo rpmfusion --kmodname VirtualBox-kmod --akmod --for-kernels 4.18.5-200.fc28.x86_64 --filterfile /tmp/akmodsbuild.XqKZWSnm/SOURCES/VirtualBox-kmod-excludekernel-filter.txt
  80. 2018/09/13 11:20:19 akmodsbuild: %global  _prefix_usr      /usr
  81. 2018/09/13 11:20:19 akmodsbuild:
  82. 2018/09/13 11:20:19 akmodsbuild: %if 0%{?rhel}
  83. 2018/09/13 11:20:19 akmodsbuild: %package       -n kmod-VirtualBox
  84. 2018/09/13 11:20:19 akmodsbuild: Summary:          VirtualBox kernel module(s) for 4.18.5-200.fc28
  85. 2018/09/13 11:20:19 akmodsbuild: Provides:         kernel-modules = 4.18.5-200.fc28.x86_64
  86. 2018/09/13 11:20:19 akmodsbuild: Provides:         VirtualBox-kmod = %{?epoch:%{epoch}:}%{version}-%{release}
  87. 2018/09/13 11:20:19 akmodsbuild: Requires:         VirtualBox-kmod-common >= %{?epoch:%{epoch}:}%{version}
  88. 2018/09/13 11:20:19 akmodsbuild: Requires(post):   %{?_prefix_usr}/sbin/weak-modules
  89. 2018/09/13 11:20:19 akmodsbuild: Requires(post):   %{?_prefix_usr}/sbin/depmod
  90. 2018/09/13 11:20:19 akmodsbuild: Requires(postun): %{?_prefix_usr}/sbin/weak-modules
  91. 2018/09/13 11:20:19 akmodsbuild: Requires(postun): %{?_prefix_usr}/sbin/depmod
  92. 2018/09/13 11:20:19 akmodsbuild: %else
  93. 2018/09/13 11:20:19 akmodsbuild: %package       -n kmod-VirtualBox-4.18.5-200.fc28.x86_64
  94. 2018/09/13 11:20:19 akmodsbuild: Summary:          VirtualBox kernel module(s) for 4.18.5-200.fc28.x86_64
  95. 2018/09/13 11:20:19 akmodsbuild: Provides:         kernel-modules-for-kernel = 4.18.5-200.fc28.x86_64
  96. 2018/09/13 11:20:19 akmodsbuild: Provides:         VirtualBox-kmod = %{?epoch:%{epoch}:}%{version}-%{release}
  97. 2018/09/13 11:20:19 akmodsbuild: Requires:         VirtualBox-kmod-common >= %{?epoch:%{epoch}:}%{version}
  98. 2018/09/13 11:20:19 akmodsbuild: Requires(post):   %{?_prefix_usr}/sbin/depmod
  99. 2018/09/13 11:20:19 akmodsbuild: Requires(postun): %{?_prefix_usr}/sbin/depmod
  100. 2018/09/13 11:20:19 akmodsbuild: %endif
  101. 2018/09/13 11:20:19 akmodsbuild:
  102. 2018/09/13 11:20:19 akmodsbuild: %if 0%{?rhel}
  103. 2018/09/13 11:20:19 akmodsbuild: Requires:         kernel >= 4.18.5-200.fc28
  104. 2018/09/13 11:20:19 akmodsbuild: Requires:         kernel < 4.18.5-201.fc28
  105. 2018/09/13 11:20:19 akmodsbuild: BuildRequires:    kernel-devel = 4.18.5-200.fc28 redhat-rpm-config kernel-abi-whitelists
  106. 2018/09/13 11:20:19 akmodsbuild:
  107. 2018/09/13 11:20:19 akmodsbuild: %post          -n kmod-VirtualBox
  108. 2018/09/13 11:20:19 akmodsbuild: %{?_prefix_usr}/sbin/depmod -aeF /boot/System.map-4.18.5-200.fc28.x86_64 4.18.5-200.fc28.x86_64 > /dev/null || :
  109. 2018/09/13 11:20:19 akmodsbuild:
  110. 2018/09/13 11:20:19 akmodsbuild: modules=( $(find /usr/lib/modules/4.18.5-200.fc28.x86_64/extra/VirtualBox/ | grep -e '.ko$') )
  111. 2018/09/13 11:20:19 akmodsbuild: printf '%sn' "${modules[@]}" | %{?_prefix_usr}/sbin/weak-modules --add-modules
  112. 2018/09/13 11:20:19 akmodsbuild:
  113. 2018/09/13 11:20:19 akmodsbuild: %preun         -n kmod-VirtualBox
  114. 2018/09/13 11:20:19 akmodsbuild: rpm -ql kmod-VirtualBox-%{version}-%{release}.x86_64 | grep -e '.ko$' > /var/run/rpm-kmod-VirtualBox-modules
  115. 2018/09/13 11:20:19 akmodsbuild:
  116. 2018/09/13 11:20:19 akmodsbuild: %postun        -n kmod-VirtualBox
  117. 2018/09/13 11:20:19 akmodsbuild: %{?_prefix_usr}/sbin/depmod -aeF /boot/System.map-4.18.5-200.fc28.x86_64 4.18.5-200.fc28.x86_64 &> /dev/null || :
  118. 2018/09/13 11:20:19 akmodsbuild:
  119. 2018/09/13 11:20:19 akmodsbuild: modules=( $(cat /var/run/rpm-kmod-VirtualBox-modules) )
  120. 2018/09/13 11:20:19 akmodsbuild: rm /var/run/rpm-kmod-VirtualBox-modules
  121. 2018/09/13 11:20:19 akmodsbuild: printf '%sn' "${modules[@]}" | %{?_prefix_usr}/sbin/weak-modules --remove-modules
  122. 2018/09/13 11:20:19 akmodsbuild: %else
  123. 2018/09/13 11:20:19 akmodsbuild: Requires:         kernel-uname-r = 4.18.5-200.fc28.x86_64
  124. 2018/09/13 11:20:19 akmodsbuild: BuildRequires:    kernel-devel-uname-r = 4.18.5-200.fc28.x86_64
  125. 2018/09/13 11:20:19 akmodsbuild: %post          -n kmod-VirtualBox-4.18.5-200.fc28.x86_64
  126. 2018/09/13 11:20:19 akmodsbuild: %{?_prefix_usr}/sbin/depmod -aeF /boot/System.map-4.18.5-200.fc28.x86_64 4.18.5-200.fc28.x86_64 > /dev/null || :
  127. 2018/09/13 11:20:19 akmodsbuild: %postun        -n kmod-VirtualBox-4.18.5-200.fc28.x86_64
  128. 2018/09/13 11:20:19 akmodsbuild: %{?_prefix_usr}/sbin/depmod -aeF /boot/System.map-4.18.5-200.fc28.x86_64 4.18.5-200.fc28.x86_64 &> /dev/null || :
  129. 2018/09/13 11:20:19 akmodsbuild: %endif
  130. 2018/09/13 11:20:19 akmodsbuild:
  131. 2018/09/13 11:20:19 akmodsbuild: %if 0%{?rhel}
  132. 2018/09/13 11:20:19 akmodsbuild: %description   -n kmod-VirtualBox
  133. 2018/09/13 11:20:19 akmodsbuild: This package provides the VirtualBox kernel modules built for the Linux
  134. 2018/09/13 11:20:19 akmodsbuild: kernel 4.18.5-200.fc28 for the %{_target_cpu} family of processors.
  135. 2018/09/13 11:20:19 akmodsbuild: %files         -n kmod-VirtualBox
  136. 2018/09/13 11:20:19 akmodsbuild: %defattr(644,root,root,755)
  137. 2018/09/13 11:20:19 akmodsbuild: %dir /usr/lib/modules/4.18.5-200.fc28.x86_64/extra
  138. 2018/09/13 11:20:19 akmodsbuild: /usr/lib/modules/4.18.5-200.fc28.x86_64/extra/VirtualBox/
  139. 2018/09/13 11:20:19 akmodsbuild: %else
  140. 2018/09/13 11:20:19 akmodsbuild: %description   -n kmod-VirtualBox-4.18.5-200.fc28.x86_64
  141. 2018/09/13 11:20:19 akmodsbuild: This package provides the VirtualBox kernel modules built for the Linux
  142. 2018/09/13 11:20:19 akmodsbuild: kernel 4.18.5-200.fc28.x86_64 for the %{_target_cpu} family of processors.
  143. 2018/09/13 11:20:19 akmodsbuild: %files         -n kmod-VirtualBox-4.18.5-200.fc28.x86_64
  144. 2018/09/13 11:20:19 akmodsbuild: %defattr(644,root,root,755)
  145. 2018/09/13 11:20:19 akmodsbuild: %dir /usr/lib/modules/4.18.5-200.fc28.x86_64/extra
  146. 2018/09/13 11:20:19 akmodsbuild: /usr/lib/modules/4.18.5-200.fc28.x86_64/extra/VirtualBox/
  147. 2018/09/13 11:20:19 akmodsbuild: %endif
  148. 2018/09/13 11:20:19 akmodsbuild:
  149. 2018/09/13 11:20:19 akmodsbuild: %global kmodinstdir_prefix  /usr/lib/modules/
  150. 2018/09/13 11:20:19 akmodsbuild: %global kmodinstdir_postfix /extra/VirtualBox/
  151. 2018/09/13 11:20:19 akmodsbuild: %global kernel_versions     4.18.5-200.fc28.x86_64___%{_usrsrc}/kernels/4.18.5-200.fc28.x86_64
  152. 2018/09/13 11:20:19 akmodsbuild: %global debug_package %{nil}
  153. 2018/09/13 11:20:19 akmodsbuild:
  154. 2018/09/13 11:20:19 akmodsbuild: + for kernel_version in 4.18.5-200.fc28.x86_64___/usr/src/kernels/4.18.5-200.fc28.x86_64
  155. 2018/09/13 11:20:19 akmodsbuild: + cp -al VirtualBox-kmod-5.2.18 _kmod_build_4.18.5-200.fc28.x86_64
  156. 2018/09/13 11:20:19 akmodsbuild: + exit 0
  157. 2018/09/13 11:20:19 akmodsbuild: Executing(%build): /bin/sh -e /var/tmp/rpm-tmp.zGw9Z5
  158. 2018/09/13 11:20:19 akmodsbuild: + umask 022
  159. 2018/09/13 11:20:19 akmodsbuild: + cd /tmp/akmodsbuild.XqKZWSnm//BUILD
  160. 2018/09/13 11:20:19 akmodsbuild: + cd VirtualBox-kmod-5.2.18
  161. 2018/09/13 11:20:19 akmodsbuild: + for kernel_version in 4.18.5-200.fc28.x86_64___/usr/src/kernels/4.18.5-200.fc28.x86_64
  162. 2018/09/13 11:20:19 akmodsbuild: + for module in vboxdrv
  163. 2018/09/13 11:20:19 akmodsbuild: + make VBOX_USE_INSERT_PAGE=1 -j8 KERN_DIR=/usr/src/kernels/4.18.5-200.fc28.x86_64 -C /usr/src/kernels/4.18.5-200.fc28.x86_64 SUBDIRS=/tmp/akmodsbuild.XqKZWSnm/BUILD/VirtualBox-kmod-5.2.18/_kmod_build_4.18.5-200.fc28.x86_64/vboxdrv modules
  164. 2018/09/13 11:20:19 akmodsbuild: make: Entering directory '/usr/src/kernels/4.18.5-200.fc28.x86_64''/usr/src/kernels/4.18.5-200.fc28.x86_64'
  165. 2018/09/13 11:20:19 akmodsbuild: + cp _kmod_build_4.18.5-200.fc28.x86_64/vboxdrv/Module.symvers _kmod_build_4.18.5-200.fc28.x86_64/vboxnetadp
  166. 2018/09/13 11:20:19 akmodsbuild: + cp _kmod_build_4.18.5-200.fc28.x86_64/vboxdrv/Module.symvers _kmod_build_4.18.5-200.fc28.x86_64/vboxnetflt
  167. 2018/09/13 11:20:19 akmodsbuild: + for module in vbox{netadp,netflt,sf,pci}
  168. 2018/09/13 11:20:19 akmodsbuild: + make VBOX_USE_INSERT_PAGE=1 -j8 KERN_DIR=/usr/src/kernels/4.18.5-200.fc28.x86_64 -C /usr/src/kernels/4.18.5-200.fc28.x86_64 SUBDIRS=/tmp/akmodsbuild.XqKZWSnm/BUILD/VirtualBox-kmod-5.2.18/_kmod_build_4.18.5-200.fc28.x86_64/vboxnetadp modules
  169. 2018/09/13 11:20:19 akmodsbuild: make: Entering directory '/usr/src/kernels/4.18.5-200.fc28.x86_64'
  170. 2018/09/13 11:20:19 akmodsbuild: CC [M]  /tmp/akmodsbuild.XqKZWSnm/BUILD/VirtualBox-kmod-5.2.18/_kmod_build_4.18.5-200.fc28.x86_64/vboxnetadp/linux/VBoxNetAdp-linux.o
  171. 2018/09/13 11:20:19 akmodsbuild: CC [M]  /tmp/akmodsbuild.XqKZWSnm/BUILD/VirtualBox-kmod-5.2.18/_kmod_build_4.18.5-200.fc28.x86_64/vboxnetadp/VBoxNetAdp.o
  172. 2018/09/13 11:20:19 akmodsbuild: LD [M]  /tmp/akmodsbuild.XqKZWSnm/BUILD/VirtualBox-kmod-5.2.18/_kmod_build_4.18.5-200.fc28.x86_64/vboxnetadp/vboxnetadp.o
  173. 2018/09/13 11:20:19 akmodsbuild: Building modules, stage 2.
  174. 2018/09/13 11:20:19 akmodsbuild: MODPOST 1 modules
  175. 2018/09/13 11:20:19 akmodsbuild: CC      /tmp/akmodsbuild.XqKZWSnm/BUILD/VirtualBox-kmod-5.2.18/_kmod_build_4.18.5-200.fc28.x86_64/vboxnetadp/vboxnetadp.mod.o
  176. 2018/09/13 11:20:19 akmodsbuild: LD [M]  /tmp/akmodsbuild.XqKZWSnm/BUILD/VirtualBox-kmod-5.2.18/_kmod_build_4.18.5-200.fc28.x86_64/vboxnetadp/vboxnetadp.ko
  177. 2018/09/13 11:20:19 akmodsbuild: make: Leaving directory '/usr/src/kernels/4.18.5-200.fc28.x86_64'
  178. 2018/09/13 11:20:19 akmodsbuild: + for module in vbox{netadp,netflt,sf,pci}
  179. 2018/09/13 11:20:19 akmodsbuild: + make VBOX_USE_INSERT_PAGE=1 -j8 KERN_DIR=/usr/src/kernels/4.18.5-200.fc28.x86_64 -C /usr/src/kernels/4.18.5-200.fc28.x86_64 SUBDIRS=/tmp/akmodsbuild.XqKZWSnm/BUILD/VirtualBox-kmod-5.2.18/_kmod_build_4.18.5-200.fc28.x86_64/vboxnetflt modules
  180. 2018/09/13 11:20:19 akmodsbuild: make: Entering directory '/usr/src/kernels/4.18.5-200.fc28.x86_64'
  181. 2018/09/13 11:20:19 akmodsbuild: CC [M]  /tmp/akmodsbuild.XqKZWSnm/BUILD/VirtualBox-kmod-5.2.18/_kmod_build_4.18.5-200.fc28.x86_64/vboxnetflt/linux/VBoxNetFlt-linux.o
  182. 2018/09/13 11:20:19 akmodsbuild: CC [M]  /tmp/akmodsbuild.XqKZWSnm/BUILD/VirtualBox-kmod-5.2.18/_kmod_build_4.18.5-200.fc28.x86_64/vboxnetflt/VBoxNetFlt.o
  183. 2018/09/13 11:20:19 akmodsbuild: CC [M]  /tmp/akmodsbuild.XqKZWSnm/BUILD/VirtualBox-kmod-5.2.18/_kmod_build_4.18.5-200.fc28.x86_64/vboxnetflt/SUPR0IdcClient.o
  184. 2018/09/13 11:20:19 akmodsbuild: CC [M]  /tmp/akmodsbuild.XqKZWSnm/BUILD/VirtualBox-kmod-5.2.18/_kmod_build_4.18.5-200.fc28.x86_64/vboxnetflt/SUPR0IdcClientComponent.o
  185. 2018/09/13 11:20:19 akmodsbuild: CC [M]  /tmp/akmodsbuild.XqKZWSnm/BUILD/VirtualBox-kmod-5.2.18/_kmod_build_4.18.5-200.fc28.x86_64/vboxnetflt/linux/SUPR0IdcClient-linux.o
  186. 2018/09/13 11:20:19 akmodsbuild: LD [M]  /tmp/akmodsbuild.XqKZWSnm/BUILD/VirtualBox-kmod-5.2.18/_kmod_build_4.18.5-200.fc28.x86_64/vboxnetflt/vboxnetflt.o
  187. 2018/09/13 11:20:19 akmodsbuild: Building modules, stage 2.
  188. 2018/09/13 11:20:19 akmodsbuild: MODPOST 1 modules
  189. 2018/09/13 11:20:19 akmodsbuild: CC      /tmp/akmodsbuild.XqKZWSnm/BUILD/VirtualBox-kmod-5.2.18/_kmod_build_4.18.5-200.fc28.x86_64/vboxnetflt/vboxnetflt.mod.o
  190. 2018/09/13 11:20:19 akmodsbuild: LD [M]  /tmp/akmodsbuild.XqKZWSnm/BUILD/VirtualBox-kmod-5.2.18/_kmod_build_4.18.5-200.fc28.x86_64/vboxnetflt/vboxnetflt.ko
  191. 2018/09/13 11:20:19 akmodsbuild: make: Leaving directory '/usr/src/kernels/4.18.5-200.fc28.x86_64'
  192. 2018/09/13 11:20:19 akmodsbuild: + for module in vbox{netadp,netflt,sf,pci}
  193. 2018/09/13 11:20:19 akmodsbuild: + make VBOX_USE_INSERT_PAGE=1 -j8 KERN_DIR=/usr/src/kernels/4.18.5-200.fc28.x86_64 -C /usr/src/kernels/4.18.5-200.fc28.x86_64 SUBDIRS=/tmp/akmodsbuild.XqKZWSnm/BUILD/VirtualBox-kmod-5.2.18/_kmod_build_4.18.5-200.fc28.x86_64/vboxsf modules
  194. 2018/09/13 11:20:19 akmodsbuild: make: Entering directory '/usr/src/kernels/4.18.5-200.fc28.x86_64'
  195. 2018/09/13 11:20:19 akmodsbuild: CC [M]  /tmp/akmodsbuild.XqKZWSnm/BUILD/VirtualBox-kmod-5.2.18/_kmod_build_4.18.5-200.fc28.x86_64/vboxsf/dir.o
  196. 2018/09/13 11:20:19 akmodsbuild: CC [M]  /tmp/akmodsbuild.XqKZWSnm/BUILD/VirtualBox-kmod-5.2.18/_kmod_build_4.18.5-200.fc28.x86_64/vboxsf/file.o
  197. 2018/09/13 11:20:19 akmodsbuild: CC [M]  /tmp/akmodsbuild.XqKZWSnm/BUILD/VirtualBox-kmod-5.2.18/_kmod_build_4.18.5-200.fc28.x86_64/vboxsf/utils.o
  198. 2018/09/13 11:20:19 akmodsbuild: CC [M]  /tmp/akmodsbuild.XqKZWSnm/BUILD/VirtualBox-kmod-5.2.18/_kmod_build_4.18.5-200.fc28.x86_64/vboxsf/vboxsf_wrappers.o
  199. 2018/09/13 11:20:19 akmodsbuild: CC [M]  /tmp/akmodsbuild.XqKZWSnm/BUILD/VirtualBox-kmod-5.2.18/_kmod_build_4.18.5-200.fc28.x86_64/vboxsf/super.o
  200. 2018/09/13 11:20:19 akmodsbuild: /tmp/akmodsbuild.XqKZWSnm/BUILD/VirtualBox-kmod-5.2.18/_kmod_build_4.18.5-200.fc28.x86_64/vboxsf/utils.c: In function 'vboxsf_init_inode':
  201. 2018/09/13 11:20:19 akmodsbuild: /tmp/akmodsbuild.XqKZWSnm/BUILD/VirtualBox-kmod-5.2.18/_kmod_build_4.18.5-200.fc28.x86_64/vboxsf/utils.c:81:17: error: incompatible types when assigning to type 'struct timespec64' from type 'struct timespec'
  202. 2018/09/13 11:20:19 akmodsbuild: inode->i_atime = ns_to_timespec(
  203. 2018/09/13 11:20:19 akmodsbuild: ^
  204. 2018/09/13 11:20:19 akmodsbuild: /tmp/akmodsbuild.XqKZWSnm/BUILD/VirtualBox-kmod-5.2.18/_kmod_build_4.18.5-200.fc28.x86_64/vboxsf/utils.c:83:17: error: incompatible types when assigning to type 'struct timespec64' from type 'struct timespec'
  205. 2018/09/13 11:20:19 akmodsbuild: inode->i_ctime = ns_to_timespec(
  206. 2018/09/13 11:20:19 akmodsbuild: ^
  207. 2018/09/13 11:20:19 akmodsbuild: /tmp/akmodsbuild.XqKZWSnm/BUILD/VirtualBox-kmod-5.2.18/_kmod_build_4.18.5-200.fc28.x86_64/vboxsf/utils.c:85:17: error: incompatible types when assigning to type 'struct timespec64' from type 'struct timespec'
  208. 2018/09/13 11:20:19 akmodsbuild: inode->i_mtime = ns_to_timespec(
  209. 2018/09/13 11:20:19 akmodsbuild: ^
  210. 2018/09/13 11:20:19 akmodsbuild: /tmp/akmodsbuild.XqKZWSnm/BUILD/VirtualBox-kmod-5.2.18/_kmod_build_4.18.5-200.fc28.x86_64/vboxsf/utils.c: In function 'vboxsf_inode_revalidate':
  211. 2018/09/13 11:20:19 akmodsbuild: /tmp/akmodsbuild.XqKZWSnm/BUILD/VirtualBox-kmod-5.2.18/_kmod_build_4.18.5-200.fc28.x86_64/vboxsf/utils.c:156:13: error: incompatible types when assigning to type 'struct timespec' from type 'struct timespec64'
  212. 2018/09/13 11:20:19 akmodsbuild: prev_mtime = inode->i_mtime;
  213. 2018/09/13 11:20:19 akmodsbuild: ^
  214. 2018/09/13 11:20:19 akmodsbuild: /tmp/akmodsbuild.XqKZWSnm/BUILD/VirtualBox-kmod-5.2.18/_kmod_build_4.18.5-200.fc28.x86_64/vboxsf/utils.c:176:23: error: passing argument 1 of 'timespec_compare' from incompatible pointer type [-Werror=incompatible-pointer-types]
  215. 2018/09/13 11:20:19 akmodsbuild: if (timespec_compare(&inode->i_mtime, &prev_mtime) > 0)
  216. 2018/09/13 11:20:19 akmodsbuild: ^~~~~~~~~~~~~~~
  217. 2018/09/13 11:20:19 akmodsbuild: In file included from ./include/linux/time.h:73,
  218. 2018/09/13 11:20:19 akmodsbuild: from ./include/linux/stat.h:19,
  219. 2018/09/13 11:20:19 akmodsbuild: from ./include/linux/fs.h:10,
  220. 2018/09/13 11:20:19 akmodsbuild: from ./include/linux/backing-dev.h:13,
  221. 2018/09/13 11:20:19 akmodsbuild: from /tmp/akmodsbuild.XqKZWSnm/BUILD/VirtualBox-kmod-5.2.18/_kmod_build_4.18.5-200.fc28.x86_64/vboxsf/vfsmod.h:11,
  222. 2018/09/13 11:20:19 akmodsbuild: from /tmp/akmodsbuild.XqKZWSnm/BUILD/VirtualBox-kmod-5.2.18/_kmod_build_4.18.5-200.fc28.x86_64/vboxsf/utils.c:13:
  223. 2018/09/13 11:20:19 akmodsbuild: ./include/linux/time32.h:60:59: note: expected 'const struct timespec *' but argument is of type 'struct timespec64 *'
  224. 2018/09/13 11:20:19 akmodsbuild: static inline int timespec_compare(const struct timespec *lhs, const struct timespec *rhs)
  225. 2018/09/13 11:20:19 akmodsbuild: ~~~~~~~~~~~~~~~~~~~~~~~^~~
  226. 2018/09/13 11:20:19 akmodsbuild: /tmp/akmodsbuild.XqKZWSnm/BUILD/VirtualBox-kmod-5.2.18/_kmod_build_4.18.5-200.fc28.x86_64/vboxsf/utils.c: In function 'vboxsf_setattr':
  227. 2018/09/13 11:20:19 akmodsbuild: /tmp/akmodsbuild.XqKZWSnm/BUILD/VirtualBox-kmod-5.2.18/_kmod_build_4.18.5-200.fc28.x86_64/vboxsf/utils.c:244:25: error: passing argument 1 of 'timespec_to_ns' from incompatible pointer type [-Werror=incompatible-pointer-types]
  228. 2018/09/13 11:20:19 akmodsbuild: timespec_to_ns(&iattr->ia_atime);
  229. 2018/09/13 11:20:19 akmodsbuild: ^~~~~~~~~~~~~~~~
  230. 2018/09/13 11:20:19 akmodsbuild: In file included from ./include/linux/time.h:73,
  231. 2018/09/13 11:20:19 akmodsbuild: from ./include/linux/stat.h:19,
  232. 2018/09/13 11:20:19 akmodsbuild: from ./include/linux/fs.h:10,
  233. 2018/09/13 11:20:19 akmodsbuild: from ./include/linux/backing-dev.h:13,
  234. 2018/09/13 11:20:19 akmodsbuild: from /tmp/akmodsbuild.XqKZWSnm/BUILD/VirtualBox-kmod-5.2.18/_kmod_build_4.18.5-200.fc28.x86_64/vboxsf/vfsmod.h:11,
  235. 2018/09/13 11:20:19 akmodsbuild: from /tmp/akmodsbuild.XqKZWSnm/BUILD/VirtualBox-kmod-5.2.18/_kmod_build_4.18.5-200.fc28.x86_64/vboxsf/utils.c:13:
  236. 2018/09/13 11:20:19 akmodsbuild: ./include/linux/time32.h:125:57: note: expected 'const struct timespec *' but argument is of type 'struct timespec64 *'
  237. 2018/09/13 11:20:19 akmodsbuild: static inline s64 timespec_to_ns(const struct timespec *ts)
  238. 2018/09/13 11:20:19 akmodsbuild: ~~~~~~~~~~~~~~~~~~~~~~~^~
  239. 2018/09/13 11:20:19 akmodsbuild: /tmp/akmodsbuild.XqKZWSnm/BUILD/VirtualBox-kmod-5.2.18/_kmod_build_4.18.5-200.fc28.x86_64/vboxsf/utils.c:248:25: error: passing argument 1 of 'timespec_to_ns' from incompatible pointer type [-Werror=incompatible-pointer-types]
  240. 2018/09/13 11:20:19 akmodsbuild: timespec_to_ns(&iattr->ia_mtime);
  241. 2018/09/13 11:20:19 akmodsbuild: ^~~~~~~~~~~~~~~~
  242. 2018/09/13 11:20:19 akmodsbuild: In file included from ./include/linux/time.h:73,
  243. 2018/09/13 11:20:19 akmodsbuild: from ./include/linux/stat.h:19,
  244. 2018/09/13 11:20:19 akmodsbuild: from ./include/linux/fs.h:10,
  245. 2018/09/13 11:20:19 akmodsbuild: from ./include/linux/backing-dev.h:13,
  246. 2018/09/13 11:20:19 akmodsbuild: from /tmp/akmodsbuild.XqKZWSnm/BUILD/VirtualBox-kmod-5.2.18/_kmod_build_4.18.5-200.fc28.x86_64/vboxsf/vfsmod.h:11,
  247. 2018/09/13 11:20:19 akmodsbuild: from /tmp/akmodsbuild.XqKZWSnm/BUILD/VirtualBox-kmod-5.2.18/_kmod_build_4.18.5-200.fc28.x86_64/vboxsf/utils.c:13:
  248. 2018/09/13 11:20:19 akmodsbuild: ./include/linux/time32.h:125:57: note: expected 'const struct timespec *' but argument is of type 'struct timespec64 *'
  249. 2018/09/13 11:20:19 akmodsbuild: static inline s64 timespec_to_ns(const struct timespec *ts)
  250. 2018/09/13 11:20:19 akmodsbuild: ~~~~~~~~~~~~~~~~~~~~~~~^~
  251. 2018/09/13 11:20:19 akmodsbuild: cc1: some warnings being treated as errors
  252. 2018/09/13 11:20:19 akmodsbuild: make[1]: *** [scripts/Makefile.build:318: /tmp/akmodsbuild.XqKZWSnm/BUILD/VirtualBox-kmod-5.2.18/_kmod_build_4.18.5-200.fc28.x86_64/vboxsf/utils.o] Error 1
  253. 2018/09/13 11:20:19 akmodsbuild: make[1]: *** Waiting for unfinished jobs....
  254. 2018/09/13 11:20:19 akmodsbuild: make: *** [Makefile:1504: _module_/tmp/akmodsbuild.XqKZWSnm/BUILD/VirtualBox-kmod-5.2.18/_kmod_build_4.18.5-200.fc28.x86_64/vboxsf] Error 2
  255. 2018/09/13 11:20:19 akmodsbuild: make: Leaving directory '/usr/src/kernels/4.18.5-200.fc28.x86_64'
  256. 2018/09/13 11:20:19 akmodsbuild: error: Bad exit status from /var/tmp/rpm-tmp.zGw9Z5 (%build)
  257. 2018/09/13 11:20:19 akmodsbuild:
  258. 2018/09/13 11:20:19 akmodsbuild:
  259. 2018/09/13 11:20:19 akmodsbuild: RPM build errors:
  260. 2018/09/13 11:20:19 akmodsbuild: user mockbuild does not exist - using root
  261. 2018/09/13 11:20:19 akmodsbuild: group mockbuild does not exist - using root
  262. 2018/09/13 11:20:19 akmodsbuild: user mockbuild does not exist - using root
  263. 2018/09/13 11:20:19 akmodsbuild: group mockbuild does not exist - using root
  264. 2018/09/13 11:20:19 akmodsbuild: user mockbuild does not exist - using root
  265. 2018/09/13 11:20:19 akmodsbuild: group mockbuild does not exist - using root
  266. 2018/09/13 11:20:19 akmodsbuild: user mockbuild does not exist - using root
  267. 2018/09/13 11:20:19 akmodsbuild: group mockbuild does not exist - using root
  268. 2018/09/13 11:20:19 akmodsbuild: Bad exit status from /var/tmp/rpm-tmp.zGw9Z5 (%build)
  269. 2018/09/13 11:20:19 akmodsbuild:
  270. 2018/09/13 11:20:19 akmods: Building rpms failed; see /var/cache/akmods/VirtualBox/5.2.18-2-for-4.18.5-200.fc28.x86_64.failed.log for details
RAW Paste Data