Guest User

Untitled

a guest
Feb 4th, 2020
120
Never
Not a member of Pastebin yet? Sign Up, it unlocks many cool features!
  1. [ 0.000000] sec_dbg_setup: str=@0x3ff00008
  2. [ 0.000000] sec_dbg_setup: secdbg_paddr = 0x3ff00008
  3. [ 0.000000] sec_dbg_setup: secdbg_size = 0x80000
  4. [ 0.004909] set_dload_mode <0> ( c0e0d928 )
  5. [ 0.004933] set_dload_mode <1> ( c0e0d934 )
  6. [ 0.049347] sec_debug_init: restart_reason_ddr_address : 0x0
  7. [ 0.049378] sec_debug_init: enable=0
  8. [ 0.049397] sec_debug_init:__raw_readl restart_reason=0
  9. [ 0.049420] sec_debug_init: restart_reason : 0xfa00a65c
  10. [ 0.201733] qup_i2c f9924000.i2c: Missing 'qcom,master-id' DT entry
  11. [ 0.203135] qup_i2c f9926000.i2c: Missing 'qcom,i2c-src-freq' DT entry
  12. [ 0.210225] AXI: msm_bus_fabric_init_driver(): msm_bus_fabric_init_driver
  13. [ 0.242394] ION-heap mm: Cannot specify alignment for this type of heap
  14. [ 0.242785] ION-heap adsp: Cannot specify alignment for this type of heap
  15. [ 0.638244] sec_therm_probe:ret=-517
  16. [ 0.638499] sec_therm_probe:ret=-19
  17. [ 0.638659] vadc property missing
  18. [ 0.638802] printk_remap_nocache: sec_log_save_size 1048576 at sec_log_save_base 0x3fe00008
  19. [ 0.638973] printk_remap_nocache: sec_log_reserve_size 1048584 at sec_log_reserve_base 0x3fe00000
  20. [ 0.639443] Failed to remap nocache log region
  21. [ 0.768787] spmi_pmic_arb fc4cf000.qcom,spmi: PPID 0xc2 incorrect owner 2
  22. [ 0.769040] spmi_pmic_arb fc4cf000.qcom,spmi: PPID 0xc3 incorrect owner 2
  23. [ 0.769438] spmi_pmic_arb fc4cf000.qcom,spmi: PPID 0xc7 incorrect owner 2
  24. [ 0.770010] spmi_pmic_arb fc4cf000.qcom,spmi: PPID 0xa0 incorrect owner 4
  25. [ 0.770408] spmi_pmic_arb fc4cf000.qcom,spmi: PPID 0xa4 incorrect owner 2
  26. [ 0.770807] spmi_pmic_arb fc4cf000.qcom,spmi: PPID 0xa7 incorrect owner 2
  27. [ 0.771953] mdss_mdp_parse_dt_prop_len: Error from prop qcom,mdss-ad-off : spec error in device tree
  28. [ 0.773696] [ on state : 0, off state : 1
  29. [ 0.774386] dsi_panel_device_register:1666, Disp_en_gpio (73)
  30. [ 0.774482] dsi_panel_device_register:1832, Disp_te gpio not specified
  31. [ 0.774735] dsi_panel_device_register:1838, Disp_rst_gpio (25)
  32. [ 0.807118] mdss_dsi_event_handler: unhandled event=1
  33. [ 0.842039] sps: BAM device 0xf9904000 is not registered yet.
  34. [ 0.872310] cypress_request_gpio: unable to request touchkey_scl [66]
  35. [ 0.955733] cypress_touchkey 21-0020: Touchkey FW Version: 0x06
  36. [ 1.016714] mms_ts_probe: [TSP] probe START!!
  37. [ 1.125539] qup_i2c f9927000.i2c: QUP: I2C status flags :0xc1300c8, irq:131
  38. [ 1.125653] qup_i2c f9927000.i2c: I2C slave addr:0x48 not connected
  39. [ 1.125865] qup_i2c f9927000.i2c: QUP: I2C status flags :0x81343c8, irq:131
  40. [ 1.126044] qup_i2c f9927000.i2c: I2C slave addr:0x48 not connected
  41. [ 1.126181] qup_i2c f9927000.i2c: QUP: I2C status flags :0x81343c8, irq:131
  42. [ 1.126360] qup_i2c f9927000.i2c: I2C slave addr:0x48 not connected
  43. [ 1.545864] mms144_ts 5-0048: [TSP] ISC Ver [0xc7] [0x23] [0x23]
  44. [ 1.546029] mms144_ts 5-0048: [TSP] fw is latest. Do not update.
  45. [ 1.546232] mms_ts_probe: tsp : gpio_to_irq : 339
  46. [ 1.546691] mms_ts_probe: [TSP] probe END!!
  47. [ 1.553329] cam_dummy_init_module:182
  48. [ 1.553455] cam_dummy_platform_probe:87
  49. [ 1.555597] csiphy_probe: device id = 0
  50. [ 1.555866] csiphy_probe: device id = 1
  51. [ 1.559124] msm_camera_request_gpio_table:529 invalid gpio_tbl (null) / size 0
  52. [ 1.575128] msm_camera_request_gpio_table:529 invalid gpio_tbl (null) / size 0
  53. [ 1.577943] __msm_jpeg_init:895] Jpeg Device id 0
  54. [ 1.579755] stream_cnt:0
  55. [ 1.579928] cpp_dbg: end of cpp_init_hardware
  56. [ 1.581682] iris_radio: Cannot open the command channel
  57. [ 1.582070] qpnp_charger_read_dt_props: read EXT_OVP gpio (438)
  58. [ 1.636365] qcom,leds-qpnp qpnp-charger-e8a33000: Unable to get LED base address
  59. [ 1.636892] qcom,leds-qpnp leds-qpnp-e8a63400: Regulator get failed(-517)
  60. [ 1.637061] qcom,leds-qpnp leds-qpnp-e8a63400: Unable to read flash config data
  61. [ 1.637299] i2c i2c-23: an30259a_probe
  62. [ 1.646235] QCE50: __qce_init_clk: Unable to get CE core clk
  63. [ 1.646334] QCE50: __qce_init_clk: Unable to init CE clks, rc = -2
  64. [ 1.650205] usb_bam_ipa_create_resources: Failed to create USB_PROD resource
  65. [ 1.651112] cm36651_parse_dt complete, vdd_en:110 p_out:65 /efs/prox_cal
  66. [ 1.756278] cm36651_setup_reg: initial proximity value = 3
  67. [ 1.758025] mpu6500_parse_dt complete, SCL:7 SDA:6 IRQ:64
  68. [ 1.758232] mpu6500_vdd_on: error vreg_2p8 setting voltage ret=-22
  69. [ 1.927714] msm8226-asoc-tapan sound-9302.46: Property 'qcom,audio-routing' does not exist or its length is not even
  70. [ 1.946604] **** secdbg_log or secdbg_paddr is not initialized ****
  71. [ 1.958103] sec_jack_probe - defer as codec_probe_done is false
  72. [ 1.959163] gpio-keys gpio_keys.82: [Keys] no regulator: ignoring
  73. [ 1.961002] qcom,leds-qpnp leds-qpnp-e8a63400: Regulator get failed(-517)
  74. [ 1.961177] qcom,leds-qpnp leds-qpnp-e8a63400: Unable to read flash config data
  75. [ 1.961434] qpnp_charger_read_dt_props: read EXT_OVP gpio (438)
  76. [ 1.961757] qpnp_chg_ibatterm_set: bad mA=70 asked to set, setting 100mA instead
  77. [ 1.961952] qpnp_chg_ibatterm_set: REG IBAT_TERM_CHGR(105b) : 8
  78. [ 1.963361] sec_debug_check_crash_key code 172 value 0 state 0 enable 0
  79. [ 1.963586] sec_debug_check_crash_key code 114 value 0 state 0 enable 0
  80. [ 1.963693] sec_debug_check_crash_key code 115 value 0 state 0 enable 0
  81. [ 1.984979] get_prop_batt_temp: get_bat_temp: adc_code(32937) physical (276)
  82. [ 1.985842] sec_bat_read_dt_props: sec_bat_read_dt_props:parsing device tree for SEC dt parameters
  83. [ 1.986019] qpnp_charger_probe: SEC battery device tree read SUCCESS : rc(0)
  84. [ 1.986209] qpnp_charger_probe: qpnp_charger_probe: initialize battery status(2) & health(1)
  85. [ 1.986414] qpnp_chg_charge_en: qpnp_chg_charge_en called with enable=0
  86. [ 1.986729] qpnp_batt_power_set_property: qpnp_batt_power_set_property: same cable, no change in cable type (0)
  87. [ 1.986920] qpnp_charger_probe: normal boot with cable_type(0)
  88. [ 1.995506] qpnp_batt_external_power_changed: skip qpnp_batt_external_power_changed
  89. [ 2.017258] get_prop_batt_temp: get_bat_temp: adc_code(32936) physical (277)
  90. [ 2.018022] qpnp_chg_usb_usbin_valid_irq_handler: EXT_OVP disabled
  91. [ 2.018205] qpnp_chg_usb_usbin_valid_irq_handler: USB-IN triggered : usbin UNDER VOLTAGE
  92. [ 2.018314] qpnp_chg_usb_usbin_valid_irq_handler: Under Voltage - EXT_OVP disabled
  93. [ 2.018700] qpnp_batt_external_power_changed: skip qpnp_batt_external_power_changed
  94. [ 2.019522] BMS: set_battery_data: battery capacity: 2100 mA
  95. [ 2.059950] get_prop_batt_temp: get_bat_temp: adc_code(32936) physical (277)
  96. [ 2.249257] power_supply bms: driver failed to report `current_avg' property: 4294967274
  97. [ 2.249574] qpnp_batt_external_power_changed: skip qpnp_batt_external_power_changed
  98. [ 2.275903] power_supply bms: driver failed to report `current_avg' property: 4294967274
  99. [ 2.294708] sec_jack_probe - defer as codec_probe_done is false
  100. [ 2.296114] sec_jack_probe - defer as codec_probe_done is false
  101. [ 2.298114] power_supply bms: driver failed to report `current_avg' property: 4294967274
  102. [ 2.359594] get_prop_batt_temp: get_bat_temp: adc_code(32933) physical (277)
  103. [ 2.486859] power_supply bms: driver failed to report `current_avg' property: 4294967274
  104. [ 2.527596] get_prop_batt_temp: get_bat_temp: adc_code(32932) physical (277)
  105. [ 2.857114] get_prop_batt_temp: get_bat_temp: adc_code(32929) physical (277)
  106. [ 3.063618] get_prop_batt_temp: get_bat_temp: adc_code(32928) physical (277)
  107. [ 3.105578] get_prop_batt_temp: get_bat_temp: adc_code(32927) physical (277)
  108. [ 3.144853] EXT4-fs (mmcblk0p26): couldn't mount as ext3 due to feature incompatibilities
  109. [ 3.195978] EXT4-fs (mmcblk0p26): couldn't mount as ext2 due to feature incompatibilities
  110. [ 3.985208] sec_chg_time_management: discharging state! timer inactive
  111. [ 4.003001] get_prop_batt_temp: get_bat_temp: adc_code(32920) physical (277)
  112. [ 4.011882] get_prop_batt_temp: get_bat_temp: adc_code(32919) physical (277)
  113. [ 4.012064] sec_bat_monitor: status(2), health(1), batt_present(1), cable(0), siop(100)
  114. [ 4.012237] sec_bat_monitor: soc(100), vcell(4272), current(278), temperature(277), chg_en(0)
  115. [ 4.012342] sec_bat_monitor: ovp_uvlo(-1), second_phase_chg(0), polling_time(60), event(0x0), HT(600), LT(-50)
  116. [ 4.025557] EXT4-fs (mmcblk0p26): couldn't mount as ext3 due to feature incompatibilities
  117. [ 4.035873] EXT4-fs (mmcblk0p26): couldn't mount as ext2 due to feature incompatibilities
  118. [ 4.055856] EXT4-fs (loop0): couldn't mount as ext3 due to feature incompatibilities
  119. [ 4.060907] get_prop_batt_temp: get_bat_temp: adc_code(32920) physical (277)
  120. [ 4.080694] EXT4-fs (loop0): couldn't mount as ext2 due to feature incompatibilities
  121. [ 4.106054] get_prop_batt_temp: get_bat_temp: adc_code(32919) physical (277)
  122. [ 4.115303] EXT4-fs (loop1): couldn't mount as ext3 due to feature incompatibilities
  123. [ 4.668323] sm5502 15-0025: dev1: 0x0,dev2: 0x0,dev3: 0x0,Carkit: 0x0,ADC: 0x1f,Jig: OFF
  124. [ 10.065648] EXT4-fs (loop1): couldn't mount as ext2 due to feature incompatibilities
  125. [ 13.064684] init: /init.environ.rc: 13: export requires 2 arguments
  126. [ 13.069304] init: invalid uid 'fm_radio'
  127. [ 13.108357] power_supply bms: driver failed to report `current_avg' property: 4294967274
  128. [ 13.372185] get_prop_batt_temp: get_bat_temp: adc_code(32894) physical (279)
  129. [ 13.950387] tapan-slim tapan-slim-pgd: Looking up qcom,cdc-micbias4-cfilt-sel property in node /soc/slim@fe12f000/tapan_codec failed
  130. [ 13.950695] diag: In diag_send_msg_mask_update, invalid status 0
  131. [ 13.950918] diag: In diag_send_log_mask_update, invalid status 0
  132. [ 13.951231] tapan-slim tapan-slim-pgd: Looking up qcom,cdc-dmic-sample-rate property in node /soc/slim@fe12f000/tapan_codec failed
  133. [ 14.005254] ngd_msm_ctrl fe12f000.slim: ADSP slimbus not up yet
  134. [ 14.104319] sec_jack_probe - defer as codec_probe_done is false
  135. [ 14.215341] msm8226-asoc-tapan sound.45: Looking up qcom, cdc-lineout-spkr-gpios property in node /soc/sound failed -22
  136. [ 14.215547] msm8226_asoc_machine_probe Ear jack LDO node not available
  137. [ 14.216921] sec_jack_populate_dt_pdata : can not find the earjack-micbias-gpio in the dt
  138. [ 14.683368] power_supply bms: driver failed to report `current_avg' property: 4294967274
  139. [ 14.724709] get_prop_batt_temp: get_bat_temp: adc_code(32879) physical (279)
  140. [ 14.932064] power_supply bms: driver failed to report `current_avg' property: 4294967274
  141. [ 14.974182] get_prop_batt_temp: get_bat_temp: adc_code(32875) physical (280)
  142. [ 15.233694] diag: In diag_send_msg_mask_update, invalid status 0
  143. [ 15.234770] diag: In diag_send_log_mask_update, invalid status 0
  144. [ 15.293697] init: Detected MSM SOC ID=221 SOC VER=0 BOARD TYPE=MTP
  145. [ 15.294235] init: failed to open '/sys/class/graphics/fb2/msm_fb_type'
  146. [ 15.301098] init: cannot find '/sbin/upstart-property-watcher', disabling 'upstart-watcher'
  147. [ 15.301336] init: property 'persist.sys.ssr.enable_debug' doesn't exist while expanding '${persist.sys.ssr.enable_debug}'
  148. [ 15.301534] init: cannot expand '${persist.sys.ssr.enable_debug}' while writing to '/sys/module/subsystem_restart/parameters/enable_debug'
  149. [ 15.341132] init: cannot find '/system/bin/debuggerd64', disabling 'debuggerd64'
  150. [ 15.348586] init: cannot find '/system/bin/ubuntuappmanager.disabled', disabling 'ubuntuappmanager'
  151. [ 15.536333] wcnss: wcnss_nvbin_dnld
  152. [ 15.536519] wcnss: request_firmware
  153. [ 15.813160] wcnss: NV bin size: 29812, total_fragments: 10
  154. [ 15.813332] wcnss: no space available for smd frame
  155. [ 15.840173] wcnss: no space available for smd frame
  156. [ 15.865391] wcnss: no space available for smd frame
  157. [ 15.895251] wcnss: no space available for smd frame
  158. [ 16.200564] get_prop_batt_temp: get_bat_temp: adc_code(32854) physical (281)
  159. [ 16.343506] healthd: wakealarm_init: timerfd_create failed
  160. [ 16.395116] get_prop_batt_temp: get_bat_temp: adc_code(32850) physical (281)
  161. [ 16.552301] msm_camera_request_gpio_table:529 invalid gpio_tbl (null) / size 0
  162. [ 16.806184] msm_camera_request_gpio_table:529 invalid gpio_tbl (null) / size 0
  163. [ 17.024516] msm_camera_request_gpio_table:529 invalid gpio_tbl (null) / size 0
  164. [ 17.147974] msm_camera_request_gpio_table:529 invalid gpio_tbl (null) / size 0
  165. [ 17.149208] MSM-SENSOR-DRIVER msm_sensor_driver_probe:170 camera id 0
  166. [ 17.149311] MSM-SENSOR-DRIVER msm_sensor_driver_probe:171 slave_addr 34
  167. [ 17.149962] MSM-SENSOR-DRIVER msm_sensor_driver_probe:318 msm_sensor_driver_probe line 318 camera_info->sensor_id = 0x175 = 0x175
  168. [ 17.149970]
  169. [ 17.150240] msm_camera_fill_vreg_params:65 i 2 j 0 cam_vdig
  170. [ 17.150339] msm_camera_fill_vreg_params:70 dig min max voltage 1
  171. [ 17.150526] msm_camera_fill_vreg_params:110 i 4 j 2 cam_vaf
  172. [ 17.150627] msm_camera_fill_vreg_params:115 af min max voltage 1
  173. [ 17.150951] msm_camera_fill_vreg_params:80 i 5 j 1 cam_vio
  174. [ 17.151053] msm_camera_fill_vreg_params:85 io min max voltage 1
  175. [ 17.151234] msm_camera_fill_vreg_params:65 i 2 j 0 cam_vdig
  176. [ 17.151338] msm_camera_fill_vreg_params:70 dig min max voltage 0
  177. [ 17.151509] msm_camera_fill_vreg_params:80 i 3 j 1 cam_vio
  178. [ 17.151609] msm_camera_fill_vreg_params:85 io min max voltage 0
  179. [ 17.151792] msm_camera_fill_vreg_params:110 i 6 j 2 cam_vaf
  180. [ 17.151892] msm_camera_fill_vreg_params:115 af min max voltage 0
  181. [ 17.152760] MSM-SENSOR-DRIVER msm_sensor_driver_probe:431 msm_sensor_driver_probe: name : imx175, type = 131072 group_id = 6
  182. [ 17.152767]
  183. [ 17.162469] MSM-SENSOR-DRIVER msm_sensor_driver_probe:435 FAILED- 3: 0
  184. [ 17.162474]
  185. [ 17.172651] MSM-SENSOR-DRIVER msm_sensor_driver_probe:170 camera id 2
  186. [ 17.172757] MSM-SENSOR-DRIVER msm_sensor_driver_probe:171 slave_addr 20
  187. [ 17.173226] MSM-SENSOR-DRIVER msm_sensor_driver_probe:318 msm_sensor_driver_probe line 318 camera_info->sensor_id = 0x0 = 0x0
  188. [ 17.173234]
  189. [ 17.174599] msm_camera_fill_vreg_params:80 i 4 j 2 cam_vio
  190. [ 17.176112] msm_camera_fill_vreg_params:85 io min max voltage 1
  191. [ 17.176250] msm_camera_fill_vreg_params:80 i 3 j 2 cam_vio
  192. [ 17.176257] msm_camera_fill_vreg_params:85 io min max voltage 0
  193. [ 17.177721] MSM-SENSOR-DRIVER msm_sensor_driver_probe:431 msm_sensor_driver_probe: name : s5k6a3yx, type = 131072 group_id = 6
  194. [ 17.177728]
  195. [ 17.189595] MSM-SENSOR-DRIVER msm_sensor_driver_probe:435 FAILED- 3: 0
  196. [ 17.189602]
  197. [ 17.191580] msm_csiphy_subdev_ioctl:575 id 0
  198. [ 17.191692] msm_csiphy_get_subdev_id:566 subdev_id 0
  199. [ 17.192025] msm_csiphy_subdev_ioctl:575 id 1
  200. [ 17.192128] msm_csiphy_get_subdev_id:566 subdev_id 1
  201. [ 17.233729] msm_isp_open_node: HW Version: 0x20010014
  202. [ 17.276085] stream_cnt:0
  203. [ 17.276183] cpp_dbg: end of cpp_init_hardware
  204. [ 17.276594] cpp_dbg: MSM_CPP_MICRO_CLKEN_CTL
  205. [ 17.278732] cpp_dbg: MSM_CPP_MICRO_BOOT_START
  206. [ 17.278834] cpp_dbg: MSM_CPP_MSG_ID_CMD
  207. [ 17.319823] wlan: [1262:E :HDD] hdd_apply_cfg_ini: MAX_CFG_INI_ITEMS too small, must be at least 342
  208. [ 17.335475] wlan: [1262:E :VOS] INFO: NV binary file version=2 Driver default NV version=2, continue...
  209. [ 17.335483]
  210. [ 17.368002] cpp_dbg: Trigger MC to jump to start address
  211. [ 17.368208] cpp_dbg: msm_cpp_poll MSM_CPP_MSG_ID_CMD
  212. [ 17.370384] cpp_dbg: msm_cpp_poll 0x1
  213. [ 17.404369] wlan: [1262:E :HDD] hdd_generate_iface_mac_addr_auto: 7420: Failed to Get Serial NO
  214. [ 17.404488] wlan: [1262:E :HDD] hdd_wlan_startup: Failed to generate wlan interface mac addr using MAC from ini file 00:0a:f5:89:89:ff
  215. [ 17.425905] Poll failed: expect: 0x1
  216. [ 17.426012] cpp_dbg: msm_cpp_poll MSM_CPP_MSG_ID_JUMP_ACK
  217. [ 17.479823] Poll failed: expect: 0x1
  218. [ 17.480019] cpp_dbg: msm_cpp_poll MSM_CPP_MSG_ID_TRAILER
  219. [ 17.529642] Poll failed: expect: 0xabcdefaa
  220. [ 17.545450] cpp_close_node: irq_status: 0x23e
  221. [ 17.545722] cpp_close_node: DEBUG_SP: 0x0
  222. [ 17.545823] cpp_close_node: DEBUG_T: 0x0
  223. [ 17.546008] cpp_close_node: DEBUG_N: 0x0
  224. [ 17.546106] cpp_close_node: DEBUG_R: 0x0
  225. [ 17.546210] cpp_close_node: DEBUG_OPPC: 0x0
  226. [ 17.546403] cpp_close_node: DEBUG_MO: 0x0
  227. [ 17.546507] cpp_close_node: DEBUG_TIMER0: 0x0
  228. [ 17.546819] cpp_close_node: DEBUG_TIMER1: 0x0
  229. [ 17.547005] cpp_close_node: DEBUG_GPI: 0x0
  230. [ 17.547105] cpp_close_node: DEBUG_GPO: 0x0
  231. [ 17.547199] cpp_close_node: DEBUG_T0: 0x0
  232. [ 17.547369] cpp_close_node: DEBUG_R0: 0x0
  233. [ 17.547466] cpp_close_node: DEBUG_T1: 0x0
  234. [ 17.547638] cpp_close_node: DEBUG_R1: 0x0
  235. [ 17.624257] msm_open_cam_dummy: E
  236. [ 17.624376] msm_open_cam_dummy: X 0
  237. [ 18.010522] Notify: smsm init
  238. [ 18.315637] diag: In diag_send_msg_mask_update, invalid status 0
  239. [ 18.315789] diag: In diag_send_log_mask_update, invalid status 0
  240. [ 18.879494] [rmnet0] error: rmnet_ioct called for unsupported cmd[35585]
  241. [ 18.879933] [rmnet1] error: rmnet_ioct called for unsupported cmd[35585]
  242. [ 18.880574] [rmnet2] error: rmnet_ioct called for unsupported cmd[35585]
  243. [ 18.881126] [rmnet3] error: rmnet_ioct called for unsupported cmd[35585]
  244. [ 18.881598] [rmnet4] error: rmnet_ioct called for unsupported cmd[35585]
  245. [ 18.882234] [rmnet5] error: rmnet_ioct called for unsupported cmd[35585]
  246. [ 18.882703] [rmnet6] error: rmnet_ioct called for unsupported cmd[35585]
  247. [ 18.883258] [rmnet7] error: rmnet_ioct called for unsupported cmd[35585]
  248. [ 18.883885] [rmnet_usb0] error: rmnet_ioct called for unsupported cmd[35585]
  249. [ 18.884343] [rev_rmnet0] error: rmnet_ioct called for unsupported cmd[35585]
  250. [ 18.884897] [rev_rmnet1] error: rmnet_ioct called for unsupported cmd[35585]
  251. [ 18.885517] [rev_rmnet2] error: rmnet_ioct called for unsupported cmd[35585]
  252. [ 18.886075] [rev_rmnet3] error: rmnet_ioct called for unsupported cmd[35585]
  253. [ 18.886634] [rev_rmnet4] error: rmnet_ioct called for unsupported cmd[35585]
  254. [ 18.887194] [rev_rmnet5] error: rmnet_ioct called for unsupported cmd[35585]
  255. [ 18.887727] [rev_rmnet6] error: rmnet_ioct called for unsupported cmd[35585]
  256. [ 18.888267] [rev_rmnet7] error: rmnet_ioct called for unsupported cmd[35585]
  257. [ 18.888765] [rev_rmnet8] error: rmnet_ioct called for unsupported cmd[35585]
  258. [ 19.176740] [SENSOR] accel_open_calibration: - Can't open calibration file
  259. [ 21.030981] audit: rate limit exceeded
  260. [ 22.552542] mdss_mdp_pipe_init: no 2 type pipes available
  261. [ 22.552645] mdss_mdp_overlay_pipe_setup: error allocating pipe
  262. [ 22.553386] mdss_dsi_event_handler: unhandled event=1
  263. [ 22.986247] to maintain ddefault brightness
  264. [ 23.015979] qpnp_batt_external_power_changed: skip qpnp_batt_external_power_changed
  265. [ 23.043540] power_supply bms: driver failed to report `current_avg' property: 4294967274
  266. [ 23.302941] mdss_dsi_cmdlist_rx: No rx buffer provided
  267. [ 23.336160] mdss_dsi_cmdlist_rx: No rx buffer provided
  268. [ 23.369480] mdss_dsi_cmdlist_rx: No rx buffer provided
  269. [ 23.402820] mdss_dsi_cmdlist_rx: No rx buffer provided
  270. [ 23.436264] mdss_dsi_cmdlist_rx: No rx buffer provided
  271. [ 23.469583] mdss_dsi_cmdlist_rx: No rx buffer provided
  272. [ 23.502816] mdss_dsi_cmdlist_rx: No rx buffer provided
  273. [ 23.536145] mdss_dsi_cmdlist_rx: No rx buffer provided
  274. [ 23.569481] mdss_dsi_cmdlist_rx: No rx buffer provided
  275. [ 23.602817] mdss_dsi_cmdlist_rx: No rx buffer provided
  276. [ 23.636144] mdss_dsi_cmdlist_rx: No rx buffer provided
  277. [ 23.669484] mdss_dsi_cmdlist_rx: No rx buffer provided
  278. [ 23.702819] mdss_dsi_cmdlist_rx: No rx buffer provided
  279. [ 23.736337] mdss_dsi_cmdlist_rx: No rx buffer provided
  280. [ 23.769542] mdss_dsi_cmdlist_rx: No rx buffer provided
  281. [ 23.802906] mdss_dsi_cmdlist_rx: No rx buffer provided
  282. [ 23.852807] mdss_dsi_cmdlist_rx: No rx buffer provided
  283. [ 23.886147] mdss_dsi_cmdlist_rx: No rx buffer provided
  284. [ 23.919474] mdss_dsi_cmdlist_rx: No rx buffer provided
  285. [ 23.952820] mdss_dsi_cmdlist_rx: No rx buffer provided
  286. [ 23.986153] mdss_dsi_cmdlist_rx: No rx buffer provided
  287. [ 24.019472] mdss_dsi_cmdlist_rx: No rx buffer provided
  288. [ 24.052889] mdss_dsi_cmdlist_rx: No rx buffer provided
  289. [ 24.086146] mdss_dsi_cmdlist_rx: No rx buffer provided
  290. [ 24.119485] mdss_dsi_cmdlist_rx: No rx buffer provided
  291. [ 24.152819] mdss_dsi_cmdlist_rx: No rx buffer provided
  292. [ 24.186147] mdss_dsi_cmdlist_rx: No rx buffer provided
  293. [ 24.219519] mdss_dsi_cmdlist_rx: No rx buffer provided
  294. [ 24.252819] mdss_dsi_cmdlist_rx: No rx buffer provided
  295. [ 24.286156] mdss_dsi_cmdlist_rx: No rx buffer provided
  296. [ 24.292375] wlan: [1262:E :CTL] Host caps 14c001bf 0 0 80000000
  297. [ 24.292380]
  298. [ 24.292918] wlan: [1262:E :CTL] Host Capability
  299. [ 24.293170] wlan: [1262:E :CTL] MCC, P2P, DOT11AC, SLM_SESSIONIZATION, DOT11AC_OPMODE, SAP32STA, P2P_GO_NOA_DECOUPLE_INIT_SCAN, WLANACTIVE_OFFLOAD, WOW, WLAN_ROAM_SCAN_OFFLOAD, ,
  300. [ 24.296244] wlan: [1769:E :CTL] FW caps 1f877fb 0 0 0
  301. [ 24.296250]
  302. [ 24.296642] wlan: [1769:E :CTL] Firmware Capability
  303. [ 24.296775] wlan: [1769:E :CTL] MCC, P2P, SLM_SESSIONIZATION, DOT11AC_OPMODE, SAP32STA, TDLS, P2P_GO_NOA_DECOUPLE_INIT_SCAN, WLANACTIVE_OFFLOAD, BEACON_OFFLOAD, SCAN_OFFLOAD, BCN_MISS_OFFLOAD, STA_POWERSAVE, , BCN_FILTER, RTT, RATECTRL, WOW, WLAN_ROAM_SCAN_OFFLOAD,
  304. [ 24.319494] mdss_dsi_cmdlist_rx: No rx buffer provided
  305. [ 24.352831] mdss_dsi_cmdlist_rx: No rx buffer provided
  306. [ 24.635058] wlan: [2051:E :PMC] PMC: STA not associated with an AP with single active session. BMPS cannot be entered
  307. [ 24.756121] mdss_mdp_pipe_init: no 2 type pipes available
  308. [ 24.756277] mdss_mdp_overlay_pipe_setup: error allocating pipe
  309. [ 24.846177] wlan: [913:E :HDD] wlan_hdd_cfg80211_flush_pmksa: Invalid entry to delete
  310. [ 24.909989] mdss_mdp_pipe_init: no 3 type pipes available
  311. [ 24.910100] mdss_mdp_overlay_pipe_setup: error allocating pipe
  312. [ 24.944803] hcismd_set_enable 0
  313. [ 24.949678] hcismd_set_enable 1
  314. [ 24.951540] Bluetooth: Frame for unknown HCI device (hdev=NULL)
  315. [ 24.951819] Bluetooth: Frame for unknown HCI device (hdev=NULL)
  316. [ 26.038224] hcismd_set_enable 0
  317. [ 31.271210] mdss_mdp_pipe_init: no 3 type pipes available
  318. [ 31.271434] mdss_mdp_overlay_pipe_setup: error allocating pipe
  319. [ 31.554427] mdss_mdp_pipe_init: no 3 type pipes available
  320. [ 31.554651] mdss_mdp_overlay_pipe_setup: error allocating pipe
  321. [ 38.157084] qpnp_batt_external_power_changed: skip qpnp_batt_external_power_changed
  322. [ 38.184794] power_supply bms: driver failed to report `current_avg' property: 4294967274
  323. [ 47.517199] qpnp_chg_usb_usbin_valid_irq_handler: USB-IN triggered : usbin-valid voltage
  324. [ 47.518998] qpnp_batt_external_power_changed: skip qpnp_batt_external_power_changed
  325. [ 47.550712] sm5502 15-0025: dev1: 0x4,dev2: 0x0,dev3: 0x0,Carkit: 0x0,ADC: 0x1f,Jig: OFF
  326. [ 47.552035] sm5502 15-0025: sm5502_attach_dev: vbus val2
  327. [ 47.552730] sm5502_callback USB Cable status attached (1)
  328. [ 47.553203] qpnp_batt_power_set_property: qpnp_batt_power_set_property: cable type changed (0) -> (1)
  329. [ 47.553851] sec_handle_cable_insertion_removal: USB is inserted, chg_current 500, batt_present(1)
  330. [ 47.554555] sec_handle_cable_insertion_removal: USB : SIOP change in current ibatmax_ma(500)
  331. [ 47.554973] sec_pm8226_start_charging: enable charging for cable type (1)
  332. [ 47.555910] sec_pm8226_start_charging: battery status changed to (1)
  333. [ 47.556597] qpnp_chg_charge_en: qpnp_chg_charge_en called with enable=1
  334. [ 47.557042] sec_handle_cable_insertion_removal: battery status changed from (2)->(1)
  335. [ 47.559716] qpnp_batt_external_power_changed: skip qpnp_batt_external_power_changed
  336. [ 47.560212] sec_chg_time_management: Charging Time: 0 secs (rechg:0)
  337. [ 47.570391] get_prop_batt_temp: get_bat_temp: adc_code(32455) physical (299)
  338. [ 47.595567] get_prop_batt_temp: get_bat_temp: adc_code(32454) physical (299)
  339. [ 47.605116] get_prop_batt_temp: get_bat_temp: adc_code(32454) physical (299)
  340. [ 47.605646] sec_bat_monitor: status(1), health(1), batt_present(1), cable(1), siop(100)
  341. [ 47.605901] sec_bat_monitor: soc(100), vcell(4295), current(-3), temperature(299), chg_en(1)
  342. [ 47.606052] sec_bat_monitor: ovp_uvlo(0), second_phase_chg(0), polling_time(60), event(0x0), HT(600), LT(-50)
  343. [ 47.620967] sm5502 15-0025: dev1: 0x4,dev2: 0x0,dev3: 0x0,Carkit: 0x0,ADC: 0x1f,Jig: OFF
  344. [ 47.621614] sm5502 15-0025: sm5502_attach_dev: vbus val2
  345. [ 47.621769] sm5502_callback USB Cable status attached (2)
  346. [ 47.655746] qpnp_batt_external_power_changed: skip qpnp_batt_external_power_changed
  347. [ 47.664697] get_prop_batt_temp: get_bat_temp: adc_code(32454) physical (299)
  348. [ 47.695386] get_prop_batt_temp: get_bat_temp: adc_code(32453) physical (299)
  349. [ 47.780368] get_prop_batt_temp: get_bat_temp: adc_code(32452) physical (299)
  350. [ 47.804580] get_prop_batt_temp: get_bat_temp: adc_code(32453) physical (299)
  351. [ 47.844202] get_prop_batt_temp: get_bat_temp: adc_code(32453) physical (299)
  352. [ 47.850616] qpnp_batt_external_power_changed: skip qpnp_batt_external_power_changed
  353. [ 47.911730] get_prop_batt_temp: get_bat_temp: adc_code(32452) physical (299)
  354. [ 47.932877] qpnp_batt_external_power_changed: skip qpnp_batt_external_power_changed
  355. [ 47.946756] get_prop_batt_temp: get_bat_temp: adc_code(32452) physical (299)
  356. [ 47.984124] get_prop_batt_temp: get_bat_temp: adc_code(32452) physical (299)
  357. [ 48.009882] get_prop_batt_temp: get_bat_temp: adc_code(32453) physical (299)
  358. [ 48.039684] qpnp_batt_external_power_changed: skip qpnp_batt_external_power_changed
  359. [ 48.051286] get_prop_batt_temp: get_bat_temp: adc_code(32453) physical (299)
  360. [ 48.095819] get_prop_batt_temp: get_bat_temp: adc_code(32451) physical (299)
  361. [ 48.515244] sec_ovp_uvlo_worker: OVP/UVLO check: cable_type(1) uvp_uvlo(0)
  362. [ 48.515389] sec_ovp_uvlo_worker: ovp_uvlo(0) VBUS(1) status(1) health(1)
  363. [ 48.566879] get_prop_batt_temp: get_bat_temp: adc_code(32447) physical (300)
  364. [ 48.607910] get_prop_batt_temp: get_bat_temp: adc_code(32447) physical (300)
  365. [ 48.639921] get_prop_batt_temp: get_bat_temp: adc_code(32448) physical (300)
  366. [ 48.861279] qpnp_chg_chgr_chg_fastchg_irq_handler: FAST_CHG IRQ triggered
  367. [ 48.861736] qpnp_chg_chgr_chg_fastchg_irq_handler: FAST_CHG ON IRQ
  368. [ 48.862458] qpnp_chg_chgr_chg_fastchg_irq_handler: FAST_CHG ON IRQ - ret.intval : (500000)
  369. [ 48.863179] qpnp_chg_chgr_chg_fastchg_irq_handler: cable_type (1)
  370. [ 48.914784] get_prop_batt_temp: get_bat_temp: adc_code(32444) physical (300)
  371. [ 48.944803] get_prop_batt_temp: get_bat_temp: adc_code(32443) physical (300)
  372. [ 48.992285] get_prop_batt_temp: get_bat_temp: adc_code(32444) physical (300)
  373. [ 53.319267] wlan: [913:E :HDD] Network input is not correct
  374. [ 63.127925] qpnp_batt_external_power_changed: skip qpnp_batt_external_power_changed
  375. [ 63.160520] power_supply bms: driver failed to report `current_avg' property: 4294967274
  376. [ 86.294375] wlan: [913:E :HDD] Network input is not correct
  377. [ 108.503785] sec_chg_time_management: Charging Time: 61 secs (rechg:0)
  378. [ 108.521746] get_prop_batt_temp: get_bat_temp: adc_code(32359) physical (306)
  379. [ 108.530765] get_prop_batt_temp: get_bat_temp: adc_code(32358) physical (306)
  380. [ 108.530977] sec_bat_monitor: first phase charging: ui_full_cnt(1)
  381. [ 108.531198] sec_bat_monitor: status(1), health(1), batt_present(1), cable(1), siop(100)
  382. [ 108.531444] sec_bat_monitor: soc(100), vcell(4363), current(-155), temperature(306), chg_en(1)
  383. [ 108.531669] sec_bat_monitor: ovp_uvlo(0), second_phase_chg(0), polling_time(60), event(0x0), HT(600), LT(-50)
  384. [ 108.581985] get_prop_batt_temp: get_bat_temp: adc_code(32358) physical (306)
  385. [ 108.598849] get_prop_batt_temp: get_bat_temp: adc_code(32358) physical (306)
  386. [ 108.640559] get_prop_batt_temp: get_bat_temp: adc_code(32359) physical (306)
  387. [ 129.298928] wlan: [913:E :HDD] Network input is not correct
  388. [ 168.554222] sec_chg_time_management: Charging Time: 121 secs (rechg:0)
  389. [ 168.574143] get_prop_batt_temp: get_bat_temp: adc_code(32347) physical (307)
  390. [ 168.583934] get_prop_batt_temp: get_bat_temp: adc_code(32348) physical (307)
  391. [ 168.584374] sec_bat_monitor: first phase charging: ui_full_cnt(2)
  392. [ 168.585015] sec_bat_monitor: status(1), health(1), batt_present(1), cable(1), siop(100)
  393. [ 168.587159] sec_bat_monitor: soc(100), vcell(4349), current(-69), temperature(307), chg_en(1)
  394. [ 168.587813] sec_bat_monitor: ovp_uvlo(0), second_phase_chg(0), polling_time(60), event(0x0), HT(600), LT(-50)
  395. [ 168.639842] get_prop_batt_temp: get_bat_temp: adc_code(32347) physical (307)
  396. [ 168.656853] get_prop_batt_temp: get_bat_temp: adc_code(32347) physical (307)
  397. [ 168.698683] get_prop_batt_temp: get_bat_temp: adc_code(32347) physical (307)
  398. [ 182.297728] wlan: [913:E :HDD] Network input is not correct
  399. [ 228.604320] sec_chg_time_management: Charging Time: 181 secs (rechg:0)
  400. [ 228.626542] get_prop_batt_temp: get_bat_temp: adc_code(32417) physical (302)
  401. [ 228.636387] get_prop_batt_temp: get_bat_temp: adc_code(32419) physical (302)
  402. [ 228.636830] sec_bat_monitor: first phase charging: ui_full_cnt(3)
  403. [ 228.637503] sec_bat_monitor: reported_soc : (100)
  404. [ 228.638157] sec_bat_monitor: first phase charging done: update battery UI FULL
  405. [ 228.639091] sec_bat_monitor: start second phase charging: ui_full(1)
  406. [ 228.639450] sec_bat_monitor: status(4), health(1), batt_present(1), cable(1), siop(100)
  407. [ 228.640087] sec_bat_monitor: soc(100), vcell(4350), current(-63), temperature(302), chg_en(1)
  408. [ 228.640721] sec_bat_monitor: ovp_uvlo(0), second_phase_chg(1), polling_time(60), event(0x0), HT(600), LT(-50)
  409. [ 228.817101] get_prop_batt_temp: get_bat_temp: adc_code(32419) physical (302)
  410. [ 228.872621] get_prop_batt_temp: get_bat_temp: adc_code(32418) physical (302)
  411. [ 228.928020] get_prop_batt_temp: get_bat_temp: adc_code(32420) physical (301)
  412. [ 245.238237] wlan: [913:E :HDD] Network input is not correct
  413. [ 288.655426] sec_chg_time_management: Charging Time: 60 secs (rechg:0)
  414. [ 288.674987] get_prop_batt_temp: get_bat_temp: adc_code(32435) physical (300)
  415. [ 288.684660] get_prop_batt_temp: get_bat_temp: adc_code(32435) physical (300)
  416. [ 288.685434] sec_bat_monitor: status(4), health(1), batt_present(1), cable(1), siop(100)
  417. [ 288.686087] sec_bat_monitor: soc(100), vcell(4350), current(-56), temperature(300), chg_en(1)
  418. [ 288.686459] sec_bat_monitor: ovp_uvlo(0), second_phase_chg(1), polling_time(60), event(0x0), HT(600), LT(-50)
  419. [ 288.741774] get_prop_batt_temp: get_bat_temp: adc_code(32435) physical (300)
  420. [ 288.760930] get_prop_batt_temp: get_bat_temp: adc_code(32433) physical (300)
  421. [ 288.802059] get_prop_batt_temp: get_bat_temp: adc_code(32434) physical (300)
  422. [ 308.068437] sec_debug_check_crash_key code 116 value 1 state 0 enable 0
  423. [ 308.068598] (sec_debug_set_upload_cause) 85
  424. [ 308.072438] mdss_dsi_event_handler: unhandled event=1
  425. [ 308.376599] to maintain ddefault brightness
  426. [ 308.386688] wlan: [913:E :HDD] Network input is not correct
  427. [ 308.481944] sec_debug_check_crash_key code 116 value 0 state 0 enable 0
  428. [ 308.482105] (sec_debug_set_upload_cause) cafebabe
  429. [ 348.713226] sec_chg_time_management: Charging Time: 120 secs (rechg:0)
  430. [ 348.731277] get_prop_batt_temp: get_bat_temp: adc_code(32350) physical (306)
  431. [ 348.741625] get_prop_batt_temp: get_bat_temp: adc_code(32351) physical (306)
  432. [ 348.741996] sec_bat_monitor: status(4), health(1), batt_present(1), cable(1), siop(100)
  433. [ 348.742640] sec_bat_monitor: soc(100), vcell(4349), current(-55), temperature(306), chg_en(1)
  434. [ 348.743284] sec_bat_monitor: ovp_uvlo(0), second_phase_chg(1), polling_time(60), event(0x0), HT(600), LT(-50)
  435. [ 348.794208] get_prop_batt_temp: get_bat_temp: adc_code(32350) physical (306)
  436. [ 348.820762] get_prop_batt_temp: get_bat_temp: adc_code(32349) physical (306)
  437. [ 348.862273] get_prop_batt_temp: get_bat_temp: adc_code(32351) physical (306)
  438. [ 371.240519] wlan: [913:E :HDD] Network input is not correct
  439. [ 384.091605] qpnp_batt_external_power_changed: skip qpnp_batt_external_power_changed
  440. [ 384.143170] power_supply bms: driver failed to report `current_avg' property: 4294967274
  441. [ 408.767153] sec_chg_time_management: Charging Time: 180 secs (rechg:0)
  442. [ 408.789935] get_prop_batt_temp: get_bat_temp: adc_code(32243) physical (315)
  443. [ 408.800935] get_prop_batt_temp: get_bat_temp: adc_code(32242) physical (315)
  444. [ 408.801108] sec_bat_monitor: status(4), health(1), batt_present(1), cable(1), siop(100)
  445. [ 408.801396] sec_bat_monitor: soc(100), vcell(4348), current(-49), temperature(315), chg_en(1)
  446. [ 408.801682] sec_bat_monitor: ovp_uvlo(0), second_phase_chg(1), polling_time(60), event(0x0), HT(600), LT(-50)
  447. [ 408.846624] get_prop_batt_temp: get_bat_temp: adc_code(32243) physical (315)
  448. [ 408.861228] get_prop_batt_temp: get_bat_temp: adc_code(32243) physical (315)
  449. [ 408.905136] get_prop_batt_temp: get_bat_temp: adc_code(32244) physical (315)
  450. [ 434.354642] wlan: [913:E :HDD] Network input is not correct
  451. [ 444.088709] qpnp_batt_external_power_changed: skip qpnp_batt_external_power_changed
  452. [ 444.103935] power_supply bms: driver failed to report `current_avg' property: 4294967274
  453. [ 468.819015] sec_chg_time_management: Charging Time: 240 secs (rechg:0)
  454. [ 468.843491] get_prop_batt_temp: get_bat_temp: adc_code(32348) physical (307)
  455. [ 468.854057] get_prop_batt_temp: get_bat_temp: adc_code(32347) physical (307)
  456. [ 468.854184] sec_bat_monitor: status(4), health(1), batt_present(1), cable(1), siop(100)
  457. [ 468.854396] sec_bat_monitor: soc(100), vcell(4349), current(-50), temperature(307), chg_en(1)
  458. [ 468.854609] sec_bat_monitor: ovp_uvlo(0), second_phase_chg(1), polling_time(60), event(0x0), HT(600), LT(-50)
  459. [ 468.899406] get_prop_batt_temp: get_bat_temp: adc_code(32348) physical (307)
  460. [ 468.914952] get_prop_batt_temp: get_bat_temp: adc_code(32348) physical (307)
  461. [ 468.961584] get_prop_batt_temp: get_bat_temp: adc_code(32348) physical (307)
  462. [ 497.251626] wlan: [913:E :HDD] Network input is not correct
  463. [ 528.875054] sec_chg_time_management: Charging Time: 300 secs (rechg:0)
  464. [ 528.895109] get_prop_batt_temp: get_bat_temp: adc_code(32365) physical (306)
  465. [ 528.905487] get_prop_batt_temp: get_bat_temp: adc_code(32364) physical (306)
  466. [ 528.906137] sec_bat_monitor: status(4), health(1), batt_present(1), cable(1), siop(100)
  467. [ 528.906497] sec_bat_monitor: soc(100), vcell(4349), current(-49), temperature(306), chg_en(1)
  468. [ 528.907143] sec_bat_monitor: ovp_uvlo(0), second_phase_chg(1), polling_time(60), event(0x0), HT(600), LT(-50)
  469. [ 528.956332] get_prop_batt_temp: get_bat_temp: adc_code(32365) physical (306)
  470. [ 528.973431] get_prop_batt_temp: get_bat_temp: adc_code(32366) physical (306)
  471. [ 529.021329] get_prop_batt_temp: get_bat_temp: adc_code(32365) physical (306)
  472. [ 560.328020] wlan: [913:E :HDD] Network input is not correct
  473. [ 588.931216] sec_chg_time_management: Charging Time: 360 secs (rechg:0)
  474. [ 588.951616] get_prop_batt_temp: get_bat_temp: adc_code(32363) physical (306)
  475. [ 588.966165] get_prop_batt_temp: get_bat_temp: adc_code(32362) physical (306)
  476. [ 588.966617] sec_bat_monitor: status(4), health(1), batt_present(1), cable(1), siop(100)
  477. [ 588.967346] sec_bat_monitor: soc(100), vcell(4349), current(-43), temperature(306), chg_en(1)
  478. [ 588.968502] sec_bat_monitor: ovp_uvlo(0), second_phase_chg(1), polling_time(60), event(0x0), HT(600), LT(-50)
  479. [ 589.013979] get_prop_batt_temp: get_bat_temp: adc_code(32361) physical (306)
  480. [ 589.028272] get_prop_batt_temp: get_bat_temp: adc_code(32362) physical (306)
  481. [ 589.081779] get_prop_batt_temp: get_bat_temp: adc_code(32364) physical (306)
  482. [ 623.262683] wlan: [913:E :HDD] Network input is not correct
  483. [ 648.991224] sec_chg_time_management: Charging Time: 420 secs (rechg:0)
  484. [ 649.012933] get_prop_batt_temp: get_bat_temp: adc_code(32356) physical (306)
  485. [ 649.022007] get_prop_batt_temp: get_bat_temp: adc_code(32355) physical (306)
  486. [ 649.022265] sec_bat_monitor: status(4), health(1), batt_present(1), cable(1), siop(100)
  487. [ 649.022528] sec_bat_monitor: soc(100), vcell(4349), current(-40), temperature(306), chg_en(1)
  488. [ 649.022648] sec_bat_monitor: ovp_uvlo(0), second_phase_chg(1), polling_time(60), event(0x0), HT(600), LT(-50)
  489. [ 649.069746] get_prop_batt_temp: get_bat_temp: adc_code(32357) physical (306)
  490. [ 649.088231] get_prop_batt_temp: get_bat_temp: adc_code(32356) physical (306)
  491. [ 649.139336] get_prop_batt_temp: get_bat_temp: adc_code(32355) physical (306)
  492. [ 686.284268] wlan: [913:E :HDD] Network input is not correct
  493. [ 709.045588] sec_chg_time_management: Charging Time: 480 secs (rechg:0)
  494. [ 709.063539] get_prop_batt_temp: get_bat_temp: adc_code(32345) physical (307)
  495. [ 709.072641] get_prop_batt_temp: get_bat_temp: adc_code(32345) physical (307)
  496. [ 709.072772] sec_bat_monitor: status(4), health(1), batt_present(1), cable(1), siop(100)
  497. [ 709.073005] sec_bat_monitor: soc(100), vcell(4349), current(-39), temperature(307), chg_en(1)
  498. [ 709.073224] sec_bat_monitor: ovp_uvlo(0), second_phase_chg(1), polling_time(60), event(0x0), HT(600), LT(-50)
  499. [ 709.121038] get_prop_batt_temp: get_bat_temp: adc_code(32345) physical (307)
  500. [ 709.141463] get_prop_batt_temp: get_bat_temp: adc_code(32346) physical (307)
  501. [ 709.193532] get_prop_batt_temp: get_bat_temp: adc_code(32345) physical (307)
  502. [ 749.342977] wlan: [913:E :HDD] Network input is not correct
  503. [ 769.094278] sec_chg_time_management: Charging Time: 540 secs (rechg:0)
  504. [ 769.113143] get_prop_batt_temp: get_bat_temp: adc_code(32334) physical (308)
  505. [ 769.123002] get_prop_batt_temp: get_bat_temp: adc_code(32333) physical (308)
  506. [ 769.123233] sec_bat_monitor: status(4), health(1), batt_present(1), cable(1), siop(100)
  507. [ 769.123464] sec_bat_monitor: soc(100), vcell(4349), current(-38), temperature(308), chg_en(1)
  508. [ 769.123588] sec_bat_monitor: ovp_uvlo(0), second_phase_chg(1), polling_time(60), event(0x0), HT(600), LT(-50)
  509. [ 769.175942] get_prop_batt_temp: get_bat_temp: adc_code(32335) physical (308)
  510. [ 769.200967] get_prop_batt_temp: get_bat_temp: adc_code(32335) physical (308)
  511. [ 769.244079] get_prop_batt_temp: get_bat_temp: adc_code(32333) physical (308)
  512. [ 812.321050] wlan: [913:E :HDD] Network input is not correct
  513. [ 829.154492] sec_chg_time_management: Charging Time: 600 secs (rechg:0)
  514. [ 829.175968] get_prop_batt_temp: get_bat_temp: adc_code(32320) physical (309)
  515. [ 829.185938] get_prop_batt_temp: get_bat_temp: adc_code(32320) physical (309)
  516. [ 829.187764] sec_bat_monitor: status(4), health(1), batt_present(1), cable(1), siop(100)
  517. [ 829.188044] sec_bat_monitor: soc(100), vcell(4349), current(-35), temperature(309), chg_en(1)
  518. [ 829.188294] sec_bat_monitor: ovp_uvlo(0), second_phase_chg(1), polling_time(60), event(0x0), HT(600), LT(-50)
  519. [ 829.234007] get_prop_batt_temp: get_bat_temp: adc_code(32320) physical (309)
  520. [ 829.248325] get_prop_batt_temp: get_bat_temp: adc_code(32320) physical (309)
  521. [ 829.297773] get_prop_batt_temp: get_bat_temp: adc_code(32321) physical (309)
  522. [ 875.304914] wlan: [913:E :HDD] Network input is not correct
  523. [ 884.089783] qpnp_batt_external_power_changed: skip qpnp_batt_external_power_changed
  524. [ 884.142025] power_supply bms: driver failed to report `current_avg' property: 4294967274
  525. [ 889.216021] sec_chg_time_management: Charging Time: 660 secs (rechg:0)
  526. [ 889.235929] get_prop_batt_temp: get_bat_temp: adc_code(32306) physical (310)
  527. [ 889.245981] get_prop_batt_temp: get_bat_temp: adc_code(32306) physical (310)
  528. [ 889.246365] sec_bat_monitor: status(4), health(1), batt_present(1), cable(1), siop(100)
  529. [ 889.247030] sec_bat_monitor: soc(100), vcell(4349), current(-33), temperature(310), chg_en(1)
  530. [ 889.247973] sec_bat_monitor: ovp_uvlo(0), second_phase_chg(1), polling_time(60), event(0x0), HT(600), LT(-50)
  531. [ 889.295781] get_prop_batt_temp: get_bat_temp: adc_code(32308) physical (310)
  532. [ 889.313966] get_prop_batt_temp: get_bat_temp: adc_code(32308) physical (310)
  533. [ 889.359693] get_prop_batt_temp: get_bat_temp: adc_code(32308) physical (310)
  534. [ 938.348799] wlan: [913:E :HDD] Network input is not correct
  535. [ 949.270679] sec_chg_time_management: Charging Time: 720 secs (rechg:0)
  536. [ 949.289676] get_prop_batt_temp: get_bat_temp: adc_code(32296) physical (311)
  537. [ 949.298649] get_prop_batt_temp: get_bat_temp: adc_code(32298) physical (310)
  538. [ 949.298925] sec_bat_monitor: status(4), health(1), batt_present(1), cable(1), siop(100)
  539. [ 949.299159] sec_bat_monitor: soc(100), vcell(4349), current(-32), temperature(311), chg_en(1)
  540. [ 949.299278] sec_bat_monitor: ovp_uvlo(0), second_phase_chg(1), polling_time(60), event(0x0), HT(600), LT(-50)
  541. [ 949.344669] get_prop_batt_temp: get_bat_temp: adc_code(32296) physical (311)
  542. [ 949.359236] get_prop_batt_temp: get_bat_temp: adc_code(32297) physical (311)
  543. [ 949.400467] get_prop_batt_temp: get_bat_temp: adc_code(32297) physical (311)
  544. [ 1001.248994] wlan: [913:E :HDD] Network input is not correct
  545. [ 1009.336385] sec_chg_time_management: Charging Time: 780 secs (rechg:0)
  546. [ 1009.358850] get_prop_batt_temp: get_bat_temp: adc_code(32286) physical (312)
  547. [ 1009.367872] get_prop_batt_temp: get_bat_temp: adc_code(32284) physical (312)
  548. [ 1009.368129] sec_bat_monitor: status(4), health(1), batt_present(1), cable(1), siop(100)
  549. [ 1009.368283] sec_bat_monitor: soc(100), vcell(4349), current(-33), temperature(312), chg_en(1)
  550. [ 1009.368498] sec_bat_monitor: ovp_uvlo(0), second_phase_chg(1), polling_time(60), event(0x0), HT(600), LT(-50)
  551. [ 1009.416676] get_prop_batt_temp: get_bat_temp: adc_code(32285) physical (312)
  552. [ 1009.442536] get_prop_batt_temp: get_bat_temp: adc_code(32285) physical (312)
  553. [ 1009.490999] get_prop_batt_temp: get_bat_temp: adc_code(32283) physical (312)
  554. [ 1030.697915] sec_debug_check_crash_key code 116 value 1 state 0 enable 0
  555. [ 1030.698293] (sec_debug_set_upload_cause) 85
  556. [ 1030.722851] mdss_dsi_event_handler: unhandled event=1
  557. [ 1031.031529] sec_debug_check_crash_key code 116 value 0 state 0 enable 0
  558. [ 1031.031563] (sec_debug_set_upload_cause) cafebabe
  559. [ 1031.042320] to maintain ddefault brightness
  560. [ 1032.064789] mdss_mdp_pipe_init: no 3 type pipes available
  561. [ 1032.064935] mdss_mdp_overlay_pipe_setup: error allocating pipe
  562. [ 1060.933980] qpnp_chg_usb_chg_gone_irq_handler: EXT_OVP disabled
  563. [ 1060.934119] qpnp_chg_usb_chg_gone_irq_handler: chg_gone triggered: disable chg
  564. [ 1060.934350] qpnp_chg_charge_en: qpnp_chg_charge_en called with enable=0
  565. [ 1060.965353] qpnp_chg_usb_usbin_valid_irq_handler: EXT_OVP disabled
  566. [ 1060.965574] qpnp_chg_usb_usbin_valid_irq_handler: USB-IN triggered : usbin UNDER VOLTAGE
  567. [ 1060.965792] qpnp_chg_usb_usbin_valid_irq_handler: Under Voltage - EXT_OVP disabled
  568. [ 1060.967634] sm5502_callback USB Cable Status detached (1)
  569. [ 1060.972292] qpnp_batt_power_set_property: qpnp_batt_power_set_property: cable type changed (1) -> (0)
  570. [ 1060.972522] sec_handle_cable_insertion_removal: cable not connected: cable_type(0)
  571. [ 1060.972638] sec_pm8226_stop_charging: disable charging
  572. [ 1060.972974] qpnp_chg_charge_en: qpnp_chg_charge_en called with enable=0
  573. [ 1060.973118] sec_pm8226_stop_charging: BATTERY FULL stop charging !
  574. [ 1060.973344] qpnp_chg_iusbmax_set: bad mA=0 asked to set
  575. [ 1060.973463] sec_handle_cable_insertion_removal: battery status changed from (4)->(2)
  576. [ 1060.974808] qpnp_batt_external_power_changed: skip qpnp_batt_external_power_changed
  577. [ 1060.990743] sec_chg_time_management: discharging state! timer inactive
  578. [ 1061.009705] get_prop_batt_temp: get_bat_temp: adc_code(32204) physical (318)
  579. [ 1061.037255] get_prop_batt_temp: get_bat_temp: adc_code(32205) physical (318)
  580. [ 1061.046486] get_prop_batt_temp: get_bat_temp: adc_code(32205) physical (318)
  581. [ 1061.046606] sec_bat_monitor: status(2), health(1), batt_present(1), cable(0), siop(100)
  582. [ 1061.046804] sec_bat_monitor: soc(100), vcell(4277), current(363), temperature(318), chg_en(0)
  583. [ 1061.046987] sec_bat_monitor: ovp_uvlo(-1), second_phase_chg(0), polling_time(60), event(0x0), HT(600), LT(-50)
  584. [ 1061.120274] get_prop_batt_temp: get_bat_temp: adc_code(32204) physical (318)
  585. [ 1061.174004] get_prop_batt_temp: get_bat_temp: adc_code(32204) physical (318)
  586. [ 1061.231856] get_prop_batt_temp: get_bat_temp: adc_code(32204) physical (318)
  587. [ 1061.296505] get_prop_batt_temp: get_bat_temp: adc_code(32203) physical (318)
  588. [ 1061.309561] get_prop_batt_temp: get_bat_temp: adc_code(32204) physical (318)
  589. [ 1061.365552] get_prop_batt_temp: get_bat_temp: adc_code(32204) physical (318)
  590. [ 1061.925479] qpnp_arb_stop_work: arb request :chg_en(0), chg_done(0)
  591. [ 1061.926242] qpnp_chg_charge_en: qpnp_chg_charge_en called with enable=1
  592. [ 1061.990701] get_prop_batt_temp: get_bat_temp: adc_code(32204) physical (318)
  593. [ 1062.019089] get_prop_batt_temp: get_bat_temp: adc_code(32203) physical (318)
  594. [ 1062.070444] get_prop_batt_temp: get_bat_temp: adc_code(32204) physical (318)
  595. [ 1063.796728] sec_debug_check_crash_key code 116 value 1 state 0 enable 0
  596. [ 1063.797414] (sec_debug_set_upload_cause) 85
  597. [ 1064.229207] wlan: [913:E :HDD] Network input is not correct
  598.  
  599. No errors detected
RAW Paste Data