Guest User

form engine

a guest
Jun 15th, 2023
48
0
Never
Not a member of Pastebin yet? Sign Up, it unlocks many cool features!
text 113.46 KB | None | 0 0
  1. npm WARN old lockfile
  2. npm WARN old lockfile The package-lock.json file was created with an old version of npm,
  3. npm WARN old lockfile so supplemental metadata must be fetched from the registry.
  4. npm WARN old lockfile
  5. npm WARN old lockfile This is a one-time fix-up, please be patient...
  6. npm WARN old lockfile
  7. npm WARN deprecated ini@1.3.5: Please update to ini >=1.3.6 to avoid a prototype pollution issue
  8. npm WARN deprecated urix@0.1.0: Please see https://github.com/lydell/urix#deprecated
  9. npm WARN deprecated har-validator@5.1.3: this library is no longer supported
  10. npm WARN deprecated debug@4.2.0: Debug versions >=3.2.0 <3.2.7 || >=4 <4.3.1 have a low-severity ReDos regression when used in a Node.js environment. It is recommended you upgrade to 3.2.7 or 4.3.1. (https://github.com/visionmedia/debug/issues/797)
  11. npm WARN deprecated debug@4.2.0: Debug versions >=3.2.0 <3.2.7 || >=4 <4.3.1 have a low-severity ReDos regression when used in a Node.js environment. It is recommended you upgrade to 3.2.7 or 4.3.1. (https://github.com/visionmedia/debug/issues/797)
  12. npm WARN deprecated debug@4.2.0: Debug versions >=3.2.0 <3.2.7 || >=4 <4.3.1 have a low-severity ReDos regression when used in a Node.js environment. It is recommended you upgrade to 3.2.7 or 4.3.1. (https://github.com/visionmedia/debug/issues/797)
  13. npm WARN deprecated debug@4.2.0: Debug versions >=3.2.0 <3.2.7 || >=4 <4.3.1 have a low-severity ReDos regression when used in a Node.js environment. It is recommended you upgrade to 3.2.7 or 4.3.1. (https://github.com/visionmedia/debug/issues/797)
  14. npm WARN deprecated resolve-url@0.2.1: https://github.com/lydell/resolve-url#deprecated
  15. npm WARN deprecated date-format@1.2.0: 1.x is no longer supported. Please upgrade to 4.x or higher.
  16. npm WARN deprecated rollup-plugin-node-resolve@3.4.0: This package has been deprecated and is no longer maintained. Please use @rollup/plugin-node-resolve.
  17. npm WARN deprecated circular-json@0.5.9: CircularJSON is in maintenance only, flatted is its successor.
  18. npm WARN deprecated acorn-dynamic-import@3.0.0: This is probably built in to whatever tool you're using. If you still need it... idk
  19. npm WARN deprecated chokidar@1.7.0: Chokidar 2 will break on node v14+. Upgrade to chokidar 3 with 15x less dependencies.
  20. npm WARN deprecated source-map-url@0.4.0: See https://github.com/lydell/source-map-url#deprecated
  21. npm WARN deprecated chokidar@2.0.4: Chokidar 2 does not receive security updates since 2019. Upgrade to chokidar 3 with 15x fewer dependencies
  22. npm WARN deprecated chokidar@2.0.4: Chokidar 2 does not receive security updates since 2019. Upgrade to chokidar 3 with 15x fewer dependencies
  23. npm WARN deprecated chokidar@2.0.4: Chokidar 2 does not receive security updates since 2019. Upgrade to chokidar 3 with 15x fewer dependencies
  24. npm WARN deprecated chokidar@2.0.4: Chokidar 2 does not receive security updates since 2019. Upgrade to chokidar 3 with 15x fewer dependencies
  25. npm WARN deprecated xmldom@0.1.27: Deprecated due to CVE-2021-21366 resolved in 0.5.0
  26. npm WARN deprecated sourcemap-codec@1.4.8: Please use @jridgewell/sourcemap-codec instead
  27. npm WARN deprecated debug@3.2.6: Debug versions >=3.2.0 <3.2.7 || >=4 <4.3.1 have a low-severity ReDos regression when used in a Node.js environment. It is recommended you upgrade to 3.2.7 or 4.3.1. (https://github.com/visionmedia/debug/issues/797)
  28. npm WARN deprecated debug@3.2.6: Debug versions >=3.2.0 <3.2.7 || >=4 <4.3.1 have a low-severity ReDos regression when used in a Node.js environment. It is recommended you upgrade to 3.2.7 or 4.3.1. (https://github.com/visionmedia/debug/issues/797)
  29. npm WARN deprecated debug@3.2.6: Debug versions >=3.2.0 <3.2.7 || >=4 <4.3.1 have a low-severity ReDos regression when used in a Node.js environment. It is recommended you upgrade to 3.2.7 or 4.3.1. (https://github.com/visionmedia/debug/issues/797)
  30. npm WARN deprecated debug@3.2.6: Debug versions >=3.2.0 <3.2.7 || >=4 <4.3.1 have a low-severity ReDos regression when used in a Node.js environment. It is recommended you upgrade to 3.2.7 or 4.3.1. (https://github.com/visionmedia/debug/issues/797)
  31. npm WARN deprecated debug@3.2.6: Debug versions >=3.2.0 <3.2.7 || >=4 <4.3.1 have a low-severity ReDos regression when used in a Node.js environment. It is recommended you upgrade to 3.2.7 or 4.3.1. (https://github.com/visionmedia/debug/issues/797)
  32. npm WARN deprecated debug@3.2.6: Debug versions >=3.2.0 <3.2.7 || >=4 <4.3.1 have a low-severity ReDos regression when used in a Node.js environment. It is recommended you upgrade to 3.2.7 or 4.3.1. (https://github.com/visionmedia/debug/issues/797)
  33. npm WARN deprecated debug@3.2.6: Debug versions >=3.2.0 <3.2.7 || >=4 <4.3.1 have a low-severity ReDos regression when used in a Node.js environment. It is recommended you upgrade to 3.2.7 or 4.3.1. (https://github.com/visionmedia/debug/issues/797)
  34. npm WARN deprecated debug@3.2.6: Debug versions >=3.2.0 <3.2.7 || >=4 <4.3.1 have a low-severity ReDos regression when used in a Node.js environment. It is recommended you upgrade to 3.2.7 or 4.3.1. (https://github.com/visionmedia/debug/issues/797)
  35. npm WARN deprecated debug@3.2.6: Debug versions >=3.2.0 <3.2.7 || >=4 <4.3.1 have a low-severity ReDos regression when used in a Node.js environment. It is recommended you upgrade to 3.2.7 or 4.3.1. (https://github.com/visionmedia/debug/issues/797)
  36. npm WARN deprecated debug@3.2.6: Debug versions >=3.2.0 <3.2.7 || >=4 <4.3.1 have a low-severity ReDos regression when used in a Node.js environment. It is recommended you upgrade to 3.2.7 or 4.3.1. (https://github.com/visionmedia/debug/issues/797)
  37. npm WARN deprecated debug@3.2.6: Debug versions >=3.2.0 <3.2.7 || >=4 <4.3.1 have a low-severity ReDos regression when used in a Node.js environment. It is recommended you upgrade to 3.2.7 or 4.3.1. (https://github.com/visionmedia/debug/issues/797)
  38. npm WARN deprecated chokidar@2.1.8: Chokidar 2 does not receive security updates since 2019. Upgrade to chokidar 3 with 15x fewer dependencies
  39. npm WARN deprecated querystring@0.2.0: The querystring API is considered Legacy. new code should use the URLSearchParams API instead.
  40. npm WARN deprecated html-webpack-plugin@3.2.0: 3.x is no longer supported
  41. npm WARN deprecated node-fetch-npm@2.0.4: This module is not used anymore, npm uses minipass-fetch for its fetch implementation now
  42. npm WARN deprecated streamroller@0.7.0: 0.x is no longer supported. Please upgrade to 3.x or higher.
  43. npm WARN deprecated uuid@3.4.0: Please upgrade to version 7 or higher. Older versions may use Math.random() in certain circumstances, which is known to be problematic. See https://v8.dev/blog/math-random for details.
  44. npm WARN deprecated uuid@3.3.3: Please upgrade to version 7 or higher. Older versions may use Math.random() in certain circumstances, which is known to be problematic. See https://v8.dev/blog/math-random for details.
  45. npm WARN deprecated source-map-resolve@0.5.2: See https://github.com/lydell/source-map-resolve#deprecated
  46. npm WARN deprecated request@2.88.0: request has been deprecated, see https://github.com/request/request/issues/3142
  47. npm WARN deprecated rollup-plugin-commonjs@9.3.4: This package has been deprecated and is no longer maintained. Please use @rollup/plugin-commonjs.
  48. npm WARN deprecated @schematics/update@0.8.9: This was an internal-only Angular package up through Angular v11 which is no longer used or maintained. Upgrade Angular to v12+ to remove this dependency.
  49. npm WARN deprecated log4js@3.0.6: 3.x is no longer supported. Please upgrade to 6.x or higher.
  50. npm WARN deprecated uglify-es@3.3.9: support for ECMAScript is superseded by `uglify-js` as of v3.13.0
  51. npm WARN deprecated istanbul@0.4.5: This module is no longer maintained, try this instead:
  52. npm WARN deprecated npm i nyc
  53. npm WARN deprecated Visit https://istanbul.js.org/integrations for other alternatives.
  54. npm WARN deprecated protractor@5.4.2: We have news to share - Protractor is deprecated and will reach end-of-life by Summer 2023. To learn more and find out about other options please refer to this post on the Angular blog. Thank you for using and contributing to Protractor. https://goo.gle/state-of-e2e-in-angular
  55. npm WARN deprecated tar@2.2.2: This version of tar is no longer supported, and will not receive security updates. Please upgrade asap.
  56. npm WARN deprecated @angular/http@6.1.10: Package no longer supported. Use @angular/common instead, see https://angular.io/guide/deprecations#angularhttp
  57. npm WARN deprecated core-js@2.6.10: core-js@<3.23.3 is no longer maintained and not recommended for usage due to the number of issues. Because of the V8 engine whims, feature detection in old core-js versions could cause a slowdown up to 100x even if nothing is polyfilled. Some versions have web compatibility issues. Please, upgrade your dependencies to the actual version of core-js.
  58. npm ERR! code 1
  59. npm ERR! path /home/thembo/openmrsprpjects/ngx-openmrs-formentry/node_modules/node-sass
  60. npm ERR! command failed
  61. npm ERR! command sh -c node scripts/build.js
  62. npm ERR! Building: /home/thembo/.nvm/versions/node/v16.19.1/bin/node /home/thembo/openmrsprpjects/ngx-openmrs-formentry/node_modules/node-gyp/bin/node-gyp.js rebuild --verbose --libsass_ext= --libsass_cflags= --libsass_ldflags= --libsass_library=
  63. npm ERR! make: Entering directory '/home/thembo/openmrsprpjects/ngx-openmrs-formentry/node_modules/node-sass/build'
  64. npm ERR! g++ '-DNODE_GYP_MODULE_NAME=libsass' '-DUSING_UV_SHARED=1' '-DUSING_V8_SHARED=1' '-DV8_DEPRECATION_WARNINGS=1' '-DV8_DEPRECATION_WARNINGS' '-DV8_IMMINENT_DEPRECATION_WARNINGS' '-D_GLIBCXX_USE_CXX11_ABI=1' '-D_LARGEFILE_SOURCE' '-D_FILE_OFFSET_BITS=64' '-D__STDC_FORMAT_MACROS' '-DOPENSSL_NO_PINSHARED' '-DOPENSSL_THREADS' '-DLIBSASS_VERSION="3.5.5"' -I/home/thembo/.node-gyp/16.19.1/include/node -I/home/thembo/.node-gyp/16.19.1/src -I/home/thembo/.node-gyp/16.19.1/deps/openssl/config -I/home/thembo/.node-gyp/16.19.1/deps/openssl/openssl/include -I/home/thembo/.node-gyp/16.19.1/deps/uv/include -I/home/thembo/.node-gyp/16.19.1/deps/zlib -I/home/thembo/.node-gyp/16.19.1/deps/v8/include -I../src/libsass/include -fPIC -pthread -Wall -Wextra -Wno-unused-parameter -m64 -O3 -fno-omit-frame-pointer -std=gnu++14 -std=c++0x -fexceptions -frtti -MMD -MF ./Release/.deps/Release/obj.target/libsass/src/libsass/src/ast.o.d.raw -c -o Release/obj.target/libsass/src/libsass/src/ast.o ../src/libsass/src/ast.cpp
  65. npm ERR! g++ '-DNODE_GYP_MODULE_NAME=libsass' '-DUSING_UV_SHARED=1' '-DUSING_V8_SHARED=1' '-DV8_DEPRECATION_WARNINGS=1' '-DV8_DEPRECATION_WARNINGS' '-DV8_IMMINENT_DEPRECATION_WARNINGS' '-D_GLIBCXX_USE_CXX11_ABI=1' '-D_LARGEFILE_SOURCE' '-D_FILE_OFFSET_BITS=64' '-D__STDC_FORMAT_MACROS' '-DOPENSSL_NO_PINSHARED' '-DOPENSSL_THREADS' '-DLIBSASS_VERSION="3.5.5"' -I/home/thembo/.node-gyp/16.19.1/include/node -I/home/thembo/.node-gyp/16.19.1/src -I/home/thembo/.node-gyp/16.19.1/deps/openssl/config -I/home/thembo/.node-gyp/16.19.1/deps/openssl/openssl/include -I/home/thembo/.node-gyp/16.19.1/deps/uv/include -I/home/thembo/.node-gyp/16.19.1/deps/zlib -I/home/thembo/.node-gyp/16.19.1/deps/v8/include -I../src/libsass/include -fPIC -pthread -Wall -Wextra -Wno-unused-parameter -m64 -O3 -fno-omit-frame-pointer -std=gnu++14 -std=c++0x -fexceptions -frtti -MMD -MF ./Release/.deps/Release/obj.target/libsass/src/libsass/src/ast_fwd_decl.o.d.raw -c -o Release/obj.target/libsass/src/libsass/src/ast_fwd_decl.o ../src/libsass/src/ast_fwd_decl.cpp
  66. npm ERR! g++ '-DNODE_GYP_MODULE_NAME=libsass' '-DUSING_UV_SHARED=1' '-DUSING_V8_SHARED=1' '-DV8_DEPRECATION_WARNINGS=1' '-DV8_DEPRECATION_WARNINGS' '-DV8_IMMINENT_DEPRECATION_WARNINGS' '-D_GLIBCXX_USE_CXX11_ABI=1' '-D_LARGEFILE_SOURCE' '-D_FILE_OFFSET_BITS=64' '-D__STDC_FORMAT_MACROS' '-DOPENSSL_NO_PINSHARED' '-DOPENSSL_THREADS' '-DLIBSASS_VERSION="3.5.5"' -I/home/thembo/.node-gyp/16.19.1/include/node -I/home/thembo/.node-gyp/16.19.1/src -I/home/thembo/.node-gyp/16.19.1/deps/openssl/config -I/home/thembo/.node-gyp/16.19.1/deps/openssl/openssl/include -I/home/thembo/.node-gyp/16.19.1/deps/uv/include -I/home/thembo/.node-gyp/16.19.1/deps/zlib -I/home/thembo/.node-gyp/16.19.1/deps/v8/include -I../src/libsass/include -fPIC -pthread -Wall -Wextra -Wno-unused-parameter -m64 -O3 -fno-omit-frame-pointer -std=gnu++14 -std=c++0x -fexceptions -frtti -MMD -MF ./Release/.deps/Release/obj.target/libsass/src/libsass/src/backtrace.o.d.raw -c -o Release/obj.target/libsass/src/libsass/src/backtrace.o ../src/libsass/src/backtrace.cpp
  67. npm ERR! g++ '-DNODE_GYP_MODULE_NAME=libsass' '-DUSING_UV_SHARED=1' '-DUSING_V8_SHARED=1' '-DV8_DEPRECATION_WARNINGS=1' '-DV8_DEPRECATION_WARNINGS' '-DV8_IMMINENT_DEPRECATION_WARNINGS' '-D_GLIBCXX_USE_CXX11_ABI=1' '-D_LARGEFILE_SOURCE' '-D_FILE_OFFSET_BITS=64' '-D__STDC_FORMAT_MACROS' '-DOPENSSL_NO_PINSHARED' '-DOPENSSL_THREADS' '-DLIBSASS_VERSION="3.5.5"' -I/home/thembo/.node-gyp/16.19.1/include/node -I/home/thembo/.node-gyp/16.19.1/src -I/home/thembo/.node-gyp/16.19.1/deps/openssl/config -I/home/thembo/.node-gyp/16.19.1/deps/openssl/openssl/include -I/home/thembo/.node-gyp/16.19.1/deps/uv/include -I/home/thembo/.node-gyp/16.19.1/deps/zlib -I/home/thembo/.node-gyp/16.19.1/deps/v8/include -I../src/libsass/include -fPIC -pthread -Wall -Wextra -Wno-unused-parameter -m64 -O3 -fno-omit-frame-pointer -std=gnu++14 -std=c++0x -fexceptions -frtti -MMD -MF ./Release/.deps/Release/obj.target/libsass/src/libsass/src/base64vlq.o.d.raw -c -o Release/obj.target/libsass/src/libsass/src/base64vlq.o ../src/libsass/src/base64vlq.cpp
  68. npm ERR! g++ '-DNODE_GYP_MODULE_NAME=libsass' '-DUSING_UV_SHARED=1' '-DUSING_V8_SHARED=1' '-DV8_DEPRECATION_WARNINGS=1' '-DV8_DEPRECATION_WARNINGS' '-DV8_IMMINENT_DEPRECATION_WARNINGS' '-D_GLIBCXX_USE_CXX11_ABI=1' '-D_LARGEFILE_SOURCE' '-D_FILE_OFFSET_BITS=64' '-D__STDC_FORMAT_MACROS' '-DOPENSSL_NO_PINSHARED' '-DOPENSSL_THREADS' '-DLIBSASS_VERSION="3.5.5"' -I/home/thembo/.node-gyp/16.19.1/include/node -I/home/thembo/.node-gyp/16.19.1/src -I/home/thembo/.node-gyp/16.19.1/deps/openssl/config -I/home/thembo/.node-gyp/16.19.1/deps/openssl/openssl/include -I/home/thembo/.node-gyp/16.19.1/deps/uv/include -I/home/thembo/.node-gyp/16.19.1/deps/zlib -I/home/thembo/.node-gyp/16.19.1/deps/v8/include -I../src/libsass/include -fPIC -pthread -Wall -Wextra -Wno-unused-parameter -m64 -O3 -fno-omit-frame-pointer -std=gnu++14 -std=c++0x -fexceptions -frtti -MMD -MF ./Release/.deps/Release/obj.target/libsass/src/libsass/src/bind.o.d.raw -c -o Release/obj.target/libsass/src/libsass/src/bind.o ../src/libsass/src/bind.cpp
  69. npm ERR! cc '-DNODE_GYP_MODULE_NAME=libsass' '-DUSING_UV_SHARED=1' '-DUSING_V8_SHARED=1' '-DV8_DEPRECATION_WARNINGS=1' '-DV8_DEPRECATION_WARNINGS' '-DV8_IMMINENT_DEPRECATION_WARNINGS' '-D_GLIBCXX_USE_CXX11_ABI=1' '-D_LARGEFILE_SOURCE' '-D_FILE_OFFSET_BITS=64' '-D__STDC_FORMAT_MACROS' '-DOPENSSL_NO_PINSHARED' '-DOPENSSL_THREADS' '-DLIBSASS_VERSION="3.5.5"' -I/home/thembo/.node-gyp/16.19.1/include/node -I/home/thembo/.node-gyp/16.19.1/src -I/home/thembo/.node-gyp/16.19.1/deps/openssl/config -I/home/thembo/.node-gyp/16.19.1/deps/openssl/openssl/include -I/home/thembo/.node-gyp/16.19.1/deps/uv/include -I/home/thembo/.node-gyp/16.19.1/deps/zlib -I/home/thembo/.node-gyp/16.19.1/deps/v8/include -I../src/libsass/include -fPIC -pthread -Wall -Wextra -Wno-unused-parameter -m64 -O3 -fno-omit-frame-pointer -MMD -MF ./Release/.deps/Release/obj.target/libsass/src/libsass/src/cencode.o.d.raw -c -o Release/obj.target/libsass/src/libsass/src/cencode.o ../src/libsass/src/cencode.c
  70. npm ERR! g++ '-DNODE_GYP_MODULE_NAME=libsass' '-DUSING_UV_SHARED=1' '-DUSING_V8_SHARED=1' '-DV8_DEPRECATION_WARNINGS=1' '-DV8_DEPRECATION_WARNINGS' '-DV8_IMMINENT_DEPRECATION_WARNINGS' '-D_GLIBCXX_USE_CXX11_ABI=1' '-D_LARGEFILE_SOURCE' '-D_FILE_OFFSET_BITS=64' '-D__STDC_FORMAT_MACROS' '-DOPENSSL_NO_PINSHARED' '-DOPENSSL_THREADS' '-DLIBSASS_VERSION="3.5.5"' -I/home/thembo/.node-gyp/16.19.1/include/node -I/home/thembo/.node-gyp/16.19.1/src -I/home/thembo/.node-gyp/16.19.1/deps/openssl/config -I/home/thembo/.node-gyp/16.19.1/deps/openssl/openssl/include -I/home/thembo/.node-gyp/16.19.1/deps/uv/include -I/home/thembo/.node-gyp/16.19.1/deps/zlib -I/home/thembo/.node-gyp/16.19.1/deps/v8/include -I../src/libsass/include -fPIC -pthread -Wall -Wextra -Wno-unused-parameter -m64 -O3 -fno-omit-frame-pointer -std=gnu++14 -std=c++0x -fexceptions -frtti -MMD -MF ./Release/.deps/Release/obj.target/libsass/src/libsass/src/check_nesting.o.d.raw -c -o Release/obj.target/libsass/src/libsass/src/check_nesting.o ../src/libsass/src/check_nesting.cpp
  71. npm ERR! g++ '-DNODE_GYP_MODULE_NAME=libsass' '-DUSING_UV_SHARED=1' '-DUSING_V8_SHARED=1' '-DV8_DEPRECATION_WARNINGS=1' '-DV8_DEPRECATION_WARNINGS' '-DV8_IMMINENT_DEPRECATION_WARNINGS' '-D_GLIBCXX_USE_CXX11_ABI=1' '-D_LARGEFILE_SOURCE' '-D_FILE_OFFSET_BITS=64' '-D__STDC_FORMAT_MACROS' '-DOPENSSL_NO_PINSHARED' '-DOPENSSL_THREADS' '-DLIBSASS_VERSION="3.5.5"' -I/home/thembo/.node-gyp/16.19.1/include/node -I/home/thembo/.node-gyp/16.19.1/src -I/home/thembo/.node-gyp/16.19.1/deps/openssl/config -I/home/thembo/.node-gyp/16.19.1/deps/openssl/openssl/include -I/home/thembo/.node-gyp/16.19.1/deps/uv/include -I/home/thembo/.node-gyp/16.19.1/deps/zlib -I/home/thembo/.node-gyp/16.19.1/deps/v8/include -I../src/libsass/include -fPIC -pthread -Wall -Wextra -Wno-unused-parameter -m64 -O3 -fno-omit-frame-pointer -std=gnu++14 -std=c++0x -fexceptions -frtti -MMD -MF ./Release/.deps/Release/obj.target/libsass/src/libsass/src/color_maps.o.d.raw -c -o Release/obj.target/libsass/src/libsass/src/color_maps.o ../src/libsass/src/color_maps.cpp
  72. npm ERR! g++ '-DNODE_GYP_MODULE_NAME=libsass' '-DUSING_UV_SHARED=1' '-DUSING_V8_SHARED=1' '-DV8_DEPRECATION_WARNINGS=1' '-DV8_DEPRECATION_WARNINGS' '-DV8_IMMINENT_DEPRECATION_WARNINGS' '-D_GLIBCXX_USE_CXX11_ABI=1' '-D_LARGEFILE_SOURCE' '-D_FILE_OFFSET_BITS=64' '-D__STDC_FORMAT_MACROS' '-DOPENSSL_NO_PINSHARED' '-DOPENSSL_THREADS' '-DLIBSASS_VERSION="3.5.5"' -I/home/thembo/.node-gyp/16.19.1/include/node -I/home/thembo/.node-gyp/16.19.1/src -I/home/thembo/.node-gyp/16.19.1/deps/openssl/config -I/home/thembo/.node-gyp/16.19.1/deps/openssl/openssl/include -I/home/thembo/.node-gyp/16.19.1/deps/uv/include -I/home/thembo/.node-gyp/16.19.1/deps/zlib -I/home/thembo/.node-gyp/16.19.1/deps/v8/include -I../src/libsass/include -fPIC -pthread -Wall -Wextra -Wno-unused-parameter -m64 -O3 -fno-omit-frame-pointer -std=gnu++14 -std=c++0x -fexceptions -frtti -MMD -MF ./Release/.deps/Release/obj.target/libsass/src/libsass/src/constants.o.d.raw -c -o Release/obj.target/libsass/src/libsass/src/constants.o ../src/libsass/src/constants.cpp
  73. npm ERR! g++ '-DNODE_GYP_MODULE_NAME=libsass' '-DUSING_UV_SHARED=1' '-DUSING_V8_SHARED=1' '-DV8_DEPRECATION_WARNINGS=1' '-DV8_DEPRECATION_WARNINGS' '-DV8_IMMINENT_DEPRECATION_WARNINGS' '-D_GLIBCXX_USE_CXX11_ABI=1' '-D_LARGEFILE_SOURCE' '-D_FILE_OFFSET_BITS=64' '-D__STDC_FORMAT_MACROS' '-DOPENSSL_NO_PINSHARED' '-DOPENSSL_THREADS' '-DLIBSASS_VERSION="3.5.5"' -I/home/thembo/.node-gyp/16.19.1/include/node -I/home/thembo/.node-gyp/16.19.1/src -I/home/thembo/.node-gyp/16.19.1/deps/openssl/config -I/home/thembo/.node-gyp/16.19.1/deps/openssl/openssl/include -I/home/thembo/.node-gyp/16.19.1/deps/uv/include -I/home/thembo/.node-gyp/16.19.1/deps/zlib -I/home/thembo/.node-gyp/16.19.1/deps/v8/include -I../src/libsass/include -fPIC -pthread -Wall -Wextra -Wno-unused-parameter -m64 -O3 -fno-omit-frame-pointer -std=gnu++14 -std=c++0x -fexceptions -frtti -MMD -MF ./Release/.deps/Release/obj.target/libsass/src/libsass/src/context.o.d.raw -c -o Release/obj.target/libsass/src/libsass/src/context.o ../src/libsass/src/context.cpp
  74. npm ERR! g++ '-DNODE_GYP_MODULE_NAME=libsass' '-DUSING_UV_SHARED=1' '-DUSING_V8_SHARED=1' '-DV8_DEPRECATION_WARNINGS=1' '-DV8_DEPRECATION_WARNINGS' '-DV8_IMMINENT_DEPRECATION_WARNINGS' '-D_GLIBCXX_USE_CXX11_ABI=1' '-D_LARGEFILE_SOURCE' '-D_FILE_OFFSET_BITS=64' '-D__STDC_FORMAT_MACROS' '-DOPENSSL_NO_PINSHARED' '-DOPENSSL_THREADS' '-DLIBSASS_VERSION="3.5.5"' -I/home/thembo/.node-gyp/16.19.1/include/node -I/home/thembo/.node-gyp/16.19.1/src -I/home/thembo/.node-gyp/16.19.1/deps/openssl/config -I/home/thembo/.node-gyp/16.19.1/deps/openssl/openssl/include -I/home/thembo/.node-gyp/16.19.1/deps/uv/include -I/home/thembo/.node-gyp/16.19.1/deps/zlib -I/home/thembo/.node-gyp/16.19.1/deps/v8/include -I../src/libsass/include -fPIC -pthread -Wall -Wextra -Wno-unused-parameter -m64 -O3 -fno-omit-frame-pointer -std=gnu++14 -std=c++0x -fexceptions -frtti -MMD -MF ./Release/.deps/Release/obj.target/libsass/src/libsass/src/cssize.o.d.raw -c -o Release/obj.target/libsass/src/libsass/src/cssize.o ../src/libsass/src/cssize.cpp
  75. npm ERR! g++ '-DNODE_GYP_MODULE_NAME=libsass' '-DUSING_UV_SHARED=1' '-DUSING_V8_SHARED=1' '-DV8_DEPRECATION_WARNINGS=1' '-DV8_DEPRECATION_WARNINGS' '-DV8_IMMINENT_DEPRECATION_WARNINGS' '-D_GLIBCXX_USE_CXX11_ABI=1' '-D_LARGEFILE_SOURCE' '-D_FILE_OFFSET_BITS=64' '-D__STDC_FORMAT_MACROS' '-DOPENSSL_NO_PINSHARED' '-DOPENSSL_THREADS' '-DLIBSASS_VERSION="3.5.5"' -I/home/thembo/.node-gyp/16.19.1/include/node -I/home/thembo/.node-gyp/16.19.1/src -I/home/thembo/.node-gyp/16.19.1/deps/openssl/config -I/home/thembo/.node-gyp/16.19.1/deps/openssl/openssl/include -I/home/thembo/.node-gyp/16.19.1/deps/uv/include -I/home/thembo/.node-gyp/16.19.1/deps/zlib -I/home/thembo/.node-gyp/16.19.1/deps/v8/include -I../src/libsass/include -fPIC -pthread -Wall -Wextra -Wno-unused-parameter -m64 -O3 -fno-omit-frame-pointer -std=gnu++14 -std=c++0x -fexceptions -frtti -MMD -MF ./Release/.deps/Release/obj.target/libsass/src/libsass/src/emitter.o.d.raw -c -o Release/obj.target/libsass/src/libsass/src/emitter.o ../src/libsass/src/emitter.cpp
  76. npm ERR! g++ '-DNODE_GYP_MODULE_NAME=libsass' '-DUSING_UV_SHARED=1' '-DUSING_V8_SHARED=1' '-DV8_DEPRECATION_WARNINGS=1' '-DV8_DEPRECATION_WARNINGS' '-DV8_IMMINENT_DEPRECATION_WARNINGS' '-D_GLIBCXX_USE_CXX11_ABI=1' '-D_LARGEFILE_SOURCE' '-D_FILE_OFFSET_BITS=64' '-D__STDC_FORMAT_MACROS' '-DOPENSSL_NO_PINSHARED' '-DOPENSSL_THREADS' '-DLIBSASS_VERSION="3.5.5"' -I/home/thembo/.node-gyp/16.19.1/include/node -I/home/thembo/.node-gyp/16.19.1/src -I/home/thembo/.node-gyp/16.19.1/deps/openssl/config -I/home/thembo/.node-gyp/16.19.1/deps/openssl/openssl/include -I/home/thembo/.node-gyp/16.19.1/deps/uv/include -I/home/thembo/.node-gyp/16.19.1/deps/zlib -I/home/thembo/.node-gyp/16.19.1/deps/v8/include -I../src/libsass/include -fPIC -pthread -Wall -Wextra -Wno-unused-parameter -m64 -O3 -fno-omit-frame-pointer -std=gnu++14 -std=c++0x -fexceptions -frtti -MMD -MF ./Release/.deps/Release/obj.target/libsass/src/libsass/src/environment.o.d.raw -c -o Release/obj.target/libsass/src/libsass/src/environment.o ../src/libsass/src/environment.cpp
  77. npm ERR! g++ '-DNODE_GYP_MODULE_NAME=libsass' '-DUSING_UV_SHARED=1' '-DUSING_V8_SHARED=1' '-DV8_DEPRECATION_WARNINGS=1' '-DV8_DEPRECATION_WARNINGS' '-DV8_IMMINENT_DEPRECATION_WARNINGS' '-D_GLIBCXX_USE_CXX11_ABI=1' '-D_LARGEFILE_SOURCE' '-D_FILE_OFFSET_BITS=64' '-D__STDC_FORMAT_MACROS' '-DOPENSSL_NO_PINSHARED' '-DOPENSSL_THREADS' '-DLIBSASS_VERSION="3.5.5"' -I/home/thembo/.node-gyp/16.19.1/include/node -I/home/thembo/.node-gyp/16.19.1/src -I/home/thembo/.node-gyp/16.19.1/deps/openssl/config -I/home/thembo/.node-gyp/16.19.1/deps/openssl/openssl/include -I/home/thembo/.node-gyp/16.19.1/deps/uv/include -I/home/thembo/.node-gyp/16.19.1/deps/zlib -I/home/thembo/.node-gyp/16.19.1/deps/v8/include -I../src/libsass/include -fPIC -pthread -Wall -Wextra -Wno-unused-parameter -m64 -O3 -fno-omit-frame-pointer -std=gnu++14 -std=c++0x -fexceptions -frtti -MMD -MF ./Release/.deps/Release/obj.target/libsass/src/libsass/src/error_handling.o.d.raw -c -o Release/obj.target/libsass/src/libsass/src/error_handling.o ../src/libsass/src/error_handling.cpp
  78. npm ERR! g++ '-DNODE_GYP_MODULE_NAME=libsass' '-DUSING_UV_SHARED=1' '-DUSING_V8_SHARED=1' '-DV8_DEPRECATION_WARNINGS=1' '-DV8_DEPRECATION_WARNINGS' '-DV8_IMMINENT_DEPRECATION_WARNINGS' '-D_GLIBCXX_USE_CXX11_ABI=1' '-D_LARGEFILE_SOURCE' '-D_FILE_OFFSET_BITS=64' '-D__STDC_FORMAT_MACROS' '-DOPENSSL_NO_PINSHARED' '-DOPENSSL_THREADS' '-DLIBSASS_VERSION="3.5.5"' -I/home/thembo/.node-gyp/16.19.1/include/node -I/home/thembo/.node-gyp/16.19.1/src -I/home/thembo/.node-gyp/16.19.1/deps/openssl/config -I/home/thembo/.node-gyp/16.19.1/deps/openssl/openssl/include -I/home/thembo/.node-gyp/16.19.1/deps/uv/include -I/home/thembo/.node-gyp/16.19.1/deps/zlib -I/home/thembo/.node-gyp/16.19.1/deps/v8/include -I../src/libsass/include -fPIC -pthread -Wall -Wextra -Wno-unused-parameter -m64 -O3 -fno-omit-frame-pointer -std=gnu++14 -std=c++0x -fexceptions -frtti -MMD -MF ./Release/.deps/Release/obj.target/libsass/src/libsass/src/eval.o.d.raw -c -o Release/obj.target/libsass/src/libsass/src/eval.o ../src/libsass/src/eval.cpp
  79. npm ERR! g++ '-DNODE_GYP_MODULE_NAME=libsass' '-DUSING_UV_SHARED=1' '-DUSING_V8_SHARED=1' '-DV8_DEPRECATION_WARNINGS=1' '-DV8_DEPRECATION_WARNINGS' '-DV8_IMMINENT_DEPRECATION_WARNINGS' '-D_GLIBCXX_USE_CXX11_ABI=1' '-D_LARGEFILE_SOURCE' '-D_FILE_OFFSET_BITS=64' '-D__STDC_FORMAT_MACROS' '-DOPENSSL_NO_PINSHARED' '-DOPENSSL_THREADS' '-DLIBSASS_VERSION="3.5.5"' -I/home/thembo/.node-gyp/16.19.1/include/node -I/home/thembo/.node-gyp/16.19.1/src -I/home/thembo/.node-gyp/16.19.1/deps/openssl/config -I/home/thembo/.node-gyp/16.19.1/deps/openssl/openssl/include -I/home/thembo/.node-gyp/16.19.1/deps/uv/include -I/home/thembo/.node-gyp/16.19.1/deps/zlib -I/home/thembo/.node-gyp/16.19.1/deps/v8/include -I../src/libsass/include -fPIC -pthread -Wall -Wextra -Wno-unused-parameter -m64 -O3 -fno-omit-frame-pointer -std=gnu++14 -std=c++0x -fexceptions -frtti -MMD -MF ./Release/.deps/Release/obj.target/libsass/src/libsass/src/expand.o.d.raw -c -o Release/obj.target/libsass/src/libsass/src/expand.o ../src/libsass/src/expand.cpp
  80. npm ERR! g++ '-DNODE_GYP_MODULE_NAME=libsass' '-DUSING_UV_SHARED=1' '-DUSING_V8_SHARED=1' '-DV8_DEPRECATION_WARNINGS=1' '-DV8_DEPRECATION_WARNINGS' '-DV8_IMMINENT_DEPRECATION_WARNINGS' '-D_GLIBCXX_USE_CXX11_ABI=1' '-D_LARGEFILE_SOURCE' '-D_FILE_OFFSET_BITS=64' '-D__STDC_FORMAT_MACROS' '-DOPENSSL_NO_PINSHARED' '-DOPENSSL_THREADS' '-DLIBSASS_VERSION="3.5.5"' -I/home/thembo/.node-gyp/16.19.1/include/node -I/home/thembo/.node-gyp/16.19.1/src -I/home/thembo/.node-gyp/16.19.1/deps/openssl/config -I/home/thembo/.node-gyp/16.19.1/deps/openssl/openssl/include -I/home/thembo/.node-gyp/16.19.1/deps/uv/include -I/home/thembo/.node-gyp/16.19.1/deps/zlib -I/home/thembo/.node-gyp/16.19.1/deps/v8/include -I../src/libsass/include -fPIC -pthread -Wall -Wextra -Wno-unused-parameter -m64 -O3 -fno-omit-frame-pointer -std=gnu++14 -std=c++0x -fexceptions -frtti -MMD -MF ./Release/.deps/Release/obj.target/libsass/src/libsass/src/extend.o.d.raw -c -o Release/obj.target/libsass/src/libsass/src/extend.o ../src/libsass/src/extend.cpp
  81. npm ERR! g++ '-DNODE_GYP_MODULE_NAME=libsass' '-DUSING_UV_SHARED=1' '-DUSING_V8_SHARED=1' '-DV8_DEPRECATION_WARNINGS=1' '-DV8_DEPRECATION_WARNINGS' '-DV8_IMMINENT_DEPRECATION_WARNINGS' '-D_GLIBCXX_USE_CXX11_ABI=1' '-D_LARGEFILE_SOURCE' '-D_FILE_OFFSET_BITS=64' '-D__STDC_FORMAT_MACROS' '-DOPENSSL_NO_PINSHARED' '-DOPENSSL_THREADS' '-DLIBSASS_VERSION="3.5.5"' -I/home/thembo/.node-gyp/16.19.1/include/node -I/home/thembo/.node-gyp/16.19.1/src -I/home/thembo/.node-gyp/16.19.1/deps/openssl/config -I/home/thembo/.node-gyp/16.19.1/deps/openssl/openssl/include -I/home/thembo/.node-gyp/16.19.1/deps/uv/include -I/home/thembo/.node-gyp/16.19.1/deps/zlib -I/home/thembo/.node-gyp/16.19.1/deps/v8/include -I../src/libsass/include -fPIC -pthread -Wall -Wextra -Wno-unused-parameter -m64 -O3 -fno-omit-frame-pointer -std=gnu++14 -std=c++0x -fexceptions -frtti -MMD -MF ./Release/.deps/Release/obj.target/libsass/src/libsass/src/file.o.d.raw -c -o Release/obj.target/libsass/src/libsass/src/file.o ../src/libsass/src/file.cpp
  82. npm ERR! g++ '-DNODE_GYP_MODULE_NAME=libsass' '-DUSING_UV_SHARED=1' '-DUSING_V8_SHARED=1' '-DV8_DEPRECATION_WARNINGS=1' '-DV8_DEPRECATION_WARNINGS' '-DV8_IMMINENT_DEPRECATION_WARNINGS' '-D_GLIBCXX_USE_CXX11_ABI=1' '-D_LARGEFILE_SOURCE' '-D_FILE_OFFSET_BITS=64' '-D__STDC_FORMAT_MACROS' '-DOPENSSL_NO_PINSHARED' '-DOPENSSL_THREADS' '-DLIBSASS_VERSION="3.5.5"' -I/home/thembo/.node-gyp/16.19.1/include/node -I/home/thembo/.node-gyp/16.19.1/src -I/home/thembo/.node-gyp/16.19.1/deps/openssl/config -I/home/thembo/.node-gyp/16.19.1/deps/openssl/openssl/include -I/home/thembo/.node-gyp/16.19.1/deps/uv/include -I/home/thembo/.node-gyp/16.19.1/deps/zlib -I/home/thembo/.node-gyp/16.19.1/deps/v8/include -I../src/libsass/include -fPIC -pthread -Wall -Wextra -Wno-unused-parameter -m64 -O3 -fno-omit-frame-pointer -std=gnu++14 -std=c++0x -fexceptions -frtti -MMD -MF ./Release/.deps/Release/obj.target/libsass/src/libsass/src/functions.o.d.raw -c -o Release/obj.target/libsass/src/libsass/src/functions.o ../src/libsass/src/functions.cpp
  83. npm ERR! g++ '-DNODE_GYP_MODULE_NAME=libsass' '-DUSING_UV_SHARED=1' '-DUSING_V8_SHARED=1' '-DV8_DEPRECATION_WARNINGS=1' '-DV8_DEPRECATION_WARNINGS' '-DV8_IMMINENT_DEPRECATION_WARNINGS' '-D_GLIBCXX_USE_CXX11_ABI=1' '-D_LARGEFILE_SOURCE' '-D_FILE_OFFSET_BITS=64' '-D__STDC_FORMAT_MACROS' '-DOPENSSL_NO_PINSHARED' '-DOPENSSL_THREADS' '-DLIBSASS_VERSION="3.5.5"' -I/home/thembo/.node-gyp/16.19.1/include/node -I/home/thembo/.node-gyp/16.19.1/src -I/home/thembo/.node-gyp/16.19.1/deps/openssl/config -I/home/thembo/.node-gyp/16.19.1/deps/openssl/openssl/include -I/home/thembo/.node-gyp/16.19.1/deps/uv/include -I/home/thembo/.node-gyp/16.19.1/deps/zlib -I/home/thembo/.node-gyp/16.19.1/deps/v8/include -I../src/libsass/include -fPIC -pthread -Wall -Wextra -Wno-unused-parameter -m64 -O3 -fno-omit-frame-pointer -std=gnu++14 -std=c++0x -fexceptions -frtti -MMD -MF ./Release/.deps/Release/obj.target/libsass/src/libsass/src/inspect.o.d.raw -c -o Release/obj.target/libsass/src/libsass/src/inspect.o ../src/libsass/src/inspect.cpp
  84. npm ERR! g++ '-DNODE_GYP_MODULE_NAME=libsass' '-DUSING_UV_SHARED=1' '-DUSING_V8_SHARED=1' '-DV8_DEPRECATION_WARNINGS=1' '-DV8_DEPRECATION_WARNINGS' '-DV8_IMMINENT_DEPRECATION_WARNINGS' '-D_GLIBCXX_USE_CXX11_ABI=1' '-D_LARGEFILE_SOURCE' '-D_FILE_OFFSET_BITS=64' '-D__STDC_FORMAT_MACROS' '-DOPENSSL_NO_PINSHARED' '-DOPENSSL_THREADS' '-DLIBSASS_VERSION="3.5.5"' -I/home/thembo/.node-gyp/16.19.1/include/node -I/home/thembo/.node-gyp/16.19.1/src -I/home/thembo/.node-gyp/16.19.1/deps/openssl/config -I/home/thembo/.node-gyp/16.19.1/deps/openssl/openssl/include -I/home/thembo/.node-gyp/16.19.1/deps/uv/include -I/home/thembo/.node-gyp/16.19.1/deps/zlib -I/home/thembo/.node-gyp/16.19.1/deps/v8/include -I../src/libsass/include -fPIC -pthread -Wall -Wextra -Wno-unused-parameter -m64 -O3 -fno-omit-frame-pointer -std=gnu++14 -std=c++0x -fexceptions -frtti -MMD -MF ./Release/.deps/Release/obj.target/libsass/src/libsass/src/json.o.d.raw -c -o Release/obj.target/libsass/src/libsass/src/json.o ../src/libsass/src/json.cpp
  85. npm ERR! g++ '-DNODE_GYP_MODULE_NAME=libsass' '-DUSING_UV_SHARED=1' '-DUSING_V8_SHARED=1' '-DV8_DEPRECATION_WARNINGS=1' '-DV8_DEPRECATION_WARNINGS' '-DV8_IMMINENT_DEPRECATION_WARNINGS' '-D_GLIBCXX_USE_CXX11_ABI=1' '-D_LARGEFILE_SOURCE' '-D_FILE_OFFSET_BITS=64' '-D__STDC_FORMAT_MACROS' '-DOPENSSL_NO_PINSHARED' '-DOPENSSL_THREADS' '-DLIBSASS_VERSION="3.5.5"' -I/home/thembo/.node-gyp/16.19.1/include/node -I/home/thembo/.node-gyp/16.19.1/src -I/home/thembo/.node-gyp/16.19.1/deps/openssl/config -I/home/thembo/.node-gyp/16.19.1/deps/openssl/openssl/include -I/home/thembo/.node-gyp/16.19.1/deps/uv/include -I/home/thembo/.node-gyp/16.19.1/deps/zlib -I/home/thembo/.node-gyp/16.19.1/deps/v8/include -I../src/libsass/include -fPIC -pthread -Wall -Wextra -Wno-unused-parameter -m64 -O3 -fno-omit-frame-pointer -std=gnu++14 -std=c++0x -fexceptions -frtti -MMD -MF ./Release/.deps/Release/obj.target/libsass/src/libsass/src/lexer.o.d.raw -c -o Release/obj.target/libsass/src/libsass/src/lexer.o ../src/libsass/src/lexer.cpp
  86. npm ERR! g++ '-DNODE_GYP_MODULE_NAME=libsass' '-DUSING_UV_SHARED=1' '-DUSING_V8_SHARED=1' '-DV8_DEPRECATION_WARNINGS=1' '-DV8_DEPRECATION_WARNINGS' '-DV8_IMMINENT_DEPRECATION_WARNINGS' '-D_GLIBCXX_USE_CXX11_ABI=1' '-D_LARGEFILE_SOURCE' '-D_FILE_OFFSET_BITS=64' '-D__STDC_FORMAT_MACROS' '-DOPENSSL_NO_PINSHARED' '-DOPENSSL_THREADS' '-DLIBSASS_VERSION="3.5.5"' -I/home/thembo/.node-gyp/16.19.1/include/node -I/home/thembo/.node-gyp/16.19.1/src -I/home/thembo/.node-gyp/16.19.1/deps/openssl/config -I/home/thembo/.node-gyp/16.19.1/deps/openssl/openssl/include -I/home/thembo/.node-gyp/16.19.1/deps/uv/include -I/home/thembo/.node-gyp/16.19.1/deps/zlib -I/home/thembo/.node-gyp/16.19.1/deps/v8/include -I../src/libsass/include -fPIC -pthread -Wall -Wextra -Wno-unused-parameter -m64 -O3 -fno-omit-frame-pointer -std=gnu++14 -std=c++0x -fexceptions -frtti -MMD -MF ./Release/.deps/Release/obj.target/libsass/src/libsass/src/listize.o.d.raw -c -o Release/obj.target/libsass/src/libsass/src/listize.o ../src/libsass/src/listize.cpp
  87. npm ERR! g++ '-DNODE_GYP_MODULE_NAME=libsass' '-DUSING_UV_SHARED=1' '-DUSING_V8_SHARED=1' '-DV8_DEPRECATION_WARNINGS=1' '-DV8_DEPRECATION_WARNINGS' '-DV8_IMMINENT_DEPRECATION_WARNINGS' '-D_GLIBCXX_USE_CXX11_ABI=1' '-D_LARGEFILE_SOURCE' '-D_FILE_OFFSET_BITS=64' '-D__STDC_FORMAT_MACROS' '-DOPENSSL_NO_PINSHARED' '-DOPENSSL_THREADS' '-DLIBSASS_VERSION="3.5.5"' -I/home/thembo/.node-gyp/16.19.1/include/node -I/home/thembo/.node-gyp/16.19.1/src -I/home/thembo/.node-gyp/16.19.1/deps/openssl/config -I/home/thembo/.node-gyp/16.19.1/deps/openssl/openssl/include -I/home/thembo/.node-gyp/16.19.1/deps/uv/include -I/home/thembo/.node-gyp/16.19.1/deps/zlib -I/home/thembo/.node-gyp/16.19.1/deps/v8/include -I../src/libsass/include -fPIC -pthread -Wall -Wextra -Wno-unused-parameter -m64 -O3 -fno-omit-frame-pointer -std=gnu++14 -std=c++0x -fexceptions -frtti -MMD -MF ./Release/.deps/Release/obj.target/libsass/src/libsass/src/memory/SharedPtr.o.d.raw -c -o Release/obj.target/libsass/src/libsass/src/memory/SharedPtr.o ../src/libsass/src/memory/SharedPtr.cpp
  88. npm ERR! g++ '-DNODE_GYP_MODULE_NAME=libsass' '-DUSING_UV_SHARED=1' '-DUSING_V8_SHARED=1' '-DV8_DEPRECATION_WARNINGS=1' '-DV8_DEPRECATION_WARNINGS' '-DV8_IMMINENT_DEPRECATION_WARNINGS' '-D_GLIBCXX_USE_CXX11_ABI=1' '-D_LARGEFILE_SOURCE' '-D_FILE_OFFSET_BITS=64' '-D__STDC_FORMAT_MACROS' '-DOPENSSL_NO_PINSHARED' '-DOPENSSL_THREADS' '-DLIBSASS_VERSION="3.5.5"' -I/home/thembo/.node-gyp/16.19.1/include/node -I/home/thembo/.node-gyp/16.19.1/src -I/home/thembo/.node-gyp/16.19.1/deps/openssl/config -I/home/thembo/.node-gyp/16.19.1/deps/openssl/openssl/include -I/home/thembo/.node-gyp/16.19.1/deps/uv/include -I/home/thembo/.node-gyp/16.19.1/deps/zlib -I/home/thembo/.node-gyp/16.19.1/deps/v8/include -I../src/libsass/include -fPIC -pthread -Wall -Wextra -Wno-unused-parameter -m64 -O3 -fno-omit-frame-pointer -std=gnu++14 -std=c++0x -fexceptions -frtti -MMD -MF ./Release/.deps/Release/obj.target/libsass/src/libsass/src/node.o.d.raw -c -o Release/obj.target/libsass/src/libsass/src/node.o ../src/libsass/src/node.cpp
  89. npm ERR! g++ '-DNODE_GYP_MODULE_NAME=libsass' '-DUSING_UV_SHARED=1' '-DUSING_V8_SHARED=1' '-DV8_DEPRECATION_WARNINGS=1' '-DV8_DEPRECATION_WARNINGS' '-DV8_IMMINENT_DEPRECATION_WARNINGS' '-D_GLIBCXX_USE_CXX11_ABI=1' '-D_LARGEFILE_SOURCE' '-D_FILE_OFFSET_BITS=64' '-D__STDC_FORMAT_MACROS' '-DOPENSSL_NO_PINSHARED' '-DOPENSSL_THREADS' '-DLIBSASS_VERSION="3.5.5"' -I/home/thembo/.node-gyp/16.19.1/include/node -I/home/thembo/.node-gyp/16.19.1/src -I/home/thembo/.node-gyp/16.19.1/deps/openssl/config -I/home/thembo/.node-gyp/16.19.1/deps/openssl/openssl/include -I/home/thembo/.node-gyp/16.19.1/deps/uv/include -I/home/thembo/.node-gyp/16.19.1/deps/zlib -I/home/thembo/.node-gyp/16.19.1/deps/v8/include -I../src/libsass/include -fPIC -pthread -Wall -Wextra -Wno-unused-parameter -m64 -O3 -fno-omit-frame-pointer -std=gnu++14 -std=c++0x -fexceptions -frtti -MMD -MF ./Release/.deps/Release/obj.target/libsass/src/libsass/src/operators.o.d.raw -c -o Release/obj.target/libsass/src/libsass/src/operators.o ../src/libsass/src/operators.cpp
  90. npm ERR! g++ '-DNODE_GYP_MODULE_NAME=libsass' '-DUSING_UV_SHARED=1' '-DUSING_V8_SHARED=1' '-DV8_DEPRECATION_WARNINGS=1' '-DV8_DEPRECATION_WARNINGS' '-DV8_IMMINENT_DEPRECATION_WARNINGS' '-D_GLIBCXX_USE_CXX11_ABI=1' '-D_LARGEFILE_SOURCE' '-D_FILE_OFFSET_BITS=64' '-D__STDC_FORMAT_MACROS' '-DOPENSSL_NO_PINSHARED' '-DOPENSSL_THREADS' '-DLIBSASS_VERSION="3.5.5"' -I/home/thembo/.node-gyp/16.19.1/include/node -I/home/thembo/.node-gyp/16.19.1/src -I/home/thembo/.node-gyp/16.19.1/deps/openssl/config -I/home/thembo/.node-gyp/16.19.1/deps/openssl/openssl/include -I/home/thembo/.node-gyp/16.19.1/deps/uv/include -I/home/thembo/.node-gyp/16.19.1/deps/zlib -I/home/thembo/.node-gyp/16.19.1/deps/v8/include -I../src/libsass/include -fPIC -pthread -Wall -Wextra -Wno-unused-parameter -m64 -O3 -fno-omit-frame-pointer -std=gnu++14 -std=c++0x -fexceptions -frtti -MMD -MF ./Release/.deps/Release/obj.target/libsass/src/libsass/src/output.o.d.raw -c -o Release/obj.target/libsass/src/libsass/src/output.o ../src/libsass/src/output.cpp
  91. npm ERR! g++ '-DNODE_GYP_MODULE_NAME=libsass' '-DUSING_UV_SHARED=1' '-DUSING_V8_SHARED=1' '-DV8_DEPRECATION_WARNINGS=1' '-DV8_DEPRECATION_WARNINGS' '-DV8_IMMINENT_DEPRECATION_WARNINGS' '-D_GLIBCXX_USE_CXX11_ABI=1' '-D_LARGEFILE_SOURCE' '-D_FILE_OFFSET_BITS=64' '-D__STDC_FORMAT_MACROS' '-DOPENSSL_NO_PINSHARED' '-DOPENSSL_THREADS' '-DLIBSASS_VERSION="3.5.5"' -I/home/thembo/.node-gyp/16.19.1/include/node -I/home/thembo/.node-gyp/16.19.1/src -I/home/thembo/.node-gyp/16.19.1/deps/openssl/config -I/home/thembo/.node-gyp/16.19.1/deps/openssl/openssl/include -I/home/thembo/.node-gyp/16.19.1/deps/uv/include -I/home/thembo/.node-gyp/16.19.1/deps/zlib -I/home/thembo/.node-gyp/16.19.1/deps/v8/include -I../src/libsass/include -fPIC -pthread -Wall -Wextra -Wno-unused-parameter -m64 -O3 -fno-omit-frame-pointer -std=gnu++14 -std=c++0x -fexceptions -frtti -MMD -MF ./Release/.deps/Release/obj.target/libsass/src/libsass/src/parser.o.d.raw -c -o Release/obj.target/libsass/src/libsass/src/parser.o ../src/libsass/src/parser.cpp
  92. npm ERR! g++ '-DNODE_GYP_MODULE_NAME=libsass' '-DUSING_UV_SHARED=1' '-DUSING_V8_SHARED=1' '-DV8_DEPRECATION_WARNINGS=1' '-DV8_DEPRECATION_WARNINGS' '-DV8_IMMINENT_DEPRECATION_WARNINGS' '-D_GLIBCXX_USE_CXX11_ABI=1' '-D_LARGEFILE_SOURCE' '-D_FILE_OFFSET_BITS=64' '-D__STDC_FORMAT_MACROS' '-DOPENSSL_NO_PINSHARED' '-DOPENSSL_THREADS' '-DLIBSASS_VERSION="3.5.5"' -I/home/thembo/.node-gyp/16.19.1/include/node -I/home/thembo/.node-gyp/16.19.1/src -I/home/thembo/.node-gyp/16.19.1/deps/openssl/config -I/home/thembo/.node-gyp/16.19.1/deps/openssl/openssl/include -I/home/thembo/.node-gyp/16.19.1/deps/uv/include -I/home/thembo/.node-gyp/16.19.1/deps/zlib -I/home/thembo/.node-gyp/16.19.1/deps/v8/include -I../src/libsass/include -fPIC -pthread -Wall -Wextra -Wno-unused-parameter -m64 -O3 -fno-omit-frame-pointer -std=gnu++14 -std=c++0x -fexceptions -frtti -MMD -MF ./Release/.deps/Release/obj.target/libsass/src/libsass/src/plugins.o.d.raw -c -o Release/obj.target/libsass/src/libsass/src/plugins.o ../src/libsass/src/plugins.cpp
  93. npm ERR! g++ '-DNODE_GYP_MODULE_NAME=libsass' '-DUSING_UV_SHARED=1' '-DUSING_V8_SHARED=1' '-DV8_DEPRECATION_WARNINGS=1' '-DV8_DEPRECATION_WARNINGS' '-DV8_IMMINENT_DEPRECATION_WARNINGS' '-D_GLIBCXX_USE_CXX11_ABI=1' '-D_LARGEFILE_SOURCE' '-D_FILE_OFFSET_BITS=64' '-D__STDC_FORMAT_MACROS' '-DOPENSSL_NO_PINSHARED' '-DOPENSSL_THREADS' '-DLIBSASS_VERSION="3.5.5"' -I/home/thembo/.node-gyp/16.19.1/include/node -I/home/thembo/.node-gyp/16.19.1/src -I/home/thembo/.node-gyp/16.19.1/deps/openssl/config -I/home/thembo/.node-gyp/16.19.1/deps/openssl/openssl/include -I/home/thembo/.node-gyp/16.19.1/deps/uv/include -I/home/thembo/.node-gyp/16.19.1/deps/zlib -I/home/thembo/.node-gyp/16.19.1/deps/v8/include -I../src/libsass/include -fPIC -pthread -Wall -Wextra -Wno-unused-parameter -m64 -O3 -fno-omit-frame-pointer -std=gnu++14 -std=c++0x -fexceptions -frtti -MMD -MF ./Release/.deps/Release/obj.target/libsass/src/libsass/src/position.o.d.raw -c -o Release/obj.target/libsass/src/libsass/src/position.o ../src/libsass/src/position.cpp
  94. npm ERR! g++ '-DNODE_GYP_MODULE_NAME=libsass' '-DUSING_UV_SHARED=1' '-DUSING_V8_SHARED=1' '-DV8_DEPRECATION_WARNINGS=1' '-DV8_DEPRECATION_WARNINGS' '-DV8_IMMINENT_DEPRECATION_WARNINGS' '-D_GLIBCXX_USE_CXX11_ABI=1' '-D_LARGEFILE_SOURCE' '-D_FILE_OFFSET_BITS=64' '-D__STDC_FORMAT_MACROS' '-DOPENSSL_NO_PINSHARED' '-DOPENSSL_THREADS' '-DLIBSASS_VERSION="3.5.5"' -I/home/thembo/.node-gyp/16.19.1/include/node -I/home/thembo/.node-gyp/16.19.1/src -I/home/thembo/.node-gyp/16.19.1/deps/openssl/config -I/home/thembo/.node-gyp/16.19.1/deps/openssl/openssl/include -I/home/thembo/.node-gyp/16.19.1/deps/uv/include -I/home/thembo/.node-gyp/16.19.1/deps/zlib -I/home/thembo/.node-gyp/16.19.1/deps/v8/include -I../src/libsass/include -fPIC -pthread -Wall -Wextra -Wno-unused-parameter -m64 -O3 -fno-omit-frame-pointer -std=gnu++14 -std=c++0x -fexceptions -frtti -MMD -MF ./Release/.deps/Release/obj.target/libsass/src/libsass/src/prelexer.o.d.raw -c -o Release/obj.target/libsass/src/libsass/src/prelexer.o ../src/libsass/src/prelexer.cpp
  95. npm ERR! g++ '-DNODE_GYP_MODULE_NAME=libsass' '-DUSING_UV_SHARED=1' '-DUSING_V8_SHARED=1' '-DV8_DEPRECATION_WARNINGS=1' '-DV8_DEPRECATION_WARNINGS' '-DV8_IMMINENT_DEPRECATION_WARNINGS' '-D_GLIBCXX_USE_CXX11_ABI=1' '-D_LARGEFILE_SOURCE' '-D_FILE_OFFSET_BITS=64' '-D__STDC_FORMAT_MACROS' '-DOPENSSL_NO_PINSHARED' '-DOPENSSL_THREADS' '-DLIBSASS_VERSION="3.5.5"' -I/home/thembo/.node-gyp/16.19.1/include/node -I/home/thembo/.node-gyp/16.19.1/src -I/home/thembo/.node-gyp/16.19.1/deps/openssl/config -I/home/thembo/.node-gyp/16.19.1/deps/openssl/openssl/include -I/home/thembo/.node-gyp/16.19.1/deps/uv/include -I/home/thembo/.node-gyp/16.19.1/deps/zlib -I/home/thembo/.node-gyp/16.19.1/deps/v8/include -I../src/libsass/include -fPIC -pthread -Wall -Wextra -Wno-unused-parameter -m64 -O3 -fno-omit-frame-pointer -std=gnu++14 -std=c++0x -fexceptions -frtti -MMD -MF ./Release/.deps/Release/obj.target/libsass/src/libsass/src/remove_placeholders.o.d.raw -c -o Release/obj.target/libsass/src/libsass/src/remove_placeholders.o ../src/libsass/src/remove_placeholders.cpp
  96. npm ERR! g++ '-DNODE_GYP_MODULE_NAME=libsass' '-DUSING_UV_SHARED=1' '-DUSING_V8_SHARED=1' '-DV8_DEPRECATION_WARNINGS=1' '-DV8_DEPRECATION_WARNINGS' '-DV8_IMMINENT_DEPRECATION_WARNINGS' '-D_GLIBCXX_USE_CXX11_ABI=1' '-D_LARGEFILE_SOURCE' '-D_FILE_OFFSET_BITS=64' '-D__STDC_FORMAT_MACROS' '-DOPENSSL_NO_PINSHARED' '-DOPENSSL_THREADS' '-DLIBSASS_VERSION="3.5.5"' -I/home/thembo/.node-gyp/16.19.1/include/node -I/home/thembo/.node-gyp/16.19.1/src -I/home/thembo/.node-gyp/16.19.1/deps/openssl/config -I/home/thembo/.node-gyp/16.19.1/deps/openssl/openssl/include -I/home/thembo/.node-gyp/16.19.1/deps/uv/include -I/home/thembo/.node-gyp/16.19.1/deps/zlib -I/home/thembo/.node-gyp/16.19.1/deps/v8/include -I../src/libsass/include -fPIC -pthread -Wall -Wextra -Wno-unused-parameter -m64 -O3 -fno-omit-frame-pointer -std=gnu++14 -std=c++0x -fexceptions -frtti -MMD -MF ./Release/.deps/Release/obj.target/libsass/src/libsass/src/sass.o.d.raw -c -o Release/obj.target/libsass/src/libsass/src/sass.o ../src/libsass/src/sass.cpp
  97. npm ERR! g++ '-DNODE_GYP_MODULE_NAME=libsass' '-DUSING_UV_SHARED=1' '-DUSING_V8_SHARED=1' '-DV8_DEPRECATION_WARNINGS=1' '-DV8_DEPRECATION_WARNINGS' '-DV8_IMMINENT_DEPRECATION_WARNINGS' '-D_GLIBCXX_USE_CXX11_ABI=1' '-D_LARGEFILE_SOURCE' '-D_FILE_OFFSET_BITS=64' '-D__STDC_FORMAT_MACROS' '-DOPENSSL_NO_PINSHARED' '-DOPENSSL_THREADS' '-DLIBSASS_VERSION="3.5.5"' -I/home/thembo/.node-gyp/16.19.1/include/node -I/home/thembo/.node-gyp/16.19.1/src -I/home/thembo/.node-gyp/16.19.1/deps/openssl/config -I/home/thembo/.node-gyp/16.19.1/deps/openssl/openssl/include -I/home/thembo/.node-gyp/16.19.1/deps/uv/include -I/home/thembo/.node-gyp/16.19.1/deps/zlib -I/home/thembo/.node-gyp/16.19.1/deps/v8/include -I../src/libsass/include -fPIC -pthread -Wall -Wextra -Wno-unused-parameter -m64 -O3 -fno-omit-frame-pointer -std=gnu++14 -std=c++0x -fexceptions -frtti -MMD -MF ./Release/.deps/Release/obj.target/libsass/src/libsass/src/sass2scss.o.d.raw -c -o Release/obj.target/libsass/src/libsass/src/sass2scss.o ../src/libsass/src/sass2scss.cpp
  98. npm ERR! g++ '-DNODE_GYP_MODULE_NAME=libsass' '-DUSING_UV_SHARED=1' '-DUSING_V8_SHARED=1' '-DV8_DEPRECATION_WARNINGS=1' '-DV8_DEPRECATION_WARNINGS' '-DV8_IMMINENT_DEPRECATION_WARNINGS' '-D_GLIBCXX_USE_CXX11_ABI=1' '-D_LARGEFILE_SOURCE' '-D_FILE_OFFSET_BITS=64' '-D__STDC_FORMAT_MACROS' '-DOPENSSL_NO_PINSHARED' '-DOPENSSL_THREADS' '-DLIBSASS_VERSION="3.5.5"' -I/home/thembo/.node-gyp/16.19.1/include/node -I/home/thembo/.node-gyp/16.19.1/src -I/home/thembo/.node-gyp/16.19.1/deps/openssl/config -I/home/thembo/.node-gyp/16.19.1/deps/openssl/openssl/include -I/home/thembo/.node-gyp/16.19.1/deps/uv/include -I/home/thembo/.node-gyp/16.19.1/deps/zlib -I/home/thembo/.node-gyp/16.19.1/deps/v8/include -I../src/libsass/include -fPIC -pthread -Wall -Wextra -Wno-unused-parameter -m64 -O3 -fno-omit-frame-pointer -std=gnu++14 -std=c++0x -fexceptions -frtti -MMD -MF ./Release/.deps/Release/obj.target/libsass/src/libsass/src/sass_context.o.d.raw -c -o Release/obj.target/libsass/src/libsass/src/sass_context.o ../src/libsass/src/sass_context.cpp
  99. npm ERR! g++ '-DNODE_GYP_MODULE_NAME=libsass' '-DUSING_UV_SHARED=1' '-DUSING_V8_SHARED=1' '-DV8_DEPRECATION_WARNINGS=1' '-DV8_DEPRECATION_WARNINGS' '-DV8_IMMINENT_DEPRECATION_WARNINGS' '-D_GLIBCXX_USE_CXX11_ABI=1' '-D_LARGEFILE_SOURCE' '-D_FILE_OFFSET_BITS=64' '-D__STDC_FORMAT_MACROS' '-DOPENSSL_NO_PINSHARED' '-DOPENSSL_THREADS' '-DLIBSASS_VERSION="3.5.5"' -I/home/thembo/.node-gyp/16.19.1/include/node -I/home/thembo/.node-gyp/16.19.1/src -I/home/thembo/.node-gyp/16.19.1/deps/openssl/config -I/home/thembo/.node-gyp/16.19.1/deps/openssl/openssl/include -I/home/thembo/.node-gyp/16.19.1/deps/uv/include -I/home/thembo/.node-gyp/16.19.1/deps/zlib -I/home/thembo/.node-gyp/16.19.1/deps/v8/include -I../src/libsass/include -fPIC -pthread -Wall -Wextra -Wno-unused-parameter -m64 -O3 -fno-omit-frame-pointer -std=gnu++14 -std=c++0x -fexceptions -frtti -MMD -MF ./Release/.deps/Release/obj.target/libsass/src/libsass/src/sass_functions.o.d.raw -c -o Release/obj.target/libsass/src/libsass/src/sass_functions.o ../src/libsass/src/sass_functions.cpp
  100. npm ERR! g++ '-DNODE_GYP_MODULE_NAME=libsass' '-DUSING_UV_SHARED=1' '-DUSING_V8_SHARED=1' '-DV8_DEPRECATION_WARNINGS=1' '-DV8_DEPRECATION_WARNINGS' '-DV8_IMMINENT_DEPRECATION_WARNINGS' '-D_GLIBCXX_USE_CXX11_ABI=1' '-D_LARGEFILE_SOURCE' '-D_FILE_OFFSET_BITS=64' '-D__STDC_FORMAT_MACROS' '-DOPENSSL_NO_PINSHARED' '-DOPENSSL_THREADS' '-DLIBSASS_VERSION="3.5.5"' -I/home/thembo/.node-gyp/16.19.1/include/node -I/home/thembo/.node-gyp/16.19.1/src -I/home/thembo/.node-gyp/16.19.1/deps/openssl/config -I/home/thembo/.node-gyp/16.19.1/deps/openssl/openssl/include -I/home/thembo/.node-gyp/16.19.1/deps/uv/include -I/home/thembo/.node-gyp/16.19.1/deps/zlib -I/home/thembo/.node-gyp/16.19.1/deps/v8/include -I../src/libsass/include -fPIC -pthread -Wall -Wextra -Wno-unused-parameter -m64 -O3 -fno-omit-frame-pointer -std=gnu++14 -std=c++0x -fexceptions -frtti -MMD -MF ./Release/.deps/Release/obj.target/libsass/src/libsass/src/sass_util.o.d.raw -c -o Release/obj.target/libsass/src/libsass/src/sass_util.o ../src/libsass/src/sass_util.cpp
  101. npm ERR! g++ '-DNODE_GYP_MODULE_NAME=libsass' '-DUSING_UV_SHARED=1' '-DUSING_V8_SHARED=1' '-DV8_DEPRECATION_WARNINGS=1' '-DV8_DEPRECATION_WARNINGS' '-DV8_IMMINENT_DEPRECATION_WARNINGS' '-D_GLIBCXX_USE_CXX11_ABI=1' '-D_LARGEFILE_SOURCE' '-D_FILE_OFFSET_BITS=64' '-D__STDC_FORMAT_MACROS' '-DOPENSSL_NO_PINSHARED' '-DOPENSSL_THREADS' '-DLIBSASS_VERSION="3.5.5"' -I/home/thembo/.node-gyp/16.19.1/include/node -I/home/thembo/.node-gyp/16.19.1/src -I/home/thembo/.node-gyp/16.19.1/deps/openssl/config -I/home/thembo/.node-gyp/16.19.1/deps/openssl/openssl/include -I/home/thembo/.node-gyp/16.19.1/deps/uv/include -I/home/thembo/.node-gyp/16.19.1/deps/zlib -I/home/thembo/.node-gyp/16.19.1/deps/v8/include -I../src/libsass/include -fPIC -pthread -Wall -Wextra -Wno-unused-parameter -m64 -O3 -fno-omit-frame-pointer -std=gnu++14 -std=c++0x -fexceptions -frtti -MMD -MF ./Release/.deps/Release/obj.target/libsass/src/libsass/src/sass_values.o.d.raw -c -o Release/obj.target/libsass/src/libsass/src/sass_values.o ../src/libsass/src/sass_values.cpp
  102. npm ERR! g++ '-DNODE_GYP_MODULE_NAME=libsass' '-DUSING_UV_SHARED=1' '-DUSING_V8_SHARED=1' '-DV8_DEPRECATION_WARNINGS=1' '-DV8_DEPRECATION_WARNINGS' '-DV8_IMMINENT_DEPRECATION_WARNINGS' '-D_GLIBCXX_USE_CXX11_ABI=1' '-D_LARGEFILE_SOURCE' '-D_FILE_OFFSET_BITS=64' '-D__STDC_FORMAT_MACROS' '-DOPENSSL_NO_PINSHARED' '-DOPENSSL_THREADS' '-DLIBSASS_VERSION="3.5.5"' -I/home/thembo/.node-gyp/16.19.1/include/node -I/home/thembo/.node-gyp/16.19.1/src -I/home/thembo/.node-gyp/16.19.1/deps/openssl/config -I/home/thembo/.node-gyp/16.19.1/deps/openssl/openssl/include -I/home/thembo/.node-gyp/16.19.1/deps/uv/include -I/home/thembo/.node-gyp/16.19.1/deps/zlib -I/home/thembo/.node-gyp/16.19.1/deps/v8/include -I../src/libsass/include -fPIC -pthread -Wall -Wextra -Wno-unused-parameter -m64 -O3 -fno-omit-frame-pointer -std=gnu++14 -std=c++0x -fexceptions -frtti -MMD -MF ./Release/.deps/Release/obj.target/libsass/src/libsass/src/source_map.o.d.raw -c -o Release/obj.target/libsass/src/libsass/src/source_map.o ../src/libsass/src/source_map.cpp
  103. npm ERR! g++ '-DNODE_GYP_MODULE_NAME=libsass' '-DUSING_UV_SHARED=1' '-DUSING_V8_SHARED=1' '-DV8_DEPRECATION_WARNINGS=1' '-DV8_DEPRECATION_WARNINGS' '-DV8_IMMINENT_DEPRECATION_WARNINGS' '-D_GLIBCXX_USE_CXX11_ABI=1' '-D_LARGEFILE_SOURCE' '-D_FILE_OFFSET_BITS=64' '-D__STDC_FORMAT_MACROS' '-DOPENSSL_NO_PINSHARED' '-DOPENSSL_THREADS' '-DLIBSASS_VERSION="3.5.5"' -I/home/thembo/.node-gyp/16.19.1/include/node -I/home/thembo/.node-gyp/16.19.1/src -I/home/thembo/.node-gyp/16.19.1/deps/openssl/config -I/home/thembo/.node-gyp/16.19.1/deps/openssl/openssl/include -I/home/thembo/.node-gyp/16.19.1/deps/uv/include -I/home/thembo/.node-gyp/16.19.1/deps/zlib -I/home/thembo/.node-gyp/16.19.1/deps/v8/include -I../src/libsass/include -fPIC -pthread -Wall -Wextra -Wno-unused-parameter -m64 -O3 -fno-omit-frame-pointer -std=gnu++14 -std=c++0x -fexceptions -frtti -MMD -MF ./Release/.deps/Release/obj.target/libsass/src/libsass/src/subset_map.o.d.raw -c -o Release/obj.target/libsass/src/libsass/src/subset_map.o ../src/libsass/src/subset_map.cpp
  104. npm ERR! g++ '-DNODE_GYP_MODULE_NAME=libsass' '-DUSING_UV_SHARED=1' '-DUSING_V8_SHARED=1' '-DV8_DEPRECATION_WARNINGS=1' '-DV8_DEPRECATION_WARNINGS' '-DV8_IMMINENT_DEPRECATION_WARNINGS' '-D_GLIBCXX_USE_CXX11_ABI=1' '-D_LARGEFILE_SOURCE' '-D_FILE_OFFSET_BITS=64' '-D__STDC_FORMAT_MACROS' '-DOPENSSL_NO_PINSHARED' '-DOPENSSL_THREADS' '-DLIBSASS_VERSION="3.5.5"' -I/home/thembo/.node-gyp/16.19.1/include/node -I/home/thembo/.node-gyp/16.19.1/src -I/home/thembo/.node-gyp/16.19.1/deps/openssl/config -I/home/thembo/.node-gyp/16.19.1/deps/openssl/openssl/include -I/home/thembo/.node-gyp/16.19.1/deps/uv/include -I/home/thembo/.node-gyp/16.19.1/deps/zlib -I/home/thembo/.node-gyp/16.19.1/deps/v8/include -I../src/libsass/include -fPIC -pthread -Wall -Wextra -Wno-unused-parameter -m64 -O3 -fno-omit-frame-pointer -std=gnu++14 -std=c++0x -fexceptions -frtti -MMD -MF ./Release/.deps/Release/obj.target/libsass/src/libsass/src/to_c.o.d.raw -c -o Release/obj.target/libsass/src/libsass/src/to_c.o ../src/libsass/src/to_c.cpp
  105. npm ERR! g++ '-DNODE_GYP_MODULE_NAME=libsass' '-DUSING_UV_SHARED=1' '-DUSING_V8_SHARED=1' '-DV8_DEPRECATION_WARNINGS=1' '-DV8_DEPRECATION_WARNINGS' '-DV8_IMMINENT_DEPRECATION_WARNINGS' '-D_GLIBCXX_USE_CXX11_ABI=1' '-D_LARGEFILE_SOURCE' '-D_FILE_OFFSET_BITS=64' '-D__STDC_FORMAT_MACROS' '-DOPENSSL_NO_PINSHARED' '-DOPENSSL_THREADS' '-DLIBSASS_VERSION="3.5.5"' -I/home/thembo/.node-gyp/16.19.1/include/node -I/home/thembo/.node-gyp/16.19.1/src -I/home/thembo/.node-gyp/16.19.1/deps/openssl/config -I/home/thembo/.node-gyp/16.19.1/deps/openssl/openssl/include -I/home/thembo/.node-gyp/16.19.1/deps/uv/include -I/home/thembo/.node-gyp/16.19.1/deps/zlib -I/home/thembo/.node-gyp/16.19.1/deps/v8/include -I../src/libsass/include -fPIC -pthread -Wall -Wextra -Wno-unused-parameter -m64 -O3 -fno-omit-frame-pointer -std=gnu++14 -std=c++0x -fexceptions -frtti -MMD -MF ./Release/.deps/Release/obj.target/libsass/src/libsass/src/to_value.o.d.raw -c -o Release/obj.target/libsass/src/libsass/src/to_value.o ../src/libsass/src/to_value.cpp
  106. npm ERR! g++ '-DNODE_GYP_MODULE_NAME=libsass' '-DUSING_UV_SHARED=1' '-DUSING_V8_SHARED=1' '-DV8_DEPRECATION_WARNINGS=1' '-DV8_DEPRECATION_WARNINGS' '-DV8_IMMINENT_DEPRECATION_WARNINGS' '-D_GLIBCXX_USE_CXX11_ABI=1' '-D_LARGEFILE_SOURCE' '-D_FILE_OFFSET_BITS=64' '-D__STDC_FORMAT_MACROS' '-DOPENSSL_NO_PINSHARED' '-DOPENSSL_THREADS' '-DLIBSASS_VERSION="3.5.5"' -I/home/thembo/.node-gyp/16.19.1/include/node -I/home/thembo/.node-gyp/16.19.1/src -I/home/thembo/.node-gyp/16.19.1/deps/openssl/config -I/home/thembo/.node-gyp/16.19.1/deps/openssl/openssl/include -I/home/thembo/.node-gyp/16.19.1/deps/uv/include -I/home/thembo/.node-gyp/16.19.1/deps/zlib -I/home/thembo/.node-gyp/16.19.1/deps/v8/include -I../src/libsass/include -fPIC -pthread -Wall -Wextra -Wno-unused-parameter -m64 -O3 -fno-omit-frame-pointer -std=gnu++14 -std=c++0x -fexceptions -frtti -MMD -MF ./Release/.deps/Release/obj.target/libsass/src/libsass/src/units.o.d.raw -c -o Release/obj.target/libsass/src/libsass/src/units.o ../src/libsass/src/units.cpp
  107. npm ERR! g++ '-DNODE_GYP_MODULE_NAME=libsass' '-DUSING_UV_SHARED=1' '-DUSING_V8_SHARED=1' '-DV8_DEPRECATION_WARNINGS=1' '-DV8_DEPRECATION_WARNINGS' '-DV8_IMMINENT_DEPRECATION_WARNINGS' '-D_GLIBCXX_USE_CXX11_ABI=1' '-D_LARGEFILE_SOURCE' '-D_FILE_OFFSET_BITS=64' '-D__STDC_FORMAT_MACROS' '-DOPENSSL_NO_PINSHARED' '-DOPENSSL_THREADS' '-DLIBSASS_VERSION="3.5.5"' -I/home/thembo/.node-gyp/16.19.1/include/node -I/home/thembo/.node-gyp/16.19.1/src -I/home/thembo/.node-gyp/16.19.1/deps/openssl/config -I/home/thembo/.node-gyp/16.19.1/deps/openssl/openssl/include -I/home/thembo/.node-gyp/16.19.1/deps/uv/include -I/home/thembo/.node-gyp/16.19.1/deps/zlib -I/home/thembo/.node-gyp/16.19.1/deps/v8/include -I../src/libsass/include -fPIC -pthread -Wall -Wextra -Wno-unused-parameter -m64 -O3 -fno-omit-frame-pointer -std=gnu++14 -std=c++0x -fexceptions -frtti -MMD -MF ./Release/.deps/Release/obj.target/libsass/src/libsass/src/utf8_string.o.d.raw -c -o Release/obj.target/libsass/src/libsass/src/utf8_string.o ../src/libsass/src/utf8_string.cpp
  108. npm ERR! g++ '-DNODE_GYP_MODULE_NAME=libsass' '-DUSING_UV_SHARED=1' '-DUSING_V8_SHARED=1' '-DV8_DEPRECATION_WARNINGS=1' '-DV8_DEPRECATION_WARNINGS' '-DV8_IMMINENT_DEPRECATION_WARNINGS' '-D_GLIBCXX_USE_CXX11_ABI=1' '-D_LARGEFILE_SOURCE' '-D_FILE_OFFSET_BITS=64' '-D__STDC_FORMAT_MACROS' '-DOPENSSL_NO_PINSHARED' '-DOPENSSL_THREADS' '-DLIBSASS_VERSION="3.5.5"' -I/home/thembo/.node-gyp/16.19.1/include/node -I/home/thembo/.node-gyp/16.19.1/src -I/home/thembo/.node-gyp/16.19.1/deps/openssl/config -I/home/thembo/.node-gyp/16.19.1/deps/openssl/openssl/include -I/home/thembo/.node-gyp/16.19.1/deps/uv/include -I/home/thembo/.node-gyp/16.19.1/deps/zlib -I/home/thembo/.node-gyp/16.19.1/deps/v8/include -I../src/libsass/include -fPIC -pthread -Wall -Wextra -Wno-unused-parameter -m64 -O3 -fno-omit-frame-pointer -std=gnu++14 -std=c++0x -fexceptions -frtti -MMD -MF ./Release/.deps/Release/obj.target/libsass/src/libsass/src/util.o.d.raw -c -o Release/obj.target/libsass/src/libsass/src/util.o ../src/libsass/src/util.cpp
  109. npm ERR! g++ '-DNODE_GYP_MODULE_NAME=libsass' '-DUSING_UV_SHARED=1' '-DUSING_V8_SHARED=1' '-DV8_DEPRECATION_WARNINGS=1' '-DV8_DEPRECATION_WARNINGS' '-DV8_IMMINENT_DEPRECATION_WARNINGS' '-D_GLIBCXX_USE_CXX11_ABI=1' '-D_LARGEFILE_SOURCE' '-D_FILE_OFFSET_BITS=64' '-D__STDC_FORMAT_MACROS' '-DOPENSSL_NO_PINSHARED' '-DOPENSSL_THREADS' '-DLIBSASS_VERSION="3.5.5"' -I/home/thembo/.node-gyp/16.19.1/include/node -I/home/thembo/.node-gyp/16.19.1/src -I/home/thembo/.node-gyp/16.19.1/deps/openssl/config -I/home/thembo/.node-gyp/16.19.1/deps/openssl/openssl/include -I/home/thembo/.node-gyp/16.19.1/deps/uv/include -I/home/thembo/.node-gyp/16.19.1/deps/zlib -I/home/thembo/.node-gyp/16.19.1/deps/v8/include -I../src/libsass/include -fPIC -pthread -Wall -Wextra -Wno-unused-parameter -m64 -O3 -fno-omit-frame-pointer -std=gnu++14 -std=c++0x -fexceptions -frtti -MMD -MF ./Release/.deps/Release/obj.target/libsass/src/libsass/src/values.o.d.raw -c -o Release/obj.target/libsass/src/libsass/src/values.o ../src/libsass/src/values.cpp
  110. npm ERR! rm -f Release/obj.target/src/sass.a && ar crs Release/obj.target/src/sass.a Release/obj.target/libsass/src/libsass/src/ast.o Release/obj.target/libsass/src/libsass/src/ast_fwd_decl.o Release/obj.target/libsass/src/libsass/src/backtrace.o Release/obj.target/libsass/src/libsass/src/base64vlq.o Release/obj.target/libsass/src/libsass/src/bind.o Release/obj.target/libsass/src/libsass/src/cencode.o Release/obj.target/libsass/src/libsass/src/check_nesting.o Release/obj.target/libsass/src/libsass/src/color_maps.o Release/obj.target/libsass/src/libsass/src/constants.o Release/obj.target/libsass/src/libsass/src/context.o Release/obj.target/libsass/src/libsass/src/cssize.o Release/obj.target/libsass/src/libsass/src/emitter.o Release/obj.target/libsass/src/libsass/src/environment.o Release/obj.target/libsass/src/libsass/src/error_handling.o Release/obj.target/libsass/src/libsass/src/eval.o Release/obj.target/libsass/src/libsass/src/expand.o Release/obj.target/libsass/src/libsass/src/extend.o Release/obj.target/libsass/src/libsass/src/file.o Release/obj.target/libsass/src/libsass/src/functions.o Release/obj.target/libsass/src/libsass/src/inspect.o Release/obj.target/libsass/src/libsass/src/json.o Release/obj.target/libsass/src/libsass/src/lexer.o Release/obj.target/libsass/src/libsass/src/listize.o Release/obj.target/libsass/src/libsass/src/memory/SharedPtr.o Release/obj.target/libsass/src/libsass/src/node.o Release/obj.target/libsass/src/libsass/src/operators.o Release/obj.target/libsass/src/libsass/src/output.o Release/obj.target/libsass/src/libsass/src/parser.o Release/obj.target/libsass/src/libsass/src/plugins.o Release/obj.target/libsass/src/libsass/src/position.o Release/obj.target/libsass/src/libsass/src/prelexer.o Release/obj.target/libsass/src/libsass/src/remove_placeholders.o Release/obj.target/libsass/src/libsass/src/sass.o Release/obj.target/libsass/src/libsass/src/sass2scss.o Release/obj.target/libsass/src/libsass/src/sass_context.o Release/obj.target/libsass/src/libsass/src/sass_functions.o Release/obj.target/libsass/src/libsass/src/sass_util.o Release/obj.target/libsass/src/libsass/src/sass_values.o Release/obj.target/libsass/src/libsass/src/source_map.o Release/obj.target/libsass/src/libsass/src/subset_map.o Release/obj.target/libsass/src/libsass/src/to_c.o Release/obj.target/libsass/src/libsass/src/to_value.o Release/obj.target/libsass/src/libsass/src/units.o Release/obj.target/libsass/src/libsass/src/utf8_string.o Release/obj.target/libsass/src/libsass/src/util.o Release/obj.target/libsass/src/libsass/src/values.o
  111. npm ERR! rm -rf "Release/sass.a" && cp -af "Release/obj.target/src/sass.a" "Release/sass.a"
  112. npm ERR! g++ '-DNODE_GYP_MODULE_NAME=binding' '-DUSING_UV_SHARED=1' '-DUSING_V8_SHARED=1' '-DV8_DEPRECATION_WARNINGS=1' '-DV8_DEPRECATION_WARNINGS' '-DV8_IMMINENT_DEPRECATION_WARNINGS' '-D_GLIBCXX_USE_CXX11_ABI=1' '-D_LARGEFILE_SOURCE' '-D_FILE_OFFSET_BITS=64' '-D__STDC_FORMAT_MACROS' '-DOPENSSL_NO_PINSHARED' '-DOPENSSL_THREADS' '-DBUILDING_NODE_EXTENSION' -I/home/thembo/.node-gyp/16.19.1/include/node -I/home/thembo/.node-gyp/16.19.1/src -I/home/thembo/.node-gyp/16.19.1/deps/openssl/config -I/home/thembo/.node-gyp/16.19.1/deps/openssl/openssl/include -I/home/thembo/.node-gyp/16.19.1/deps/uv/include -I/home/thembo/.node-gyp/16.19.1/deps/zlib -I/home/thembo/.node-gyp/16.19.1/deps/v8/include -I../../nan -I../src/libsass/include -fPIC -pthread -Wall -Wextra -Wno-unused-parameter -m64 -O3 -fno-omit-frame-pointer -fno-rtti -fno-exceptions -std=gnu++14 -std=c++0x -MMD -MF ./Release/.deps/Release/obj.target/binding/src/binding.o.d.raw -c -o Release/obj.target/binding/src/binding.o ../src/binding.cpp
  113. npm ERR! make: Leaving directory '/home/thembo/openmrsprpjects/ngx-openmrs-formentry/node_modules/node-sass/build'
  114. npm ERR! gyp info it worked if it ends with ok
  115. npm ERR! gyp verb cli [
  116. npm ERR! gyp verb cli '/home/thembo/.nvm/versions/node/v16.19.1/bin/node',
  117. npm ERR! gyp verb cli '/home/thembo/openmrsprpjects/ngx-openmrs-formentry/node_modules/node-gyp/bin/node-gyp.js',
  118. npm ERR! gyp verb cli 'rebuild',
  119. npm ERR! gyp verb cli '--verbose',
  120. npm ERR! gyp verb cli '--libsass_ext=',
  121. npm ERR! gyp verb cli '--libsass_cflags=',
  122. npm ERR! gyp verb cli '--libsass_ldflags=',
  123. npm ERR! gyp verb cli '--libsass_library='
  124. npm ERR! gyp verb cli ]
  125. npm ERR! gyp info using node-gyp@3.8.0
  126. npm ERR! gyp info using node@16.19.1 | linux | x64
  127. npm ERR! gyp verb command rebuild []
  128. npm ERR! gyp verb command clean []
  129. npm ERR! gyp verb clean removing "build" directory
  130. npm ERR! gyp verb command configure []
  131. npm ERR! gyp verb check python checking for Python executable "python2" in the PATH
  132. npm ERR! gyp verb `which` succeeded python2 /usr/bin/python2
  133. npm ERR! gyp verb check python version `/usr/bin/python2 -c "import sys; print "2.7.18
  134. npm ERR! gyp verb check python version .%s.%s" % sys.version_info[:3];"` returned: %j
  135. npm ERR! gyp verb get node dir no --target version specified, falling back to host node version: 16.19.1
  136. npm ERR! gyp verb command install [ '16.19.1' ]
  137. npm ERR! gyp verb install input version string "16.19.1"
  138. npm ERR! gyp verb install installing version: 16.19.1
  139. npm ERR! gyp verb install --ensure was passed, so won't reinstall if already installed
  140. npm ERR! gyp verb install version is already installed, need to check "installVersion"
  141. npm ERR! gyp verb got "installVersion" 9
  142. npm ERR! gyp verb needs "installVersion" 9
  143. npm ERR! gyp verb install version is good
  144. npm ERR! gyp verb get node dir target node version installed: 16.19.1
  145. npm ERR! gyp verb build dir attempting to create "build" dir: /home/thembo/openmrsprpjects/ngx-openmrs-formentry/node_modules/node-sass/build
  146. npm ERR! gyp verb build dir "build" dir needed to be created? /home/thembo/openmrsprpjects/ngx-openmrs-formentry/node_modules/node-sass/build
  147. npm ERR! gyp verb build/config.gypi creating config file
  148. npm ERR! gyp verb build/config.gypi writing out config file: /home/thembo/openmrsprpjects/ngx-openmrs-formentry/node_modules/node-sass/build/config.gypi
  149. npm ERR! (node:38287) [DEP0150] DeprecationWarning: Setting process.config is deprecated. In the future the property will be read-only.
  150. npm ERR! (Use `node --trace-deprecation ...` to show where the warning was created)
  151. npm ERR! gyp verb config.gypi checking for gypi file: /home/thembo/openmrsprpjects/ngx-openmrs-formentry/node_modules/node-sass/config.gypi
  152. npm ERR! gyp verb common.gypi checking for gypi file: /home/thembo/openmrsprpjects/ngx-openmrs-formentry/node_modules/node-sass/common.gypi
  153. npm ERR! gyp verb gyp gyp format was not specified; forcing "make"
  154. npm ERR! gyp info spawn /usr/bin/python2
  155. npm ERR! gyp info spawn args [
  156. npm ERR! gyp info spawn args '/home/thembo/openmrsprpjects/ngx-openmrs-formentry/node_modules/node-gyp/gyp/gyp_main.py',
  157. npm ERR! gyp info spawn args 'binding.gyp',
  158. npm ERR! gyp info spawn args '-f',
  159. npm ERR! gyp info spawn args 'make',
  160. npm ERR! gyp info spawn args '-I',
  161. npm ERR! gyp info spawn args '/home/thembo/openmrsprpjects/ngx-openmrs-formentry/node_modules/node-sass/build/config.gypi',
  162. npm ERR! gyp info spawn args '-I',
  163. npm ERR! gyp info spawn args '/home/thembo/openmrsprpjects/ngx-openmrs-formentry/node_modules/node-gyp/addon.gypi',
  164. npm ERR! gyp info spawn args '-I',
  165. npm ERR! gyp info spawn args '/home/thembo/.node-gyp/16.19.1/include/node/common.gypi',
  166. npm ERR! gyp info spawn args '-Dlibrary=shared_library',
  167. npm ERR! gyp info spawn args '-Dvisibility=default',
  168. npm ERR! gyp info spawn args '-Dnode_root_dir=/home/thembo/.node-gyp/16.19.1',
  169. npm ERR! gyp info spawn args '-Dnode_gyp_dir=/home/thembo/openmrsprpjects/ngx-openmrs-formentry/node_modules/node-gyp',
  170. npm ERR! gyp info spawn args '-Dnode_lib_file=/home/thembo/.node-gyp/16.19.1/<(target_arch)/node.lib',
  171. npm ERR! gyp info spawn args '-Dmodule_root_dir=/home/thembo/openmrsprpjects/ngx-openmrs-formentry/node_modules/node-sass',
  172. npm ERR! gyp info spawn args '-Dnode_engine=v8',
  173. npm ERR! gyp info spawn args '--depth=.',
  174. npm ERR! gyp info spawn args '--no-parallel',
  175. npm ERR! gyp info spawn args '--generator-output',
  176. npm ERR! gyp info spawn args 'build',
  177. npm ERR! gyp info spawn args '-Goutput_dir=.'
  178. npm ERR! gyp info spawn args ]
  179. npm ERR! gyp verb command build []
  180. npm ERR! gyp verb build type Release
  181. npm ERR! gyp verb architecture x64
  182. npm ERR! gyp verb node dev dir /home/thembo/.node-gyp/16.19.1
  183. npm ERR! gyp verb `which` succeeded for `make` /usr/bin/make
  184. npm ERR! gyp info spawn make
  185. npm ERR! gyp info spawn args [ 'V=1', 'BUILDTYPE=Release', '-C', 'build' ]
  186. npm ERR! In file included from ../src/libsass/src/ast.cpp:2:
  187. npm ERR! ../src/libsass/src/ast.hpp: In member function ‘virtual size_t Sass::Number::hash()’:
  188. npm ERR! ../src/libsass/src/ast.hpp:1614:25: warning: loop variable ‘numerator’ creates a copy from type ‘const std::__cxx11::basic_string<char>’ [-Wrange-loop-construct]
  189. npm ERR! 1614 | for (const auto numerator : numerators)
  190. npm ERR! | ^~~~~~~~~
  191. npm ERR! ../src/libsass/src/ast.hpp:1614:25: note: use reference type to prevent copying
  192. npm ERR! 1614 | for (const auto numerator : numerators)
  193. npm ERR! | ^~~~~~~~~
  194. npm ERR! | &
  195. npm ERR! ../src/libsass/src/ast.hpp:1616:25: warning: loop variable ‘denominator’ creates a copy from type ‘const std::__cxx11::basic_string<char>’ [-Wrange-loop-construct]
  196. npm ERR! 1616 | for (const auto denominator : denominators)
  197. npm ERR! | ^~~~~~~~~~~
  198. npm ERR! ../src/libsass/src/ast.hpp:1616:25: note: use reference type to prevent copying
  199. npm ERR! 1616 | for (const auto denominator : denominators)
  200. npm ERR! | ^~~~~~~~~~~
  201. npm ERR! | &
  202. npm ERR! In file included from ../src/libsass/src/ast_fwd_decl.cpp:1:
  203. npm ERR! ../src/libsass/src/ast.hpp: In member function ‘virtual size_t Sass::Number::hash()’:
  204. npm ERR! ../src/libsass/src/ast.hpp:1614:25: warning: loop variable ‘numerator’ creates a copy from type ‘const std::__cxx11::basic_string<char>’ [-Wrange-loop-construct]
  205. npm ERR! 1614 | for (const auto numerator : numerators)
  206. npm ERR! | ^~~~~~~~~
  207. npm ERR! ../src/libsass/src/ast.hpp:1614:25: note: use reference type to prevent copying
  208. npm ERR! 1614 | for (const auto numerator : numerators)
  209. npm ERR! | ^~~~~~~~~
  210. npm ERR! | &
  211. npm ERR! ../src/libsass/src/ast.hpp:1616:25: warning: loop variable ‘denominator’ creates a copy from type ‘const std::__cxx11::basic_string<char>’ [-Wrange-loop-construct]
  212. npm ERR! 1616 | for (const auto denominator : denominators)
  213. npm ERR! | ^~~~~~~~~~~
  214. npm ERR! ../src/libsass/src/ast.hpp:1616:25: note: use reference type to prevent copying
  215. npm ERR! 1616 | for (const auto denominator : denominators)
  216. npm ERR! | ^~~~~~~~~~~
  217. npm ERR! | &
  218. npm ERR! In file included from ../src/libsass/src/bind.cpp:3:
  219. npm ERR! ../src/libsass/src/ast.hpp: In member function ‘virtual size_t Sass::Number::hash()’:
  220. npm ERR! ../src/libsass/src/ast.hpp:1614:25: warning: loop variable ‘numerator’ creates a copy from type ‘const std::__cxx11::basic_string<char>’ [-Wrange-loop-construct]
  221. npm ERR! 1614 | for (const auto numerator : numerators)
  222. npm ERR! | ^~~~~~~~~
  223. npm ERR! ../src/libsass/src/ast.hpp:1614:25: note: use reference type to prevent copying
  224. npm ERR! 1614 | for (const auto numerator : numerators)
  225. npm ERR! | ^~~~~~~~~
  226. npm ERR! | &
  227. npm ERR! ../src/libsass/src/ast.hpp:1616:25: warning: loop variable ‘denominator’ creates a copy from type ‘const std::__cxx11::basic_string<char>’ [-Wrange-loop-construct]
  228. npm ERR! 1616 | for (const auto denominator : denominators)
  229. npm ERR! | ^~~~~~~~~~~
  230. npm ERR! ../src/libsass/src/ast.hpp:1616:25: note: use reference type to prevent copying
  231. npm ERR! 1616 | for (const auto denominator : denominators)
  232. npm ERR! | ^~~~~~~~~~~
  233. npm ERR! | &
  234. npm ERR! ../src/libsass/src/cencode.c: In function ‘base64_encode_block’:
  235. npm ERR! ../src/libsass/src/cencode.c:48:32: warning: this statement may fall through [-Wimplicit-fallthrough=]
  236. npm ERR! 48 | result = (fragment & 0x003) << 4;
  237. npm ERR! | ~~~~~~~^~~~~~~~~~~~~~~~~~~~~~~~~
  238. npm ERR! ../src/libsass/src/cencode.c:52:9: note: here
  239. npm ERR! 52 | case step_B:
  240. npm ERR! | ^~~~
  241. npm ERR! ../src/libsass/src/cencode.c:62:32: warning: this statement may fall through [-Wimplicit-fallthrough=]
  242. npm ERR! 62 | result = (fragment & 0x00f) << 2;
  243. npm ERR! | ~~~~~~~^~~~~~~~~~~~~~~~~~~~~~~~~
  244. npm ERR! ../src/libsass/src/cencode.c:66:9: note: here
  245. npm ERR! 66 | case step_C:
  246. npm ERR! | ^~~~
  247. npm ERR! In file included from ../src/libsass/src/check_nesting.hpp:4,
  248. npm ERR! from ../src/libsass/src/check_nesting.cpp:4:
  249. npm ERR! ../src/libsass/src/ast.hpp: In member function ‘virtual size_t Sass::Number::hash()’:
  250. npm ERR! ../src/libsass/src/ast.hpp:1614:25: warning: loop variable ‘numerator’ creates a copy from type ‘const std::__cxx11::basic_string<char>’ [-Wrange-loop-construct]
  251. npm ERR! 1614 | for (const auto numerator : numerators)
  252. npm ERR! | ^~~~~~~~~
  253. npm ERR! ../src/libsass/src/ast.hpp:1614:25: note: use reference type to prevent copying
  254. npm ERR! 1614 | for (const auto numerator : numerators)
  255. npm ERR! | ^~~~~~~~~
  256. npm ERR! | &
  257. npm ERR! ../src/libsass/src/ast.hpp:1616:25: warning: loop variable ‘denominator’ creates a copy from type ‘const std::__cxx11::basic_string<char>’ [-Wrange-loop-construct]
  258. npm ERR! 1616 | for (const auto denominator : denominators)
  259. npm ERR! | ^~~~~~~~~~~
  260. npm ERR! ../src/libsass/src/ast.hpp:1616:25: note: use reference type to prevent copying
  261. npm ERR! 1616 | for (const auto denominator : denominators)
  262. npm ERR! | ^~~~~~~~~~~
  263. npm ERR! | &
  264. npm ERR! In file included from ../src/libsass/src/color_maps.cpp:2:
  265. npm ERR! ../src/libsass/src/ast.hpp: In member function ‘virtual size_t Sass::Number::hash()’:
  266. npm ERR! ../src/libsass/src/ast.hpp:1614:25: warning: loop variable ‘numerator’ creates a copy from type ‘const std::__cxx11::basic_string<char>’ [-Wrange-loop-construct]
  267. npm ERR! 1614 | for (const auto numerator : numerators)
  268. npm ERR! | ^~~~~~~~~
  269. npm ERR! ../src/libsass/src/ast.hpp:1614:25: note: use reference type to prevent copying
  270. npm ERR! 1614 | for (const auto numerator : numerators)
  271. npm ERR! | ^~~~~~~~~
  272. npm ERR! | &
  273. npm ERR! ../src/libsass/src/ast.hpp:1616:25: warning: loop variable ‘denominator’ creates a copy from type ‘const std::__cxx11::basic_string<char>’ [-Wrange-loop-construct]
  274. npm ERR! 1616 | for (const auto denominator : denominators)
  275. npm ERR! | ^~~~~~~~~~~
  276. npm ERR! ../src/libsass/src/ast.hpp:1616:25: note: use reference type to prevent copying
  277. npm ERR! 1616 | for (const auto denominator : denominators)
  278. npm ERR! | ^~~~~~~~~~~
  279. npm ERR! | &
  280. npm ERR! In file included from ../src/libsass/src/context.cpp:9:
  281. npm ERR! ../src/libsass/src/ast.hpp: In member function ‘virtual size_t Sass::Number::hash()’:
  282. npm ERR! ../src/libsass/src/ast.hpp:1614:25: warning: loop variable ‘numerator’ creates a copy from type ‘const std::__cxx11::basic_string<char>’ [-Wrange-loop-construct]
  283. npm ERR! 1614 | for (const auto numerator : numerators)
  284. npm ERR! | ^~~~~~~~~
  285. npm ERR! ../src/libsass/src/ast.hpp:1614:25: note: use reference type to prevent copying
  286. npm ERR! 1614 | for (const auto numerator : numerators)
  287. npm ERR! | ^~~~~~~~~
  288. npm ERR! | &
  289. npm ERR! ../src/libsass/src/ast.hpp:1616:25: warning: loop variable ‘denominator’ creates a copy from type ‘const std::__cxx11::basic_string<char>’ [-Wrange-loop-construct]
  290. npm ERR! 1616 | for (const auto denominator : denominators)
  291. npm ERR! | ^~~~~~~~~~~
  292. npm ERR! ../src/libsass/src/ast.hpp:1616:25: note: use reference type to prevent copying
  293. npm ERR! 1616 | for (const auto denominator : denominators)
  294. npm ERR! | ^~~~~~~~~~~
  295. npm ERR! | &
  296. npm ERR! In file included from ../src/libsass/src/cssize.hpp:4,
  297. npm ERR! from ../src/libsass/src/cssize.cpp:6:
  298. npm ERR! ../src/libsass/src/ast.hpp: In member function ‘virtual size_t Sass::Number::hash()’:
  299. npm ERR! ../src/libsass/src/ast.hpp:1614:25: warning: loop variable ‘numerator’ creates a copy from type ‘const std::__cxx11::basic_string<char>’ [-Wrange-loop-construct]
  300. npm ERR! 1614 | for (const auto numerator : numerators)
  301. npm ERR! | ^~~~~~~~~
  302. npm ERR! ../src/libsass/src/ast.hpp:1614:25: note: use reference type to prevent copying
  303. npm ERR! 1614 | for (const auto numerator : numerators)
  304. npm ERR! | ^~~~~~~~~
  305. npm ERR! | &
  306. npm ERR! ../src/libsass/src/ast.hpp:1616:25: warning: loop variable ‘denominator’ creates a copy from type ‘const std::__cxx11::basic_string<char>’ [-Wrange-loop-construct]
  307. npm ERR! 1616 | for (const auto denominator : denominators)
  308. npm ERR! | ^~~~~~~~~~~
  309. npm ERR! ../src/libsass/src/ast.hpp:1616:25: note: use reference type to prevent copying
  310. npm ERR! 1616 | for (const auto denominator : denominators)
  311. npm ERR! | ^~~~~~~~~~~
  312. npm ERR! | &
  313. npm ERR! In file included from ../src/libsass/src/environment.cpp:2:
  314. npm ERR! ../src/libsass/src/ast.hpp: In member function ‘virtual size_t Sass::Number::hash()’:
  315. npm ERR! ../src/libsass/src/ast.hpp:1614:25: warning: loop variable ‘numerator’ creates a copy from type ‘const std::__cxx11::basic_string<char>’ [-Wrange-loop-construct]
  316. npm ERR! 1614 | for (const auto numerator : numerators)
  317. npm ERR! | ^~~~~~~~~
  318. npm ERR! ../src/libsass/src/ast.hpp:1614:25: note: use reference type to prevent copying
  319. npm ERR! 1614 | for (const auto numerator : numerators)
  320. npm ERR! | ^~~~~~~~~
  321. npm ERR! | &
  322. npm ERR! ../src/libsass/src/ast.hpp:1616:25: warning: loop variable ‘denominator’ creates a copy from type ‘const std::__cxx11::basic_string<char>’ [-Wrange-loop-construct]
  323. npm ERR! 1616 | for (const auto denominator : denominators)
  324. npm ERR! | ^~~~~~~~~~~
  325. npm ERR! ../src/libsass/src/ast.hpp:1616:25: note: use reference type to prevent copying
  326. npm ERR! 1616 | for (const auto denominator : denominators)
  327. npm ERR! | ^~~~~~~~~~~
  328. npm ERR! | &
  329. npm ERR! In file included from ../src/libsass/src/error_handling.cpp:2:
  330. npm ERR! ../src/libsass/src/ast.hpp: In member function ‘virtual size_t Sass::Number::hash()’:
  331. npm ERR! ../src/libsass/src/ast.hpp:1614:25: warning: loop variable ‘numerator’ creates a copy from type ‘const std::__cxx11::basic_string<char>’ [-Wrange-loop-construct]
  332. npm ERR! 1614 | for (const auto numerator : numerators)
  333. npm ERR! | ^~~~~~~~~
  334. npm ERR! ../src/libsass/src/ast.hpp:1614:25: note: use reference type to prevent copying
  335. npm ERR! 1614 | for (const auto numerator : numerators)
  336. npm ERR! | ^~~~~~~~~
  337. npm ERR! | &
  338. npm ERR! ../src/libsass/src/ast.hpp:1616:25: warning: loop variable ‘denominator’ creates a copy from type ‘const std::__cxx11::basic_string<char>’ [-Wrange-loop-construct]
  339. npm ERR! 1616 | for (const auto denominator : denominators)
  340. npm ERR! | ^~~~~~~~~~~
  341. npm ERR! ../src/libsass/src/ast.hpp:1616:25: note: use reference type to prevent copying
  342. npm ERR! 1616 | for (const auto denominator : denominators)
  343. npm ERR! | ^~~~~~~~~~~
  344. npm ERR! | &
  345. npm ERR! In file included from ../src/libsass/src/eval.hpp:4,
  346. npm ERR! from ../src/libsass/src/eval.cpp:10:
  347. npm ERR! ../src/libsass/src/ast.hpp: In member function ‘virtual size_t Sass::Number::hash()’:
  348. npm ERR! ../src/libsass/src/ast.hpp:1614:25: warning: loop variable ‘numerator’ creates a copy from type ‘const std::__cxx11::basic_string<char>’ [-Wrange-loop-construct]
  349. npm ERR! 1614 | for (const auto numerator : numerators)
  350. npm ERR! | ^~~~~~~~~
  351. npm ERR! ../src/libsass/src/ast.hpp:1614:25: note: use reference type to prevent copying
  352. npm ERR! 1614 | for (const auto numerator : numerators)
  353. npm ERR! | ^~~~~~~~~
  354. npm ERR! | &
  355. npm ERR! ../src/libsass/src/ast.hpp:1616:25: warning: loop variable ‘denominator’ creates a copy from type ‘const std::__cxx11::basic_string<char>’ [-Wrange-loop-construct]
  356. npm ERR! 1616 | for (const auto denominator : denominators)
  357. npm ERR! | ^~~~~~~~~~~
  358. npm ERR! ../src/libsass/src/ast.hpp:1616:25: note: use reference type to prevent copying
  359. npm ERR! 1616 | for (const auto denominator : denominators)
  360. npm ERR! | ^~~~~~~~~~~
  361. npm ERR! | &
  362. npm ERR! In file included from ../src/libsass/src/expand.cpp:5:
  363. npm ERR! ../src/libsass/src/ast.hpp: In member function ‘virtual size_t Sass::Number::hash()’:
  364. npm ERR! ../src/libsass/src/ast.hpp:1614:25: warning: loop variable ‘numerator’ creates a copy from type ‘const std::__cxx11::basic_string<char>’ [-Wrange-loop-construct]
  365. npm ERR! 1614 | for (const auto numerator : numerators)
  366. npm ERR! | ^~~~~~~~~
  367. npm ERR! ../src/libsass/src/ast.hpp:1614:25: note: use reference type to prevent copying
  368. npm ERR! 1614 | for (const auto numerator : numerators)
  369. npm ERR! | ^~~~~~~~~
  370. npm ERR! | &
  371. npm ERR! ../src/libsass/src/ast.hpp:1616:25: warning: loop variable ‘denominator’ creates a copy from type ‘const std::__cxx11::basic_string<char>’ [-Wrange-loop-construct]
  372. npm ERR! 1616 | for (const auto denominator : denominators)
  373. npm ERR! | ^~~~~~~~~~~
  374. npm ERR! ../src/libsass/src/ast.hpp:1616:25: note: use reference type to prevent copying
  375. npm ERR! 1616 | for (const auto denominator : denominators)
  376. npm ERR! | ^~~~~~~~~~~
  377. npm ERR! | &
  378. npm ERR! In file included from ../src/libsass/src/extend.hpp:7,
  379. npm ERR! from ../src/libsass/src/extend.cpp:2:
  380. npm ERR! ../src/libsass/src/ast.hpp: In member function ‘virtual size_t Sass::Number::hash()’:
  381. npm ERR! ../src/libsass/src/ast.hpp:1614:25: warning: loop variable ‘numerator’ creates a copy from type ‘const std::__cxx11::basic_string<char>’ [-Wrange-loop-construct]
  382. npm ERR! 1614 | for (const auto numerator : numerators)
  383. npm ERR! | ^~~~~~~~~
  384. npm ERR! ../src/libsass/src/ast.hpp:1614:25: note: use reference type to prevent copying
  385. npm ERR! 1614 | for (const auto numerator : numerators)
  386. npm ERR! | ^~~~~~~~~
  387. npm ERR! | &
  388. npm ERR! ../src/libsass/src/ast.hpp:1616:25: warning: loop variable ‘denominator’ creates a copy from type ‘const std::__cxx11::basic_string<char>’ [-Wrange-loop-construct]
  389. npm ERR! 1616 | for (const auto denominator : denominators)
  390. npm ERR! | ^~~~~~~~~~~
  391. npm ERR! ../src/libsass/src/ast.hpp:1616:25: note: use reference type to prevent copying
  392. npm ERR! 1616 | for (const auto denominator : denominators)
  393. npm ERR! | ^~~~~~~~~~~
  394. npm ERR! | &
  395. npm ERR! In file included from ../src/libsass/src/listize.hpp:7,
  396. npm ERR! from ../src/libsass/src/functions.hpp:4,
  397. npm ERR! from ../src/libsass/src/sass_functions.hpp:6,
  398. npm ERR! from ../src/libsass/src/file.cpp:23:
  399. npm ERR! ../src/libsass/src/ast.hpp: In member function ‘virtual size_t Sass::Number::hash()’:
  400. npm ERR! ../src/libsass/src/ast.hpp:1614:25: warning: loop variable ‘numerator’ creates a copy from type ‘const std::__cxx11::basic_string<char>’ [-Wrange-loop-construct]
  401. npm ERR! 1614 | for (const auto numerator : numerators)
  402. npm ERR! | ^~~~~~~~~
  403. npm ERR! ../src/libsass/src/ast.hpp:1614:25: note: use reference type to prevent copying
  404. npm ERR! 1614 | for (const auto numerator : numerators)
  405. npm ERR! | ^~~~~~~~~
  406. npm ERR! | &
  407. npm ERR! ../src/libsass/src/ast.hpp:1616:25: warning: loop variable ‘denominator’ creates a copy from type ‘const std::__cxx11::basic_string<char>’ [-Wrange-loop-construct]
  408. npm ERR! 1616 | for (const auto denominator : denominators)
  409. npm ERR! | ^~~~~~~~~~~
  410. npm ERR! ../src/libsass/src/ast.hpp:1616:25: note: use reference type to prevent copying
  411. npm ERR! 1616 | for (const auto denominator : denominators)
  412. npm ERR! | ^~~~~~~~~~~
  413. npm ERR! | &
  414. npm ERR! In file included from ../src/libsass/src/listize.hpp:7,
  415. npm ERR! from ../src/libsass/src/functions.hpp:4,
  416. npm ERR! from ../src/libsass/src/functions.cpp:2:
  417. npm ERR! ../src/libsass/src/ast.hpp: In member function ‘virtual size_t Sass::Number::hash()’:
  418. npm ERR! ../src/libsass/src/ast.hpp:1614:25: warning: loop variable ‘numerator’ creates a copy from type ‘const std::__cxx11::basic_string<char>’ [-Wrange-loop-construct]
  419. npm ERR! 1614 | for (const auto numerator : numerators)
  420. npm ERR! | ^~~~~~~~~
  421. npm ERR! ../src/libsass/src/ast.hpp:1614:25: note: use reference type to prevent copying
  422. npm ERR! 1614 | for (const auto numerator : numerators)
  423. npm ERR! | ^~~~~~~~~
  424. npm ERR! | &
  425. npm ERR! ../src/libsass/src/ast.hpp:1616:25: warning: loop variable ‘denominator’ creates a copy from type ‘const std::__cxx11::basic_string<char>’ [-Wrange-loop-construct]
  426. npm ERR! 1616 | for (const auto denominator : denominators)
  427. npm ERR! | ^~~~~~~~~~~
  428. npm ERR! ../src/libsass/src/ast.hpp:1616:25: note: use reference type to prevent copying
  429. npm ERR! 1616 | for (const auto denominator : denominators)
  430. npm ERR! | ^~~~~~~~~~~
  431. npm ERR! | &
  432. npm ERR! ../src/libsass/src/functions.cpp: In function ‘void Sass::Functions::handle_utf8_error(const Sass::ParserState&, Sass::Backtraces)’:
  433. npm ERR! ../src/libsass/src/functions.cpp:110:20: warning: catching polymorphic type ‘class utf8::invalid_code_point’ by value [-Wcatch-value=]
  434. npm ERR! 110 | catch (utf8::invalid_code_point) {
  435. npm ERR! | ^~~~~~~~~~~~~~~~~~
  436. npm ERR! ../src/libsass/src/functions.cpp:114:20: warning: catching polymorphic type ‘class utf8::not_enough_room’ by value [-Wcatch-value=]
  437. npm ERR! 114 | catch (utf8::not_enough_room) {
  438. npm ERR! | ^~~~~~~~~~~~~~~
  439. npm ERR! ../src/libsass/src/functions.cpp:118:20: warning: catching polymorphic type ‘class utf8::invalid_utf8’ by value [-Wcatch-value=]
  440. npm ERR! 118 | catch (utf8::invalid_utf8) {
  441. npm ERR! | ^~~~~~~~~~~~
  442. npm ERR! In file included from ../src/libsass/src/inspect.cpp:9:
  443. npm ERR! ../src/libsass/src/ast.hpp: In member function ‘virtual size_t Sass::Number::hash()’:
  444. npm ERR! ../src/libsass/src/ast.hpp:1614:25: warning: loop variable ‘numerator’ creates a copy from type ‘const std::__cxx11::basic_string<char>’ [-Wrange-loop-construct]
  445. npm ERR! 1614 | for (const auto numerator : numerators)
  446. npm ERR! | ^~~~~~~~~
  447. npm ERR! ../src/libsass/src/ast.hpp:1614:25: note: use reference type to prevent copying
  448. npm ERR! 1614 | for (const auto numerator : numerators)
  449. npm ERR! | ^~~~~~~~~
  450. npm ERR! | &
  451. npm ERR! ../src/libsass/src/ast.hpp:1616:25: warning: loop variable ‘denominator’ creates a copy from type ‘const std::__cxx11::basic_string<char>’ [-Wrange-loop-construct]
  452. npm ERR! 1616 | for (const auto denominator : denominators)
  453. npm ERR! | ^~~~~~~~~~~
  454. npm ERR! ../src/libsass/src/ast.hpp:1616:25: note: use reference type to prevent copying
  455. npm ERR! 1616 | for (const auto denominator : denominators)
  456. npm ERR! | ^~~~~~~~~~~
  457. npm ERR! | &
  458. npm ERR! ../src/libsass/src/json.cpp: In function ‘char* json_encode_string(const char*)’:
  459. npm ERR! ../src/libsass/src/json.cpp:405:15: warning: catching polymorphic type ‘class std::exception’ by value [-Wcatch-value=]
  460. npm ERR! 405 | catch (std::exception) {
  461. npm ERR! | ^~~~~~~~~
  462. npm ERR! ../src/libsass/src/json.cpp: In function ‘char* json_stringify(const JsonNode*, const char*)’:
  463. npm ERR! ../src/libsass/src/json.cpp:424:15: warning: catching polymorphic type ‘class std::exception’ by value [-Wcatch-value=]
  464. npm ERR! 424 | catch (std::exception) {
  465. npm ERR! | ^~~~~~~~~
  466. npm ERR! In file included from ../src/libsass/src/listize.hpp:7,
  467. npm ERR! from ../src/libsass/src/listize.cpp:6:
  468. npm ERR! ../src/libsass/src/ast.hpp: In member function ‘virtual size_t Sass::Number::hash()’:
  469. npm ERR! ../src/libsass/src/ast.hpp:1614:25: warning: loop variable ‘numerator’ creates a copy from type ‘const std::__cxx11::basic_string<char>’ [-Wrange-loop-construct]
  470. npm ERR! 1614 | for (const auto numerator : numerators)
  471. npm ERR! | ^~~~~~~~~
  472. npm ERR! ../src/libsass/src/ast.hpp:1614:25: note: use reference type to prevent copying
  473. npm ERR! 1614 | for (const auto numerator : numerators)
  474. npm ERR! | ^~~~~~~~~
  475. npm ERR! | &
  476. npm ERR! ../src/libsass/src/ast.hpp:1616:25: warning: loop variable ‘denominator’ creates a copy from type ‘const std::__cxx11::basic_string<char>’ [-Wrange-loop-construct]
  477. npm ERR! 1616 | for (const auto denominator : denominators)
  478. npm ERR! | ^~~~~~~~~~~
  479. npm ERR! ../src/libsass/src/ast.hpp:1616:25: note: use reference type to prevent copying
  480. npm ERR! 1616 | for (const auto denominator : denominators)
  481. npm ERR! | ^~~~~~~~~~~
  482. npm ERR! | &
  483. npm ERR! In file included from ../src/libsass/src/node.hpp:7,
  484. npm ERR! from ../src/libsass/src/node.cpp:4:
  485. npm ERR! ../src/libsass/src/ast.hpp: In member function ‘virtual size_t Sass::Number::hash()’:
  486. npm ERR! ../src/libsass/src/ast.hpp:1614:25: warning: loop variable ‘numerator’ creates a copy from type ‘const std::__cxx11::basic_string<char>’ [-Wrange-loop-construct]
  487. npm ERR! 1614 | for (const auto numerator : numerators)
  488. npm ERR! | ^~~~~~~~~
  489. npm ERR! ../src/libsass/src/ast.hpp:1614:25: note: use reference type to prevent copying
  490. npm ERR! 1614 | for (const auto numerator : numerators)
  491. npm ERR! | ^~~~~~~~~
  492. npm ERR! | &
  493. npm ERR! ../src/libsass/src/ast.hpp:1616:25: warning: loop variable ‘denominator’ creates a copy from type ‘const std::__cxx11::basic_string<char>’ [-Wrange-loop-construct]
  494. npm ERR! 1616 | for (const auto denominator : denominators)
  495. npm ERR! | ^~~~~~~~~~~
  496. npm ERR! ../src/libsass/src/ast.hpp:1616:25: note: use reference type to prevent copying
  497. npm ERR! 1616 | for (const auto denominator : denominators)
  498. npm ERR! | ^~~~~~~~~~~
  499. npm ERR! | &
  500. npm ERR! In file included from ../src/libsass/src/values.hpp:4,
  501. npm ERR! from ../src/libsass/src/operators.hpp:4,
  502. npm ERR! from ../src/libsass/src/operators.cpp:2:
  503. npm ERR! ../src/libsass/src/ast.hpp: In member function ‘virtual size_t Sass::Number::hash()’:
  504. npm ERR! ../src/libsass/src/ast.hpp:1614:25: warning: loop variable ‘numerator’ creates a copy from type ‘const std::__cxx11::basic_string<char>’ [-Wrange-loop-construct]
  505. npm ERR! 1614 | for (const auto numerator : numerators)
  506. npm ERR! | ^~~~~~~~~
  507. npm ERR! ../src/libsass/src/ast.hpp:1614:25: note: use reference type to prevent copying
  508. npm ERR! 1614 | for (const auto numerator : numerators)
  509. npm ERR! | ^~~~~~~~~
  510. npm ERR! | &
  511. npm ERR! ../src/libsass/src/ast.hpp:1616:25: warning: loop variable ‘denominator’ creates a copy from type ‘const std::__cxx11::basic_string<char>’ [-Wrange-loop-construct]
  512. npm ERR! 1616 | for (const auto denominator : denominators)
  513. npm ERR! | ^~~~~~~~~~~
  514. npm ERR! ../src/libsass/src/ast.hpp:1616:25: note: use reference type to prevent copying
  515. npm ERR! 1616 | for (const auto denominator : denominators)
  516. npm ERR! | ^~~~~~~~~~~
  517. npm ERR! | &
  518. npm ERR! In file included from ../src/libsass/src/output.cpp:2:
  519. npm ERR! ../src/libsass/src/ast.hpp: In member function ‘virtual size_t Sass::Number::hash()’:
  520. npm ERR! ../src/libsass/src/ast.hpp:1614:25: warning: loop variable ‘numerator’ creates a copy from type ‘const std::__cxx11::basic_string<char>’ [-Wrange-loop-construct]
  521. npm ERR! 1614 | for (const auto numerator : numerators)
  522. npm ERR! | ^~~~~~~~~
  523. npm ERR! ../src/libsass/src/ast.hpp:1614:25: note: use reference type to prevent copying
  524. npm ERR! 1614 | for (const auto numerator : numerators)
  525. npm ERR! | ^~~~~~~~~
  526. npm ERR! | &
  527. npm ERR! ../src/libsass/src/ast.hpp:1616:25: warning: loop variable ‘denominator’ creates a copy from type ‘const std::__cxx11::basic_string<char>’ [-Wrange-loop-construct]
  528. npm ERR! 1616 | for (const auto denominator : denominators)
  529. npm ERR! | ^~~~~~~~~~~
  530. npm ERR! ../src/libsass/src/ast.hpp:1616:25: note: use reference type to prevent copying
  531. npm ERR! 1616 | for (const auto denominator : denominators)
  532. npm ERR! | ^~~~~~~~~~~
  533. npm ERR! | &
  534. npm ERR! In file included from ../src/libsass/src/parser.hpp:7,
  535. npm ERR! from ../src/libsass/src/parser.cpp:2:
  536. npm ERR! ../src/libsass/src/ast.hpp: In member function ‘virtual size_t Sass::Number::hash()’:
  537. npm ERR! ../src/libsass/src/ast.hpp:1614:25: warning: loop variable ‘numerator’ creates a copy from type ‘const std::__cxx11::basic_string<char>’ [-Wrange-loop-construct]
  538. npm ERR! 1614 | for (const auto numerator : numerators)
  539. npm ERR! | ^~~~~~~~~
  540. npm ERR! ../src/libsass/src/ast.hpp:1614:25: note: use reference type to prevent copying
  541. npm ERR! 1614 | for (const auto numerator : numerators)
  542. npm ERR! | ^~~~~~~~~
  543. npm ERR! | &
  544. npm ERR! ../src/libsass/src/ast.hpp:1616:25: warning: loop variable ‘denominator’ creates a copy from type ‘const std::__cxx11::basic_string<char>’ [-Wrange-loop-construct]
  545. npm ERR! 1616 | for (const auto denominator : denominators)
  546. npm ERR! | ^~~~~~~~~~~
  547. npm ERR! ../src/libsass/src/ast.hpp:1616:25: note: use reference type to prevent copying
  548. npm ERR! 1616 | for (const auto denominator : denominators)
  549. npm ERR! | ^~~~~~~~~~~
  550. npm ERR! | &
  551. npm ERR! In file included from ../src/libsass/src/remove_placeholders.hpp:6,
  552. npm ERR! from ../src/libsass/src/remove_placeholders.cpp:2:
  553. npm ERR! ../src/libsass/src/ast.hpp: In member function ‘virtual size_t Sass::Number::hash()’:
  554. npm ERR! ../src/libsass/src/ast.hpp:1614:25: warning: loop variable ‘numerator’ creates a copy from type ‘const std::__cxx11::basic_string<char>’ [-Wrange-loop-construct]
  555. npm ERR! 1614 | for (const auto numerator : numerators)
  556. npm ERR! | ^~~~~~~~~
  557. npm ERR! ../src/libsass/src/ast.hpp:1614:25: note: use reference type to prevent copying
  558. npm ERR! 1614 | for (const auto numerator : numerators)
  559. npm ERR! | ^~~~~~~~~
  560. npm ERR! | &
  561. npm ERR! ../src/libsass/src/ast.hpp:1616:25: warning: loop variable ‘denominator’ creates a copy from type ‘const std::__cxx11::basic_string<char>’ [-Wrange-loop-construct]
  562. npm ERR! 1616 | for (const auto denominator : denominators)
  563. npm ERR! | ^~~~~~~~~~~
  564. npm ERR! ../src/libsass/src/ast.hpp:1616:25: note: use reference type to prevent copying
  565. npm ERR! 1616 | for (const auto denominator : denominators)
  566. npm ERR! | ^~~~~~~~~~~
  567. npm ERR! | &
  568. npm ERR! In file included from ../src/libsass/src/listize.hpp:7,
  569. npm ERR! from ../src/libsass/src/functions.hpp:4,
  570. npm ERR! from ../src/libsass/src/sass_functions.hpp:6,
  571. npm ERR! from ../src/libsass/src/sass.cpp:11:
  572. npm ERR! ../src/libsass/src/ast.hpp: In member function ‘virtual size_t Sass::Number::hash()’:
  573. npm ERR! ../src/libsass/src/ast.hpp:1614:25: warning: loop variable ‘numerator’ creates a copy from type ‘const std::__cxx11::basic_string<char>’ [-Wrange-loop-construct]
  574. npm ERR! 1614 | for (const auto numerator : numerators)
  575. npm ERR! | ^~~~~~~~~
  576. npm ERR! ../src/libsass/src/ast.hpp:1614:25: note: use reference type to prevent copying
  577. npm ERR! 1614 | for (const auto numerator : numerators)
  578. npm ERR! | ^~~~~~~~~
  579. npm ERR! | &
  580. npm ERR! ../src/libsass/src/ast.hpp:1616:25: warning: loop variable ‘denominator’ creates a copy from type ‘const std::__cxx11::basic_string<char>’ [-Wrange-loop-construct]
  581. npm ERR! 1616 | for (const auto denominator : denominators)
  582. npm ERR! | ^~~~~~~~~~~
  583. npm ERR! ../src/libsass/src/ast.hpp:1616:25: note: use reference type to prevent copying
  584. npm ERR! 1616 | for (const auto denominator : denominators)
  585. npm ERR! | ^~~~~~~~~~~
  586. npm ERR! | &
  587. npm ERR! In file included from ../src/libsass/src/sass_context.cpp:9:
  588. npm ERR! ../src/libsass/src/ast.hpp: In member function ‘virtual size_t Sass::Number::hash()’:
  589. npm ERR! ../src/libsass/src/ast.hpp:1614:25: warning: loop variable ‘numerator’ creates a copy from type ‘const std::__cxx11::basic_string<char>’ [-Wrange-loop-construct]
  590. npm ERR! 1614 | for (const auto numerator : numerators)
  591. npm ERR! | ^~~~~~~~~
  592. npm ERR! ../src/libsass/src/ast.hpp:1614:25: note: use reference type to prevent copying
  593. npm ERR! 1614 | for (const auto numerator : numerators)
  594. npm ERR! | ^~~~~~~~~
  595. npm ERR! | &
  596. npm ERR! ../src/libsass/src/ast.hpp:1616:25: warning: loop variable ‘denominator’ creates a copy from type ‘const std::__cxx11::basic_string<char>’ [-Wrange-loop-construct]
  597. npm ERR! 1616 | for (const auto denominator : denominators)
  598. npm ERR! | ^~~~~~~~~~~
  599. npm ERR! ../src/libsass/src/ast.hpp:1616:25: note: use reference type to prevent copying
  600. npm ERR! 1616 | for (const auto denominator : denominators)
  601. npm ERR! | ^~~~~~~~~~~
  602. npm ERR! | &
  603. npm ERR! In file included from ../src/libsass/src/values.hpp:4,
  604. npm ERR! from ../src/libsass/src/sass_functions.cpp:5:
  605. npm ERR! ../src/libsass/src/ast.hpp: In member function ‘virtual size_t Sass::Number::hash()’:
  606. npm ERR! ../src/libsass/src/ast.hpp:1614:25: warning: loop variable ‘numerator’ creates a copy from type ‘const std::__cxx11::basic_string<char>’ [-Wrange-loop-construct]
  607. npm ERR! 1614 | for (const auto numerator : numerators)
  608. npm ERR! | ^~~~~~~~~
  609. npm ERR! ../src/libsass/src/ast.hpp:1614:25: note: use reference type to prevent copying
  610. npm ERR! 1614 | for (const auto numerator : numerators)
  611. npm ERR! | ^~~~~~~~~
  612. npm ERR! | &
  613. npm ERR! ../src/libsass/src/ast.hpp:1616:25: warning: loop variable ‘denominator’ creates a copy from type ‘const std::__cxx11::basic_string<char>’ [-Wrange-loop-construct]
  614. npm ERR! 1616 | for (const auto denominator : denominators)
  615. npm ERR! | ^~~~~~~~~~~
  616. npm ERR! ../src/libsass/src/ast.hpp:1616:25: note: use reference type to prevent copying
  617. npm ERR! 1616 | for (const auto denominator : denominators)
  618. npm ERR! | ^~~~~~~~~~~
  619. npm ERR! | &
  620. npm ERR! In file included from ../src/libsass/src/node.hpp:7,
  621. npm ERR! from ../src/libsass/src/sass_util.cpp:2:
  622. npm ERR! ../src/libsass/src/ast.hpp: In member function ‘virtual size_t Sass::Number::hash()’:
  623. npm ERR! ../src/libsass/src/ast.hpp:1614:25: warning: loop variable ‘numerator’ creates a copy from type ‘const std::__cxx11::basic_string<char>’ [-Wrange-loop-construct]
  624. npm ERR! 1614 | for (const auto numerator : numerators)
  625. npm ERR! | ^~~~~~~~~
  626. npm ERR! ../src/libsass/src/ast.hpp:1614:25: note: use reference type to prevent copying
  627. npm ERR! 1614 | for (const auto numerator : numerators)
  628. npm ERR! | ^~~~~~~~~
  629. npm ERR! | &
  630. npm ERR! ../src/libsass/src/ast.hpp:1616:25: warning: loop variable ‘denominator’ creates a copy from type ‘const std::__cxx11::basic_string<char>’ [-Wrange-loop-construct]
  631. npm ERR! 1616 | for (const auto denominator : denominators)
  632. npm ERR! | ^~~~~~~~~~~
  633. npm ERR! ../src/libsass/src/ast.hpp:1616:25: note: use reference type to prevent copying
  634. npm ERR! 1616 | for (const auto denominator : denominators)
  635. npm ERR! | ^~~~~~~~~~~
  636. npm ERR! | &
  637. npm ERR! In file included from ../src/libsass/src/eval.hpp:4,
  638. npm ERR! from ../src/libsass/src/sass_values.cpp:5:
  639. npm ERR! ../src/libsass/src/ast.hpp: In member function ‘virtual size_t Sass::Number::hash()’:
  640. npm ERR! ../src/libsass/src/ast.hpp:1614:25: warning: loop variable ‘numerator’ creates a copy from type ‘const std::__cxx11::basic_string<char>’ [-Wrange-loop-construct]
  641. npm ERR! 1614 | for (const auto numerator : numerators)
  642. npm ERR! | ^~~~~~~~~
  643. npm ERR! ../src/libsass/src/ast.hpp:1614:25: note: use reference type to prevent copying
  644. npm ERR! 1614 | for (const auto numerator : numerators)
  645. npm ERR! | ^~~~~~~~~
  646. npm ERR! | &
  647. npm ERR! ../src/libsass/src/ast.hpp:1616:25: warning: loop variable ‘denominator’ creates a copy from type ‘const std::__cxx11::basic_string<char>’ [-Wrange-loop-construct]
  648. npm ERR! 1616 | for (const auto denominator : denominators)
  649. npm ERR! | ^~~~~~~~~~~
  650. npm ERR! ../src/libsass/src/ast.hpp:1616:25: note: use reference type to prevent copying
  651. npm ERR! 1616 | for (const auto denominator : denominators)
  652. npm ERR! | ^~~~~~~~~~~
  653. npm ERR! | &
  654. npm ERR! In file included from ../src/libsass/src/source_map.cpp:7:
  655. npm ERR! ../src/libsass/src/ast.hpp: In member function ‘virtual size_t Sass::Number::hash()’:
  656. npm ERR! ../src/libsass/src/ast.hpp:1614:25: warning: loop variable ‘numerator’ creates a copy from type ‘const std::__cxx11::basic_string<char>’ [-Wrange-loop-construct]
  657. npm ERR! 1614 | for (const auto numerator : numerators)
  658. npm ERR! | ^~~~~~~~~
  659. npm ERR! ../src/libsass/src/ast.hpp:1614:25: note: use reference type to prevent copying
  660. npm ERR! 1614 | for (const auto numerator : numerators)
  661. npm ERR! | ^~~~~~~~~
  662. npm ERR! | &
  663. npm ERR! ../src/libsass/src/ast.hpp:1616:25: warning: loop variable ‘denominator’ creates a copy from type ‘const std::__cxx11::basic_string<char>’ [-Wrange-loop-construct]
  664. npm ERR! 1616 | for (const auto denominator : denominators)
  665. npm ERR! | ^~~~~~~~~~~
  666. npm ERR! ../src/libsass/src/ast.hpp:1616:25: note: use reference type to prevent copying
  667. npm ERR! 1616 | for (const auto denominator : denominators)
  668. npm ERR! | ^~~~~~~~~~~
  669. npm ERR! | &
  670. npm ERR! In file included from ../src/libsass/src/subset_map.cpp:2:
  671. npm ERR! ../src/libsass/src/ast.hpp: In member function ‘virtual size_t Sass::Number::hash()’:
  672. npm ERR! ../src/libsass/src/ast.hpp:1614:25: warning: loop variable ‘numerator’ creates a copy from type ‘const std::__cxx11::basic_string<char>’ [-Wrange-loop-construct]
  673. npm ERR! 1614 | for (const auto numerator : numerators)
  674. npm ERR! | ^~~~~~~~~
  675. npm ERR! ../src/libsass/src/ast.hpp:1614:25: note: use reference type to prevent copying
  676. npm ERR! 1614 | for (const auto numerator : numerators)
  677. npm ERR! | ^~~~~~~~~
  678. npm ERR! | &
  679. npm ERR! ../src/libsass/src/ast.hpp:1616:25: warning: loop variable ‘denominator’ creates a copy from type ‘const std::__cxx11::basic_string<char>’ [-Wrange-loop-construct]
  680. npm ERR! 1616 | for (const auto denominator : denominators)
  681. npm ERR! | ^~~~~~~~~~~
  682. npm ERR! ../src/libsass/src/ast.hpp:1616:25: note: use reference type to prevent copying
  683. npm ERR! 1616 | for (const auto denominator : denominators)
  684. npm ERR! | ^~~~~~~~~~~
  685. npm ERR! | &
  686. npm ERR! In file included from ../src/libsass/src/to_c.cpp:3:
  687. npm ERR! ../src/libsass/src/ast.hpp: In member function ‘virtual size_t Sass::Number::hash()’:
  688. npm ERR! ../src/libsass/src/ast.hpp:1614:25: warning: loop variable ‘numerator’ creates a copy from type ‘const std::__cxx11::basic_string<char>’ [-Wrange-loop-construct]
  689. npm ERR! 1614 | for (const auto numerator : numerators)
  690. npm ERR! | ^~~~~~~~~
  691. npm ERR! ../src/libsass/src/ast.hpp:1614:25: note: use reference type to prevent copying
  692. npm ERR! 1614 | for (const auto numerator : numerators)
  693. npm ERR! | ^~~~~~~~~
  694. npm ERR! | &
  695. npm ERR! ../src/libsass/src/ast.hpp:1616:25: warning: loop variable ‘denominator’ creates a copy from type ‘const std::__cxx11::basic_string<char>’ [-Wrange-loop-construct]
  696. npm ERR! 1616 | for (const auto denominator : denominators)
  697. npm ERR! | ^~~~~~~~~~~
  698. npm ERR! ../src/libsass/src/ast.hpp:1616:25: note: use reference type to prevent copying
  699. npm ERR! 1616 | for (const auto denominator : denominators)
  700. npm ERR! | ^~~~~~~~~~~
  701. npm ERR! | &
  702. npm ERR! In file included from ../src/libsass/src/to_value.cpp:2:
  703. npm ERR! ../src/libsass/src/ast.hpp: In member function ‘virtual size_t Sass::Number::hash()’:
  704. npm ERR! ../src/libsass/src/ast.hpp:1614:25: warning: loop variable ‘numerator’ creates a copy from type ‘const std::__cxx11::basic_string<char>’ [-Wrange-loop-construct]
  705. npm ERR! 1614 | for (const auto numerator : numerators)
  706. npm ERR! | ^~~~~~~~~
  707. npm ERR! ../src/libsass/src/ast.hpp:1614:25: note: use reference type to prevent copying
  708. npm ERR! 1614 | for (const auto numerator : numerators)
  709. npm ERR! | ^~~~~~~~~
  710. npm ERR! | &
  711. npm ERR! ../src/libsass/src/ast.hpp:1616:25: warning: loop variable ‘denominator’ creates a copy from type ‘const std::__cxx11::basic_string<char>’ [-Wrange-loop-construct]
  712. npm ERR! 1616 | for (const auto denominator : denominators)
  713. npm ERR! | ^~~~~~~~~~~
  714. npm ERR! ../src/libsass/src/ast.hpp:1616:25: note: use reference type to prevent copying
  715. npm ERR! 1616 | for (const auto denominator : denominators)
  716. npm ERR! | ^~~~~~~~~~~
  717. npm ERR! | &
  718. npm ERR! In file included from ../src/libsass/src/util.cpp:3:
  719. npm ERR! ../src/libsass/src/ast.hpp: In member function ‘virtual size_t Sass::Number::hash()’:
  720. npm ERR! ../src/libsass/src/ast.hpp:1614:25: warning: loop variable ‘numerator’ creates a copy from type ‘const std::__cxx11::basic_string<char>’ [-Wrange-loop-construct]
  721. npm ERR! 1614 | for (const auto numerator : numerators)
  722. npm ERR! | ^~~~~~~~~
  723. npm ERR! ../src/libsass/src/ast.hpp:1614:25: note: use reference type to prevent copying
  724. npm ERR! 1614 | for (const auto numerator : numerators)
  725. npm ERR! | ^~~~~~~~~
  726. npm ERR! | &
  727. npm ERR! ../src/libsass/src/ast.hpp:1616:25: warning: loop variable ‘denominator’ creates a copy from type ‘const std::__cxx11::basic_string<char>’ [-Wrange-loop-construct]
  728. npm ERR! 1616 | for (const auto denominator : denominators)
  729. npm ERR! | ^~~~~~~~~~~
  730. npm ERR! ../src/libsass/src/ast.hpp:1616:25: note: use reference type to prevent copying
  731. npm ERR! 1616 | for (const auto denominator : denominators)
  732. npm ERR! | ^~~~~~~~~~~
  733. npm ERR! | &
  734. npm ERR! In file included from ../src/libsass/src/values.hpp:4,
  735. npm ERR! from ../src/libsass/src/values.cpp:3:
  736. npm ERR! ../src/libsass/src/ast.hpp: In member function ‘virtual size_t Sass::Number::hash()’:
  737. npm ERR! ../src/libsass/src/ast.hpp:1614:25: warning: loop variable ‘numerator’ creates a copy from type ‘const std::__cxx11::basic_string<char>’ [-Wrange-loop-construct]
  738. npm ERR! 1614 | for (const auto numerator : numerators)
  739. npm ERR! | ^~~~~~~~~
  740. npm ERR! ../src/libsass/src/ast.hpp:1614:25: note: use reference type to prevent copying
  741. npm ERR! 1614 | for (const auto numerator : numerators)
  742. npm ERR! | ^~~~~~~~~
  743. npm ERR! | &
  744. npm ERR! ../src/libsass/src/ast.hpp:1616:25: warning: loop variable ‘denominator’ creates a copy from type ‘const std::__cxx11::basic_string<char>’ [-Wrange-loop-construct]
  745. npm ERR! 1616 | for (const auto denominator : denominators)
  746. npm ERR! | ^~~~~~~~~~~
  747. npm ERR! ../src/libsass/src/ast.hpp:1616:25: note: use reference type to prevent copying
  748. npm ERR! 1616 | for (const auto denominator : denominators)
  749. npm ERR! | ^~~~~~~~~~~
  750. npm ERR! | &
  751. npm ERR! In file included from /home/thembo/.node-gyp/16.19.1/include/node/v8.h:30,
  752. npm ERR! from /home/thembo/.node-gyp/16.19.1/include/node/node.h:73,
  753. npm ERR! from ../../nan/nan.h:54,
  754. npm ERR! from ../src/binding.cpp:1:
  755. npm ERR! /home/thembo/.node-gyp/16.19.1/include/node/v8-internal.h: In function ‘void v8::internal::PerformCastCheck(T*)’:
  756. npm ERR! /home/thembo/.node-gyp/16.19.1/include/node/v8-internal.h:492:38: error: ‘remove_cv_t’ is not a member of ‘std’; did you mean ‘remove_cv’?
  757. npm ERR! 492 | !std::is_same<Data, std::remove_cv_t<T>>::value>::Perform(data);
  758. npm ERR! | ^~~~~~~~~~~
  759. npm ERR! | remove_cv
  760. npm ERR! /home/thembo/.node-gyp/16.19.1/include/node/v8-internal.h:492:38: error: ‘remove_cv_t’ is not a member of ‘std’; did you mean ‘remove_cv’?
  761. npm ERR! 492 | !std::is_same<Data, std::remove_cv_t<T>>::value>::Perform(data);
  762. npm ERR! | ^~~~~~~~~~~
  763. npm ERR! | remove_cv
  764. npm ERR! /home/thembo/.node-gyp/16.19.1/include/node/v8-internal.h:492:50: error: template argument 2 is invalid
  765. npm ERR! 492 | !std::is_same<Data, std::remove_cv_t<T>>::value>::Perform(data);
  766. npm ERR! | ^
  767. npm ERR! /home/thembo/.node-gyp/16.19.1/include/node/v8-internal.h:492:63: error: ‘::Perform’ has not been declared
  768. npm ERR! 492 | !std::is_same<Data, std::remove_cv_t<T>>::value>::Perform(data);
  769. npm ERR! | ^~~~~~~
  770. npm ERR! In file included from ../src/binding.cpp:1:
  771. npm ERR! ../../nan/nan.h: In function ‘void Nan::AsyncQueueWorker(Nan::AsyncWorker*)’:
  772. npm ERR! ../../nan/nan.h:2298:7: warning: cast between incompatible function types from ‘void (*)(uv_work_t*)’ {aka ‘void (*)(uv_work_s*)’} to ‘uv_after_work_cb’ {aka ‘void (*)(uv_work_s*, int)’} [-Wcast-function-type]
  773. npm ERR! 2298 | , reinterpret_cast<uv_after_work_cb>(AsyncExecuteComplete)
  774. npm ERR! | ^~~~~~~~~~~~~~~~~~~~~~~~~~~~~~~~~~~~~~~~~~~~~~~~~~~~~~~~
  775. npm ERR! ../src/binding.cpp: In function ‘Nan::NAN_METHOD_RETURN_TYPE render(Nan::NAN_METHOD_ARGS_TYPE)’:
  776. npm ERR! ../src/binding.cpp:284:80: warning: cast between incompatible function types from ‘void (*)(uv_work_t*)’ {aka ‘void (*)(uv_work_s*)’} to ‘uv_after_work_cb’ {aka ‘void (*)(uv_work_s*, int)’} [-Wcast-function-type]
  777. npm ERR! 284 | int status = uv_queue_work(uv_default_loop(), &ctx_w->request, compile_it, (uv_after_work_cb)MakeCallback);
  778. npm ERR! | ^~~~~~~~~~~~~~~~~~~~~~~~~~~~~~
  779. npm ERR! ../src/binding.cpp: In function ‘Nan::NAN_METHOD_RETURN_TYPE render_file(Nan::NAN_METHOD_ARGS_TYPE)’:
  780. npm ERR! ../src/binding.cpp:320:80: warning: cast between incompatible function types from ‘void (*)(uv_work_t*)’ {aka ‘void (*)(uv_work_s*)’} to ‘uv_after_work_cb’ {aka ‘void (*)(uv_work_s*, int)’} [-Wcast-function-type]
  781. npm ERR! 320 | int status = uv_queue_work(uv_default_loop(), &ctx_w->request, compile_it, (uv_after_work_cb)MakeCallback);
  782. npm ERR! | ^~~~~~~~~~~~~~~~~~~~~~~~~~~~~~
  783. npm ERR! In file included from ../../nan/nan.h:54,
  784. npm ERR! from ../src/binding.cpp:1:
  785. npm ERR! ../src/binding.cpp: At global scope:
  786. npm ERR! /home/thembo/.node-gyp/16.19.1/include/node/node.h:887:7: warning: cast between incompatible function types from ‘void (*)(Nan::ADDON_REGISTER_FUNCTION_ARGS_TYPE)’ {aka ‘void (*)(v8::Local<v8::Object>)’} to ‘node::addon_register_func’ {aka ‘void (*)(v8::Local<v8::Object>, v8::Local<v8::Value>, void*)’} [-Wcast-function-type]
  787. npm ERR! 887 | (node::addon_register_func) (regfunc), \
  788. npm ERR! | ^~~~~~~~~~~~~~~~~~~~~~~~~~~~~~~~~~~~~
  789. npm ERR! /home/thembo/.node-gyp/16.19.1/include/node/node.h:921:3: note: in expansion of macro ‘NODE_MODULE_X’
  790. npm ERR! 921 | NODE_MODULE_X(modname, regfunc, NULL, 0) // NOLINT (readability/null_usage)
  791. npm ERR! | ^~~~~~~~~~~~~
  792. npm ERR! ../src/binding.cpp:358:1: note: in expansion of macro ‘NODE_MODULE’
  793. npm ERR! 358 | NODE_MODULE(binding, RegisterModule);
  794. npm ERR! | ^~~~~~~~~~~
  795. npm ERR! make: *** [binding.target.mk:133: Release/obj.target/binding/src/binding.o] Error 1
  796. npm ERR! gyp ERR! build error
  797. npm ERR! gyp ERR! stack Error: `make` failed with exit code: 2
  798. npm ERR! gyp ERR! stack at ChildProcess.onExit (/home/thembo/openmrsprpjects/ngx-openmrs-formentry/node_modules/node-gyp/lib/build.js:262:23)
  799. npm ERR! gyp ERR! stack at ChildProcess.emit (node:events:513:28)
  800. npm ERR! gyp ERR! stack at Process.ChildProcess._handle.onexit (node:internal/child_process:293:12)
  801. npm ERR! gyp ERR! System Linux 5.19.0-43-generic
  802. npm ERR! gyp ERR! command "/home/thembo/.nvm/versions/node/v16.19.1/bin/node" "/home/thembo/openmrsprpjects/ngx-openmrs-formentry/node_modules/node-gyp/bin/node-gyp.js" "rebuild" "--verbose" "--libsass_ext=" "--libsass_cflags=" "--libsass_ldflags=" "--libsass_library="
  803. npm ERR! gyp ERR! cwd /home/thembo/openmrsprpjects/ngx-openmrs-formentry/node_modules/node-sass
  804. npm ERR! gyp ERR! node -v v16.19.1
  805. npm ERR! gyp ERR! node-gyp -v v3.8.0
  806. npm ERR! gyp ERR! not ok
  807. npm ERR! Build failed with error code: 1
  808.  
Add Comment
Please, Sign In to add comment