Need a unique gift idea?
A Pastebin account makes a great Christmas gift
SHARE
TWEET

Untitled

a guest Nov 16th, 2018 73 Never
Upgrade to PRO!
ENDING IN00days00hours00mins00secs
 
  1. main.c:304: error: expected ‘)’ before ‘in’
  2. main.c:336: error: expected ‘)’ before ‘node’
  3. main.c:374: error: expected ‘=’, ‘,’, ‘;’, ‘asm’ or ‘__attribute__’ before ‘{’ token
  4. main.c:390: error: expected declaration specifiers before ‘outgoing_t’
  5. main.c:397: error: expected ‘=’, ‘,’, ‘;’, ‘asm’ or ‘__attribute__’ before ‘{’ token
  6. main.c:416: error: expected ‘=’, ‘,’, ‘;’, ‘asm’ or ‘__attribute__’ before ‘{’ token
  7. main.c:437: error: expected ‘=’, ‘,’, ‘;’, ‘asm’ or ‘__attribute__’ before ‘{’ token
  8. main.c:451: error: expected ‘=’, ‘,’, ‘;’, ‘asm’ or ‘__attribute__’ before ‘{’ token
  9. main.c:64: error: declaration for parameter ‘fdmax’ but no such parameter
  10. main.c:63: error: declaration for parameter ‘listenfd’ but no such parameter
  11. main.c:62: error: declaration for parameter ‘out’ but no such parameter
  12. main.c:61: error: declaration for parameter ‘all’ but no such parameter
  13. main.c:58: error: declaration for parameter ‘sourcelen’ but no such parameter
  14. main.c:57: error: declaration for parameter ‘sourcebuf’ but no such parameter
  15. main.c:56: error: declaration for parameter ‘source’ but no such parameter
  16. main.c:55: error: declaration for parameter ‘bindaddr’ but no such parameter
  17. main.c:54: error: declaration for parameter ‘port’ but no such parameter
  18. main.c:53: error: declaration for parameter ‘logfile’ but no such parameter
  19. main.c:52: error: declaration for parameter ‘isdaemon’ but no such parameter
  20. tclcon.h:39: error: declaration for parameter ‘tcl_raw’ but no such parameter
  21. tclcon.h:38: error: declaration for parameter ‘is_banned’ but no such parameter
  22. tclcon.h:37: error: declaration for parameter ‘tcl_chatlist’ but no such parameter
  23. tclcon.h:36: error: declaration for parameter ‘tcl_reinit’ but no such parameter
  24. tclcon.h:32: error: declaration for parameter ‘tcl_every_second’ but no such parameter
  25. tclcon.h:31: error: declaration for parameter ‘init_tcl’ but no such parameter
  26. /usr/include/tcl8.4/tcl.h:2342: error: declaration for parameter ‘Tcl_Main’ but no such parameter
  27. /usr/include/tcl8.4/tclPlatDecls.h:116: error: declaration for parameter ‘TclPlatStubs’ but no such parameter
  28. /usr/include/tcl8.4/tclDecls.h:2286: error: declaration for parameter ‘TclStubs’ but no such parameter
  29. /usr/include/tcl8.4/tclDecls.h:1658: error: declaration for parameter ‘TclStubHooks’ but no such parameter
  30. /usr/include/tcl8.4/tclDecls.h:1371: error: declaration for parameter ‘Tcl_AttemptDbCkrealloc’ but no such parameter
  31. /usr/include/tcl8.4/tclDecls.h:1368: error: declaration for parameter ‘Tcl_AttemptRealloc’ but no such parameter
  32. /usr/include/tcl8.4/tclDecls.h:1365: error: declaration for parameter ‘Tcl_AttemptDbCkalloc’ but no such parameter
  33. /usr/include/tcl8.4/tclDecls.h:1363: error: declaration for parameter ‘Tcl_AttemptAlloc’ but no such parameter
  34. /usr/include/tcl8.4/tclDecls.h:1323: error: declaration for parameter ‘Tcl_IsChannelExisting’ but no such parameter
  35. /usr/include/tcl8.4/tclDecls.h:1201: error: declaration for parameter ‘Tcl_UniCharIsPunct’ but no such parameter
  36. /usr/include/tcl8.4/tclDecls.h:1199: error: declaration for parameter ‘Tcl_UniCharIsPrint’ but no such parameter
  37. /usr/include/tcl8.4/tclDecls.h:1197: error: declaration for parameter ‘Tcl_UniCharIsGraph’ but no such parameter
  38. /usr/include/tcl8.4/tclDecls.h:1195: error: declaration for parameter ‘Tcl_UniCharIsControl’ but no such parameter
  39. /usr/include/tcl8.4/tclDecls.h:1192: error: declaration for parameter ‘Tcl_StringCaseMatch’ but no such parameter
  40. /usr/include/tcl8.4/tclDecls.h:1189: error: declaration for parameter ‘Tcl_UtfNcasecmp’ but no such parameter
  41. /usr/include/tcl8.4/tclDecls.h:1186: error: declaration for parameter ‘Tcl_UtfNcmp’ but no such parameter
  42. /usr/include/tcl8.4/tclDecls.h:1183: error: declaration for parameter ‘Tcl_Stat’ but no such parameter
  43. /usr/include/tcl8.4/tclDecls.h:1181: error: declaration for parameter ‘Tcl_Access’ but no such parameter
  44. /usr/include/tcl8.4/tclDecls.h:1179: error: declaration for parameter ‘Tcl_Chdir’ but no such parameter
  45. /usr/include/tcl8.4/tclDecls.h:1126: error: declaration for parameter ‘Tcl_UniCharIsWordChar’ but no such parameter
  46. /usr/include/tcl8.4/tclDecls.h:1124: error: declaration for parameter ‘Tcl_UniCharIsUpper’ but no such parameter
  47. /usr/include/tcl8.4/tclDecls.h:1122: error: declaration for parameter ‘Tcl_UniCharIsSpace’ but no such parameter
  48. /usr/include/tcl8.4/tclDecls.h:1120: error: declaration for parameter ‘Tcl_UniCharIsLower’ but no such parameter
  49. /usr/include/tcl8.4/tclDecls.h:1118: error: declaration for parameter ‘Tcl_UniCharIsDigit’ but no such parameter
  50. /usr/include/tcl8.4/tclDecls.h:1116: error: declaration for parameter ‘Tcl_UniCharIsAlpha’ but no such parameter
  51. /usr/include/tcl8.4/tclDecls.h:1114: error: declaration for parameter ‘Tcl_UniCharIsAlnum’ but no such parameter
  52. /usr/include/tcl8.4/tclDecls.h:1112: error: declaration for parameter ‘Tcl_ServiceModeHook’ but no such parameter
  53. /usr/include/tcl8.4/tclDecls.h:1107: error: declaration for parameter ‘Tcl_SetDefaultEncodingDir’ but no such parameter
  54. /usr/include/tcl8.4/tclDecls.h:1105: error: declaration for parameter ‘Tcl_GetDefaultEncodingDir’ but no such parameter
  55. /usr/include/tcl8.4/tclDecls.h:1095: error: declaration for parameter ‘Tcl_UtfToUpper’ but no such parameter
  56. /usr/include/tcl8.4/tclDecls.h:1092: error: declaration for parameter ‘Tcl_UtfToUniChar’ but no such parameter
  57. /usr/include/tcl8.4/tclDecls.h:1090: error: declaration for parameter ‘Tcl_UtfToTitle’ but no such parameter
  58. /usr/include/tcl8.4/tclDecls.h:1088: error: declaration for parameter ‘Tcl_UtfToLower’ but no such parameter
  59. /usr/include/tcl8.4/tclDecls.h:1074: error: declaration for parameter ‘Tcl_UtfPrev’ but no such parameter
  60. /usr/include/tcl8.4/tclDecls.h:1072: error: declaration for parameter ‘Tcl_UtfNext’ but no such parameter
  61. /usr/include/tcl8.4/tclDecls.h:1069: error: declaration for parameter ‘Tcl_UtfFindLast’ but no such parameter
  62. /usr/include/tcl8.4/tclDecls.h:1066: error: declaration for parameter ‘Tcl_UtfFindFirst’ but no such parameter
  63. /usr/include/tcl8.4/tclDecls.h:1063: error: declaration for parameter ‘Tcl_UtfBackslash’ but no such parameter
  64. /usr/include/tcl8.4/tclDecls.h:1060: error: declaration for parameter ‘Tcl_UtfCharComplete’ but no such parameter
  65. /usr/include/tcl8.4/tclDecls.h:1057: error: declaration for parameter ‘Tcl_UtfAtIndex’ but no such parameter
  66. /usr/include/tcl8.4/tclDecls.h:1055: error: declaration for parameter ‘Tcl_UniCharToUtf’ but no such parameter
  67. /usr/include/tcl8.4/tclDecls.h:1020: error: declaration for parameter ‘Tcl_NumUtfChars’ but no such parameter
  68. /usr/include/tcl8.4/tclDecls.h:977: error: declaration for parameter ‘Tcl_FinalizeThread’ but no such parameter
  69. /usr/include/tcl8.4/tclDecls.h:964: error: declaration for parameter ‘Tcl_ExitThread’ but no such parameter
  70. /usr/include/tcl8.4/tclDecls.h:922: error: declaration for parameter ‘Tcl_GetVersion’ but no such parameter
  71. /usr/include/tcl8.4/tclDecls.h:919: error: declaration for parameter ‘Tcl_PanicVA’ but no such parameter
  72. /usr/include/tcl8.4/tclDecls.h:879: error: declaration for parameter ‘Tcl_ValidateAllMemory’ but no such parameter
  73. /usr/include/tcl8.4/tclDecls.h:876: error: declaration for parameter ‘Tcl_DumpActiveMemory’ but no such parameter
  74. /usr/include/tcl8.4/tclDecls.h:800: error: declaration for parameter ‘Tcl_StringMatch’ but no such parameter
  75. /usr/include/tcl8.4/tclDecls.h:792: error: declaration for parameter ‘Tcl_SplitPath’ but no such parameter
  76. /usr/include/tcl8.4/tclDecls.h:784: error: declaration for parameter ‘Tcl_SignalMsg’ but no such parameter
  77. /usr/include/tcl8.4/tclDecls.h:782: error: declaration for parameter ‘Tcl_SignalId’ but no such parameter
  78. /usr/include/tcl8.4/tclDecls.h:763: error: declaration for parameter ‘Tcl_SetServiceMode’ but no such parameter
  79. /usr/include/tcl8.4/tclDecls.h:748: error: declaration for parameter ‘Tcl_SetErrno’ but no such parameter
  80. /usr/include/tcl8.4/tclDecls.h:729: error: declaration for parameter ‘Tcl_ServiceEvent’ but no such parameter
  81. /usr/include/tcl8.4/tclDecls.h:727: error: declaration for parameter ‘Tcl_ServiceAll’ but no such parameter
  82. /usr/include/tcl8.4/tclDecls.h:721: error: declaration for parameter ‘Tcl_ScanCountedElement’ but no such parameter
  83. /usr/include/tcl8.4/tclDecls.h:718: error: declaration for parameter ‘Tcl_ScanElement’ but no such parameter
  84. /usr/include/tcl8.4/tclDecls.h:680: error: declaration for parameter ‘Tcl_ReapDetachedProcs’ but no such parameter
  85. /usr/include/tcl8.4/tclDecls.h:669: error: declaration for parameter ‘Tcl_PutEnv’ but no such parameter
  86. /usr/include/tcl8.4/tclDecls.h:622: error: declaration for parameter ‘Tcl_Merge’ but no such parameter
  87. /usr/include/tcl8.4/tclDecls.h:606: error: declaration for parameter ‘Tcl_JoinPath’ but no such parameter
  88. /usr/include/tcl8.4/tclDecls.h:566: error: declaration for parameter ‘Tcl_GetServiceMode’ but no such parameter
  89. /usr/include/tcl8.4/tclDecls.h:548: error: declaration for parameter ‘Tcl_GetNameOfExecutable’ but no such parameter
  90. /usr/include/tcl8.4/tclDecls.h:540: error: declaration for parameter ‘Tcl_GetHostName’ but no such parameter
  91. /usr/include/tcl8.4/tclDecls.h:538: error: declaration for parameter ‘Tcl_GetErrno’ but no such parameter
  92. /usr/include/tcl8.4/tclDecls.h:483: error: declaration for parameter ‘Tcl_FindExecutable’ but no such parameter
  93. /usr/include/tcl8.4/tclDecls.h:481: error: declaration for parameter ‘Tcl_Finalize’ but no such parameter
  94. /usr/include/tcl8.4/tclDecls.h:451: error: declaration for parameter ‘Tcl_Exit’ but no such parameter
  95. /usr/include/tcl8.4/tclDecls.h:436: error: declaration for parameter ‘Tcl_ErrnoMsg’ but no such parameter
  96. /usr/include/tcl8.4/tclDecls.h:434: error: declaration for parameter ‘Tcl_ErrnoId’ but no such parameter
  97. /usr/include/tcl8.4/tclDecls.h:402: error: declaration for parameter ‘Tcl_DoOneEvent’ but no such parameter
  98. /usr/include/tcl8.4/tclDecls.h:382: error: declaration for parameter ‘Tcl_DetachPids’ but no such parameter
  99. /usr/include/tcl8.4/tclDecls.h:283: error: declaration for parameter ‘Tcl_ConvertCountedElement’ but no such parameter
  100. /usr/include/tcl8.4/tclDecls.h:280: error: declaration for parameter ‘Tcl_ConvertElement’ but no such parameter
  101. /usr/include/tcl8.4/tclDecls.h:277: error: declaration for parameter ‘Tcl_Concat’ but no such parameter
  102. /usr/include/tcl8.4/tclDecls.h:275: error: declaration for parameter ‘Tcl_CommandComplete’ but no such parameter
  103. /usr/include/tcl8.4/tclDecls.h:257: error: declaration for parameter ‘Tcl_Backslash’ but no such parameter
  104. /usr/include/tcl8.4/tclDecls.h:253: error: declaration for parameter ‘Tcl_AsyncReady’ but no such parameter
  105. /usr/include/tcl8.4/tclDecls.h:69: error: declaration for parameter ‘Tcl_Sleep’ but no such parameter
  106. /usr/include/tcl8.4/tclDecls.h:64: error: declaration for parameter ‘Tcl_DeleteFileHandler’ but no such parameter
  107. /usr/include/tcl8.4/tclDecls.h:59: error: declaration for parameter ‘Tcl_CreateFileHandler’ but no such parameter
  108. /usr/include/tcl8.4/tclDecls.h:54: error: declaration for parameter ‘Tcl_DbCkrealloc’ but no such parameter
  109. /usr/include/tcl8.4/tclDecls.h:51: error: declaration for parameter ‘Tcl_DbCkfree’ but no such parameter
  110. /usr/include/tcl8.4/tclDecls.h:48: error: declaration for parameter ‘Tcl_DbCkalloc’ but no such parameter
  111. /usr/include/tcl8.4/tclDecls.h:45: error: declaration for parameter ‘Tcl_Realloc’ but no such parameter
  112. /usr/include/tcl8.4/tclDecls.h:43: error: declaration for parameter ‘Tcl_Free’ but no such parameter
  113. /usr/include/tcl8.4/tclDecls.h:41: error: declaration for parameter ‘Tcl_Alloc’ but no such parameter
  114. /usr/include/tcl8.4/tclDecls.h:39: error: declaration for parameter ‘Tcl_Panic’ but no such parameter
  115. /usr/include/tcl8.4/tcl.h:2250: error: declaration for parameter ‘Tcl_UniChar’ but no such parameter
  116. /usr/include/tcl8.4/tcl.h:2182: error: declaration for parameter ‘Tcl_Parse’ but no such parameter
  117. /usr/include/tcl8.4/tcl.h:2022: error: declaration for parameter ‘Tcl_Token’ but no such parameter
  118. /usr/include/tcl8.4/tcl.h:1964: error: declaration for parameter ‘Tcl_EncodingType’ but no such parameter
  119. /usr/include/tcl8.4/tcl.h:1937: error: declaration for parameter ‘Tcl_NotifierProcs’ but no such parameter
  120. /usr/include/tcl8.4/tcl.h:1910: error: declaration for parameter ‘Tcl_Filesystem’ but no such parameter
  121. /usr/include/tcl8.4/tcl.h:1711: error: declaration for parameter ‘Tcl_FSVersion’ but no such parameter
  122. /usr/include/tcl8.4/tcl.h:1630: error: declaration for parameter ‘Tcl_GlobTypeData’ but no such parameter
  123. /usr/include/tcl8.4/tcl.h:1614: error: declaration for parameter ‘Tcl_PathType’ but no such parameter
  124. /usr/include/tcl8.4/tcl.h:1596: error: declaration for parameter ‘Tcl_ChannelType’ but no such parameter
  125. /usr/include/tcl8.4/tcl.h:1407: error: declaration for parameter ‘Tcl_Time’ but no such parameter
  126. /usr/include/tcl8.4/tcl.h:1388: error: declaration for parameter ‘Tcl_QueuePosition’ but no such parameter
  127. /usr/include/tcl8.4/tcl.h:1285: error: declaration for parameter ‘Tcl_HashSearch’ but no such parameter
  128. /usr/include/tcl8.4/tcl.h:1120: error: declaration for parameter ‘Tcl_CompareHashKeysProc’ but no such parameter
  129. /usr/include/tcl8.4/tcl.h:1116: error: declaration for parameter ‘Tcl_HashEntry’ but no such parameter
  130. /usr/include/tcl8.4/tcl.h:1115: error: declaration for parameter ‘Tcl_HashTable’ but no such parameter
  131. /usr/include/tcl8.4/tcl.h:1114: error: declaration for parameter ‘Tcl_HashKeyType’ but no such parameter
  132. /usr/include/tcl8.4/tcl.h:997: error: declaration for parameter ‘Tcl_DString’ but no such parameter
  133. /usr/include/tcl8.4/tcl.h:979: error: declaration for parameter ‘Tcl_CmdInfo’ but no such parameter
  134. /usr/include/tcl8.4/tcl.h:942: error: declaration for parameter ‘Tcl_CallFrame’ but no such parameter
  135. /usr/include/tcl8.4/tcl.h:905: error: declaration for parameter ‘Tcl_Namespace’ but no such parameter
  136. /usr/include/tcl8.4/tcl.h:880: error: declaration for parameter ‘Tcl_SavedResult’ but no such parameter
  137. /usr/include/tcl8.4/tcl.h:802: error: declaration for parameter ‘Tcl_Obj’ but no such parameter
  138. /usr/include/tcl8.4/tcl.h:764: error: declaration for parameter ‘Tcl_ObjType’ but no such parameter
  139. /usr/include/tcl8.4/tcl.h:738: error: declaration for parameter ‘Tcl_MainLoopProc’ but no such parameter
  140. /usr/include/tcl8.4/tcl.h:736: error: declaration for parameter ‘ClientData’ but no such parameter
  141. /usr/include/tcl8.4/tcl.h:735: error: declaration for parameter ‘Tcl_ServiceModeHookProc’ but no such parameter
  142. /usr/include/tcl8.4/tcl.h:733: error: declaration for parameter ‘Tcl_DeleteFileHandlerProc’ but no such parameter
  143. /usr/include/tcl8.4/tcl.h:731: error: declaration for parameter ‘Tcl_CreateFileHandlerProc’ but no such parameter
  144. /usr/include/tcl8.4/tcl.h:725: error: declaration for parameter ‘Tcl_UpdateStringProc’ but no such parameter
  145. /usr/include/tcl8.4/tcl.h:719: error: declaration for parameter ‘Tcl_PanicProc’ but no such parameter
  146. /usr/include/tcl8.4/tcl.h:709: error: declaration for parameter ‘Tcl_FreeProc’ but no such parameter
  147. /usr/include/tcl8.4/tcl.h:708: error: declaration for parameter ‘Tcl_FreeInternalRepProc’ but no such parameter
  148. /usr/include/tcl8.4/tcl.h:691: error: declaration for parameter ‘Tcl_DupInternalRepProc’ but no such parameter
  149. /usr/include/tcl8.4/tcl.h:662: error: declaration for parameter ‘Tcl_Value’ but no such parameter
  150. /usr/include/tcl8.4/tcl.h:655: error: declaration for parameter ‘Tcl_ValueType’ but no such parameter
  151. /usr/include/tcl8.4/tcl.h:611: error: declaration for parameter ‘Tcl_OldStat_’ but no such parameter
  152. /usr/include/tcl8.4/tcl.h:604: error: declaration for parameter ‘Tcl_RegExpInfo’ but no such parameter
  153. /usr/include/tcl8.4/tcl.h:594: error: declaration for parameter ‘Tcl_RegExpIndices’ but no such parameter
  154. /usr/include/tcl8.4/tcl.h:511: error: declaration for parameter ‘Tcl_LoadHandle’ but no such parameter
  155. /usr/include/tcl8.4/tcl.h:510: error: declaration for parameter ‘Tcl_ChannelTypeVersion’ but no such parameter
  156. /usr/include/tcl8.4/tcl.h:509: error: declaration for parameter ‘Tcl_Var’ but no such parameter
  157. /usr/include/tcl8.4/tcl.h:508: error: declaration for parameter ‘Tcl_Trace’ but no such parameter
  158. /usr/include/tcl8.4/tcl.h:507: error: declaration for parameter ‘Tcl_TimerToken’ but no such parameter
  159. /usr/include/tcl8.4/tcl.h:506: error: declaration for parameter ‘Tcl_ThreadId’ but no such parameter
  160. /usr/include/tcl8.4/tcl.h:505: error: declaration for parameter ‘Tcl_ThreadDataKey’ but no such parameter
  161. /usr/include/tcl8.4/tcl.h:504: error: declaration for parameter ‘Tcl_RegExp’ but no such parameter
  162. /usr/include/tcl8.4/tcl.h:503: error: declaration for parameter ‘Tcl_Pid’ but no such parameter
  163. /usr/include/tcl8.4/tcl.h:502: error: declaration for parameter ‘Tcl_Mutex’ but no such parameter
  164. /usr/include/tcl8.4/tcl.h:501: error: declaration for parameter ‘Tcl_Event’ but no such parameter
  165. /usr/include/tcl8.4/tcl.h:500: error: declaration for parameter ‘Tcl_Encoding’ but no such parameter
  166. /usr/include/tcl8.4/tcl.h:499: error: declaration for parameter ‘Tcl_EncodingState’ but no such parameter
  167. /usr/include/tcl8.4/tcl.h:498: error: declaration for parameter ‘Tcl_Condition’ but no such parameter
  168. /usr/include/tcl8.4/tcl.h:497: error: declaration for parameter ‘Tcl_Command’ but no such parameter
  169. /usr/include/tcl8.4/tcl.h:496: error: declaration for parameter ‘Tcl_Channel’ but no such parameter
  170. /usr/include/tcl8.4/tcl.h:495: error: declaration for parameter ‘Tcl_AsyncHandler’ but no such parameter
  171. /usr/include/tcl8.4/tcl.h:493: error: declaration for parameter ‘Tcl_Interp’ but no such parameter
  172. /usr/include/tcl8.4/tcl.h:417: error: declaration for parameter ‘Tcl_WideUInt’ but no such parameter
  173. /usr/include/tcl8.4/tcl.h:416: error: declaration for parameter ‘Tcl_WideInt’ but no such parameter
  174. /usr/include/tcl8.4/tcl.h:378: error: declaration for parameter ‘Tcl_StatBuf’ but no such parameter
  175. /usr/include/tcl8.4/tcl.h:321: error: declaration for parameter ‘ClientData’ but no such parameter
  176. user_mgr.h:110: error: declaration for parameter ‘user_from_room’ but no such parameter
  177. user_mgr.h:109: error: declaration for parameter ‘user_by_ip’ but no such parameter
  178. user_mgr.h:105: error: declaration for parameter ‘_TO_RL’ but no such parameter
  179. user_mgr.h:104: error: declaration for parameter ‘TO_RL’ but no such parameter
  180. user_mgr.h:103: error: declaration for parameter ‘_TO_R’ but no such parameter
  181. user_mgr.h:102: error: declaration for parameter ‘TO_R’ but no such parameter
  182. user_mgr.h:97: error: declaration for parameter ‘TO_ALL’ but no such parameter
  183. user_mgr.h:96: error: declaration for parameter ‘_TO_ALL’ but no such parameter
  184. user_mgr.h:90: error: declaration for parameter ‘ausers’ but no such parameter
  185. user_mgr.h:80: error: declaration for parameter ‘user_every_second’ but no such parameter
  186. user_mgr.h:73: error: declaration for parameter ‘user_mgr_init’ but no such parameter
  187. user_mgr.h:53: error: declaration for parameter ‘user_t’ but no such parameter
  188. user_mgr.h:34: error: declaration for parameter ‘room_t’ but no such parameter
  189. reqhandler.h:46: error: declaration for parameter ‘insert_ban’ but no such parameter
  190. reqhandler.h:45: error: declaration for parameter ‘get_banlist’ but no such parameter
  191. reqhandler.h:42: error: declaration for parameter ‘handle_css’ but no such parameter
  192. reqhandler.h:41: error: declaration for parameter ‘handle_js’ but no such parameter
  193. reqhandler.h:40: error: declaration for parameter ‘handle_version’ but no such parameter
  194. reqhandler.h:39: error: declaration for parameter ‘handle_chatlist’ but no such parameter
  195. reqhandler.h:38: error: declaration for parameter ‘handle_admin’ but no such parameter
  196. reqhandler.h:37: error: declaration for parameter ‘handle_input’ but no such parameter
  197. reqhandler.h:36: error: declaration for parameter ‘handle_reallogin’ but no such parameter
  198. reqhandler.h:35: error: declaration for parameter ‘handle_source’ but no such parameter
  199. reqhandler.h:34: error: declaration for parameter ‘handle_login’ but no such parameter
  200. reqhandler.h:32: error: declaration for parameter ‘hnd_takeover’ but no such parameter
  201. reqhandler.h:29: error: declaration for parameter ‘hnd_every_second’ but no such parameter
  202. reqhandler.h:28: error: declaration for parameter ‘hnd_reloadbans’ but no such parameter
  203. reqhandler.h:27: error: declaration for parameter ‘hnd_loadbans’ but no such parameter
  204. reqhandler.h:26: error: declaration for parameter ‘hnd_init’ but no such parameter
  205. strutil.h:156: error: declaration for parameter ‘regexp_match’ but no such parameter
  206. strutil.h:154: error: declaration for parameter ‘host_in_net’ but no such parameter
  207. strutil.h:152: error: declaration for parameter ‘fix_input’ but no such parameter
  208. strutil.h:151: error: declaration for parameter ‘input_ok’ but no such parameter
  209. strutil.h:149: error: declaration for parameter ‘asha1’ but no such parameter
  210. strutil.h:148: error: declaration for parameter ‘amd5’ but no such parameter
  211. strutil.h:146: error: declaration for parameter ‘ahttpheaderget’ but no such parameter
  212. strutil.h:144: error: declaration for parameter ‘agettime’ but no such parameter
  213. strutil.h:143: error: declaration for parameter ‘sgettime’ but no such parameter
  214. strutil.h:142: error: declaration for parameter ‘agettimestamp’ but no such parameter
  215. strutil.h:140: error: declaration for parameter ‘surldecode’ but no such parameter
  216. strutil.h:139: error: declaration for parameter ‘aurldecode’ but no such parameter
  217. strutil.h:138: error: declaration for parameter ‘hexget’ but no such parameter
  218. strutil.h:136: error: declaration for parameter ‘goodnick’ but no such parameter
  219. strutil.h:135: error: declaration for parameter ‘strcons’ but no such parameter
  220. strutil.h:133: error: declaration for parameter ‘sfirstline’ but no such parameter
  221. strutil.h:132: error: declaration for parameter ‘afirstline’ but no such parameter
  222. strutil.h:130: error: declaration for parameter ‘xmallocempty’ but no such parameter
  223. strutil.h:129: error: declaration for parameter ‘surlextract’ but no such parameter
  224. strutil.h:128: error: declaration for parameter ‘aurlextract’ but no such parameter
  225. strutil.h:126: error: declaration for parameter ‘areplace_raw’ but no such parameter
  226. strutil.h:125: error: declaration for parameter ‘sreplacei’ but no such parameter
  227. strutil.h:124: error: declaration for parameter ‘sreplace’ but no such parameter
  228. strutil.h:123: error: declaration for parameter ‘areplacei’ but no such parameter
  229. strutil.h:122: error: declaration for parameter ‘areplace’ but no such parameter
  230. strutil.h:120: error: declaration for parameter ‘stoupper’ but no such parameter
  231. strutil.h:119: error: declaration for parameter ‘atoupper’ but no such parameter
  232. strutil.h:118: error: declaration for parameter ‘stolower’ but no such parameter
  233. strutil.h:117: error: declaration for parameter ‘atolower’ but no such parameter
  234. strutil.h:116: error: declaration for parameter ‘aiterate’ but no such parameter
  235. strutil.h:114: error: declaration for parameter ‘vasprintf’ but no such parameter
  236. strutil.h:113: error: declaration for parameter ‘asprintf’ but no such parameter
  237. strutil.h:112: error: declaration for parameter ‘ssprintf’ but no such parameter
  238. strutil.h:110: error: declaration for parameter ‘goodnick_ab’ but no such parameter
  239. strutil.h:108: error: declaration for parameter ‘standard_footer’ but no such parameter
  240. strutil.h:101: error: declaration for parameter ‘css_header’ but no such parameter
  241. strutil.h:94: error: declaration for parameter ‘js_header’ but no such parameter
  242. strutil.h:87: error: declaration for parameter ‘plain_header’ but no such parameter
  243. strutil.h:80: error: declaration for parameter ‘source_header’ but no such parameter
  244. strutil.h:72: error: declaration for parameter ‘forward_header’ but no such parameter
  245. strutil.h:66: error: declaration for parameter ‘nocontent_header’ but no such parameter
  246. main.h:61: error: declaration for parameter ‘get_hostname’ but no such parameter
  247. main.h:57: error: declaration for parameter ‘timeout_outgoing’ but no such parameter
  248. main.h:56: error: declaration for parameter ‘timeout_incoming’ but no such parameter
  249. main.h:54: error: declaration for parameter ‘every_second’ but no such parameter
  250. main.h:52: error: declaration for parameter ‘handle_incoming’ but no such parameter
  251. main.h:49: error: declaration for parameter ‘accept_one’ but no such parameter
  252. main.h:48: error: declaration for parameter ‘init_listen’ but no such parameter
  253. main.h:47: error: declaration for parameter ‘main_loop’ but no such parameter
  254. main.h:46: error: declaration for parameter ‘init_config’ but no such parameter
  255. main.h:45: error: declaration for parameter ‘init_source’ but no such parameter
  256. main.h:43: error: declaration for parameter ‘out’ but no such parameter
  257. main.h:42: error: declaration for parameter ‘all’ but no such parameter
  258. main.h:39: error: declaration for parameter ‘sourcelen’ but no such parameter
  259. main.h:38: error: declaration for parameter ‘sourcebuf’ but no such parameter
  260. main.h:37: error: declaration for parameter ‘source’ but no such parameter
  261. main.h:36: error: declaration for parameter ‘bindaddr’ but no such parameter
  262. main.h:35: error: declaration for parameter ‘port’ but no such parameter
  263. main.h:34: error: declaration for parameter ‘logfile’ but no such parameter
  264. main.h:33: error: declaration for parameter ‘isdaemon’ but no such parameter
  265. sock_queue.h:52: error: declaration for parameter ‘outgoing_t’ but no such parameter
  266. sock_queue.h:36: error: declaration for parameter ‘incoming_t’ but no such parameter
  267. sqlcon.h:52: error: declaration for parameter ‘sql_ferien_get’ but no such parameter
  268. sqlcon.h:50: error: declaration for parameter ‘sql_getbaninfo’ but no such parameter
  269. sqlcon.h:49: error: declaration for parameter ‘sql_setbaninfo’ but no such parameter
  270. sqlcon.h:48: error: declaration for parameter ‘sql_setban’ but no such parameter
  271. sqlcon.h:46: error: declaration for parameter ‘sql_reg_access’ but no such parameter
  272. sqlcon.h:45: error: declaration for parameter ‘sql_reg_set’ but no such parameter
  273. sqlcon.h:43: error: declaration for parameter ‘sql_my_sql_set’ but no such parameter
  274. sqlcon.h:42: error: declaration for parameter ‘sql_my_sql_get’ but no such parameter
  275. sqlcon.h:39: error: declaration for parameter ‘sql_reg_get’ but no such parameter
  276. sqlcon.h:37: error: declaration for parameter ‘sql_txt’ but no such parameter
  277. sqlcon.h:36: error: declaration for parameter ‘sql_cstr’ but no such parameter
  278. sqlcon.h:35: error: declaration for parameter ‘sql_cnum’ but no such parameter
  279. sqlcon.h:33: error: declaration for parameter ‘sql_get’ but no such parameter
  280. sqlcon.h:31: error: declaration for parameter ‘apply_replaces’ but no such parameter
  281. sqlcon.h:28: error: declaration for parameter ‘load_replaces’ but no such parameter
  282. sqlcon.h:27: error: declaration for parameter ‘reload_mysql’ but no such parameter
  283. sqlcon.h:26: error: declaration for parameter ‘init_mysql’ but no such parameter
  284. shash.h:63: error: declaration for parameter ‘ihash_clear’ but no such parameter
  285. shash.h:62: error: declaration for parameter ‘shash_clear’ but no such parameter
  286. shash.h:48: error: declaration for parameter ‘shash_cmp’ but no such parameter
  287. shash.h:47: error: declaration for parameter ‘ihash_cmp’ but no such parameter
  288. shash.h:46: error: declaration for parameter ‘shash_hash’ but no such parameter
  289. shash.h:45: error: declaration for parameter ‘ihash_hash’ but no such parameter
  290. shash.h:40: error: declaration for parameter ‘ihashval_t’ but no such parameter
  291. shash.h:34: error: declaration for parameter ‘shashval_t’ but no such parameter
  292. shash.h:28: error: declaration for parameter ‘ihash_t’ but no such parameter
  293. shash.h:27: error: declaration for parameter ‘shash_t’ but no such parameter
  294. main.c:457: error: expected ‘{’ at end of input
  295. make: *** [main.o] Fehler 1
  296. root@debian:/home/akuba/Desktop/jatsche-2.1#
RAW Paste Data
We use cookies for various purposes including analytics. By continuing to use Pastebin, you agree to our use of cookies as described in the Cookies Policy. OK, I Understand
 
Top