SHARE
TWEET

gcc-gcj makepkg-error

a guest Apr 11th, 2016 79 Never
Not a member of Pastebin yet? Sign Up, it unlocks many cool features!
  1. ../../gcc/config/i386/i386.md: In function ‘int recog_136(rtx, rtx_insn*, int*)’:
  2. ../../gcc/config/i386/i386.md:8641:22: error: ‘GET_C_DE’ was not declared in this scope
  3. Makefile:1065: recipe for target 'insn-recog.o' failed
  4. make[3]: *** [insn-recog.o] Error 1
  5. make[3]: Leaving directory '/home/myhomedir/temp-gcc/gcc-gcj/src/gcc-5.3.0/build/gcc'
  6. Makefile:4373: recipe for target 'all-stage1-gcc' failed
  7. make[2]: *** [all-stage1-gcc] Error 2
  8. make[2]: Leaving directory '/home/myhomedir/temp-gcc/gcc-gcj/src/gcc-5.3.0/build'
  9. Makefile:21779: recipe for target 'stage1-bubble' failed
  10. make[1]: *** [stage1-bubble] Error 2
  11. make[1]: Leaving directory '/home/myhomedir/temp-gcc/gcc-gcj/src/gcc-5.3.0/build'
  12. Makefile:904: recipe for target 'all' failed
  13. make: *** [all] Error 2
  14. ==> ERROR: A failure occurred in build().
  15.     Aborting...
RAW Paste Data
We use cookies for various purposes including analytics. By continuing to use Pastebin, you agree to our use of cookies as described in the Cookies Policy. OK, I Understand
Not a member of Pastebin yet?
Sign Up, it unlocks many cool features!
 
Top