Not a member of Pastebin yet?
Sign Up,
it unlocks many cool features!
- This file contains any messages produced by compilers while
- running configure, to aid debugging if configure makes a mistake.
- It was created by Bitcoin Core configure 0.18.99, which was
- generated by GNU Autoconf 2.69. Invocation command line was
- $ ./configure
- ## --------- ##
- ## Platform. ##
- ## --------- ##
- hostname = f008.local
- uname -m = x86_64
- uname -r = 18.7.0
- uname -s = Darwin
- uname -v = Darwin Kernel Version 18.7.0: Thu Jun 20 18:42:21 PDT 2019; root:xnu-4903.270.47~4/RELEASE_X86_64
- /usr/bin/uname -p = i386
- /bin/uname -X = unknown
- /bin/arch = unknown
- /usr/bin/arch -k = unknown
- /usr/convex/getsysinfo = unknown
- /usr/bin/hostinfo = Mach kernel version:
- Darwin Kernel Version 18.7.0: Thu Jun 20 18:42:21 PDT 2019; root:xnu-4903.270.47~4/RELEASE_X86_64
- Kernel configured for up to 8 processors.
- 4 processors are physically available.
- 8 processors are logically available.
- Processor type: x86_64h (Intel x86-64h Haswell)
- Processors active: 0 1 2 3 4 5 6 7
- Primary memory available: 16.00 gigabytes
- Default processor set: 483 tasks, 1807 threads, 8 processors
- Load average: 1.37, Mach factor: 6.61
- /bin/machine = unknown
- /usr/bin/oslevel = unknown
- /bin/universe = unknown
- PATH: /usr/local/bin
- PATH: /usr/bin
- PATH: /bin
- PATH: /usr/sbin
- PATH: /sbin
- PATH: /usr/local/MacGPG2/bin
- ## ----------- ##
- ## Core tests. ##
- ## ----------- ##
- configure:3104: checking build system type
- configure:3118: result: x86_64-apple-darwin18.7.0
- configure:3138: checking host system type
- configure:3151: result: x86_64-apple-darwin18.7.0
- configure:3194: checking for a BSD-compatible install
- configure:3262: result: /usr/bin/install -c
- configure:3273: checking whether build environment is sane
- configure:3328: result: yes
- configure:3479: checking for a thread-safe mkdir -p
- configure:3518: result: build-aux/install-sh -c -d
- configure:3525: checking for gawk
- configure:3555: result: no
- configure:3525: checking for mawk
- configure:3555: result: no
- configure:3525: checking for nawk
- configure:3555: result: no
- configure:3525: checking for awk
- configure:3541: found /usr/bin/awk
- configure:3552: result: awk
- configure:3563: checking whether make sets $(MAKE)
- configure:3585: result: yes
- configure:3614: checking whether make supports nested variables
- configure:3631: result: yes
- configure:3750: checking whether to enable maintainer-specific portions of Makefiles
- configure:3759: result: yes
- configure:3784: checking whether make supports nested variables
- configure:3801: result: yes
- configure:3876: checking for g++
- configure:3892: found /usr/bin/g++
- configure:3903: result: g++
- configure:3930: checking for C++ compiler version
- configure:3939: g++ --version >&5
- Apple LLVM version 10.0.1 (clang-1001.0.46.4)
- Target: x86_64-apple-darwin18.7.0
- Thread model: posix
- InstalledDir: /Applications/Xcode.app/Contents/Developer/Toolchains/XcodeDefault.xctoolchain/usr/bin
- Configured with: --prefix=/Applications/Xcode.app/Contents/Developer/usr --with-gxx-include-dir=/Applications/Xcode.app/Contents/Developer/Platforms/MacOSX.platform/Developer/SDKs/MacOSX10.14.sdk/usr/include/c++/4.2.1
- configure:3950: $? = 0
- configure:3939: g++ -v >&5
- Configured with: --prefix=/Applications/Xcode.app/Contents/Developer/usr --with-gxx-include-dir=/Applications/Xcode.app/Contents/Developer/Platforms/MacOSX.platform/Developer/SDKs/MacOSX10.14.sdk/usr/include/c++/4.2.1
- Apple LLVM version 10.0.1 (clang-1001.0.46.4)
- Target: x86_64-apple-darwin18.7.0
- Thread model: posix
- InstalledDir: /Applications/Xcode.app/Contents/Developer/Toolchains/XcodeDefault.xctoolchain/usr/bin
- configure:3950: $? = 0
- configure:3939: g++ -V >&5
- clang: error: unsupported option '-V -Wno-atomic-implicit-seq-cst'
- clang: error: no input files
- configure:3950: $? = 1
- configure:3939: g++ -qversion >&5
- clang: error: unknown argument '-qversion', did you mean '--version'?
- clang: error: no input files
- configure:3950: $? = 1
- configure:3970: checking whether the C++ compiler works
- configure:3992: g++ conftest.cpp >&5
- configure:3996: $? = 0
- configure:4044: result: yes
- configure:4047: checking for C++ compiler default output file name
- configure:4049: result: a.out
- configure:4055: checking for suffix of executables
- configure:4062: g++ -o conftest conftest.cpp >&5
- configure:4066: $? = 0
- configure:4088: result:
- configure:4110: checking whether we are cross compiling
- configure:4118: g++ -o conftest conftest.cpp >&5
- configure:4122: $? = 0
- configure:4129: ./conftest
- configure:4133: $? = 0
- configure:4148: result: no
- configure:4153: checking for suffix of object files
- configure:4175: g++ -c conftest.cpp >&5
- configure:4179: $? = 0
- configure:4200: result: o
- configure:4204: checking whether we are using the GNU C++ compiler
- configure:4223: g++ -c conftest.cpp >&5
- configure:4223: $? = 0
- configure:4232: result: yes
- configure:4241: checking whether g++ accepts -g
- configure:4261: g++ -c -g conftest.cpp >&5
- configure:4261: $? = 0
- configure:4302: result: yes
- configure:4328: checking whether make supports the include directive
- configure:4343: make -f confmf.GNU && cat confinc.out
- this is the am__doit target
- configure:4346: $? = 0
- configure:4365: result: yes (GNU style)
- configure:4390: checking dependency style of g++
- configure:4501: result: gcc3
- configure:4539: checking whether g++ supports C++11 features with -std=c++11
- configure:4835: g++ -std=c++11 -c -g -O2 conftest.cpp >&5
- configure:4835: $? = 0
- configure:4844: result: yes
- configure:4888: checking whether std::atomic can be used without link library
- configure:4906: g++ -std=c++11 -o conftest -g -O2 conftest.cpp >&5
- configure:4906: $? = 0
- configure:4908: result: yes
- configure:5073: checking for Objective C++ compiler version
- configure:5082: g++ -std=c++11 --version >&5
- Apple LLVM version 10.0.1 (clang-1001.0.46.4)
- Target: x86_64-apple-darwin18.7.0
- Thread model: posix
- InstalledDir: /Applications/Xcode.app/Contents/Developer/Toolchains/XcodeDefault.xctoolchain/usr/bin
- configure:5093: $? = 0
- configure:5082: g++ -std=c++11 -v >&5
- Apple LLVM version 10.0.1 (clang-1001.0.46.4)
- Target: x86_64-apple-darwin18.7.0
- Thread model: posix
- InstalledDir: /Applications/Xcode.app/Contents/Developer/Toolchains/XcodeDefault.xctoolchain/usr/bin
- clang: warning: argument unused during compilation: '-std=c++11' [-Wunused-command-line-argument]
- configure:5093: $? = 0
- configure:5082: g++ -std=c++11 -V >&5
- clang: error: unsupported option '-V -Wno-atomic-implicit-seq-cst'
- clang: error: no input files
- configure:5093: $? = 1
- configure:5082: g++ -std=c++11 -qversion >&5
- clang: error: unknown argument '-qversion', did you mean '--version'?
- clang: error: no input files
- configure:5093: $? = 1
- configure:5097: checking whether we are using the GNU Objective C++ compiler
- configure:5116: g++ -std=c++11 -c conftest.mm >&5
- configure:5116: $? = 0
- configure:5125: result: yes
- configure:5134: checking whether g++ -std=c++11 accepts -g
- configure:5154: g++ -std=c++11 -c -g conftest.mm >&5
- configure:5154: $? = 0
- configure:5195: result: yes
- configure:5220: checking dependency style of g++ -std=c++11
- configure:5329: result: gcc3
- configure:5392: checking how to print strings
- configure:5419: result: printf
- configure:5488: checking for gcc
- configure:5504: found /usr/bin/gcc
- configure:5515: result: gcc
- configure:5744: checking for C compiler version
- configure:5753: gcc --version >&5
- Apple LLVM version 10.0.1 (clang-1001.0.46.4)
- Target: x86_64-apple-darwin18.7.0
- Thread model: posix
- InstalledDir: /Applications/Xcode.app/Contents/Developer/Toolchains/XcodeDefault.xctoolchain/usr/bin
- Configured with: --prefix=/Applications/Xcode.app/Contents/Developer/usr --with-gxx-include-dir=/Applications/Xcode.app/Contents/Developer/Platforms/MacOSX.platform/Developer/SDKs/MacOSX10.14.sdk/usr/include/c++/4.2.1
- configure:5764: $? = 0
- configure:5753: gcc -v >&5
- Configured with: --prefix=/Applications/Xcode.app/Contents/Developer/usr --with-gxx-include-dir=/Applications/Xcode.app/Contents/Developer/Platforms/MacOSX.platform/Developer/SDKs/MacOSX10.14.sdk/usr/include/c++/4.2.1
- Apple LLVM version 10.0.1 (clang-1001.0.46.4)
- Target: x86_64-apple-darwin18.7.0
- Thread model: posix
- InstalledDir: /Applications/Xcode.app/Contents/Developer/Toolchains/XcodeDefault.xctoolchain/usr/bin
- configure:5764: $? = 0
- configure:5753: gcc -V >&5
- clang: error: unsupported option '-V -Wno-atomic-implicit-seq-cst'
- clang: error: no input files
- configure:5764: $? = 1
- configure:5753: gcc -qversion >&5
- clang: error: unknown argument '-qversion', did you mean '--version'?
- clang: error: no input files
- configure:5764: $? = 1
- configure:5768: checking whether we are using the GNU C compiler
- configure:5787: gcc -c conftest.c >&5
- configure:5787: $? = 0
- configure:5796: result: yes
- configure:5805: checking whether gcc accepts -g
- configure:5825: gcc -c -g conftest.c >&5
- configure:5825: $? = 0
- configure:5866: result: yes
- configure:5883: checking for gcc option to accept ISO C89
- configure:5946: gcc -c -g -O2 conftest.c >&5
- configure:5946: $? = 0
- configure:5959: result: none needed
- configure:5984: checking whether gcc understands -c and -o together
- configure:6006: gcc -c conftest.c -o conftest2.o
- configure:6009: $? = 0
- configure:6006: gcc -c conftest.c -o conftest2.o
- configure:6009: $? = 0
- configure:6021: result: yes
- configure:6040: checking dependency style of gcc
- configure:6151: result: gcc3
- configure:6166: checking for a sed that does not truncate output
- configure:6230: result: /usr/bin/sed
- configure:6248: checking for grep that handles long lines and -e
- configure:6306: result: /usr/bin/grep
- configure:6311: checking for egrep
- configure:6373: result: /usr/bin/grep -E
- configure:6378: checking for fgrep
- configure:6440: result: /usr/bin/grep -F
- configure:6475: checking for ld used by gcc
- configure:6542: result: /Applications/Xcode.app/Contents/Developer/Toolchains/XcodeDefault.xctoolchain/usr/bin/ld
- configure:6549: checking if the linker (/Applications/Xcode.app/Contents/Developer/Toolchains/XcodeDefault.xctoolchain/usr/bin/ld) is GNU ld
- configure:6564: result: no
- configure:6576: checking for BSD- or MS-compatible name lister (nm)
- configure:6630: result: /usr/bin/nm -B
- configure:6760: checking the name lister (/usr/bin/nm -B) interface
- configure:6767: gcc -c -g -O2 conftest.c >&5
- configure:6770: /usr/bin/nm -B "conftest.o"
- configure:6773: output
- 00000000000001c4 S _some_variable
- configure:6780: result: BSD nm
- configure:6783: checking whether ln -s works
- configure:6787: result: yes
- configure:6795: checking the maximum length of command line arguments
- configure:6926: result: 196608
- configure:6974: checking how to convert x86_64-apple-darwin18.7.0 file names to x86_64-apple-darwin18.7.0 format
- configure:7014: result: func_convert_file_noop
- configure:7021: checking how to convert x86_64-apple-darwin18.7.0 file names to toolchain format
- configure:7041: result: func_convert_file_noop
- configure:7048: checking for /Applications/Xcode.app/Contents/Developer/Toolchains/XcodeDefault.xctoolchain/usr/bin/ld option to reload object files
- configure:7055: result: -r
- configure:7129: checking for objdump
- configure:7145: found /usr/bin/objdump
- configure:7156: result: objdump
- configure:7188: checking how to recognize dependent libraries
- configure:7388: result: pass_all
- configure:7473: checking for dlltool
- configure:7503: result: no
- configure:7533: checking how to associate runtime and link libraries
- configure:7560: result: printf %s\n
- configure:7621: checking for ar
- configure:7637: found /usr/bin/ar
- configure:7648: result: ar
- configure:7685: checking for archiver @FILE support
- configure:7702: gcc -c -g -O2 conftest.c >&5
- configure:7702: $? = 0
- configure:7705: ar cru libconftest.a @conftest.lst >&5
- ar: @conftest.lst: No such file or directory
- configure:7708: $? = 1
- configure:7728: result: no
- configure:7786: checking for strip
- configure:7802: found /usr/bin/strip
- configure:7813: result: strip
- configure:7885: checking for ranlib
- configure:7901: found /usr/bin/ranlib
- configure:7912: result: ranlib
- configure:8014: checking command to parse /usr/bin/nm -B output from gcc object
- configure:8167: gcc -c -g -O2 conftest.c >&5
- configure:8170: $? = 0
- configure:8174: /usr/bin/nm -B conftest.o \| sed -n -e 's/^.*[ ]\([BCDEGRST][BCDEGRST]*\)[ ][ ]*\([_A-Za-z][_A-Za-z0-9]*\)$/\1 \2 \2/p' | sed '/ __gnu_lto/d' \> conftest.nm
- configure:8177: $? = 0
- cannot find nm_test_var in conftest.nm
- configure:8167: gcc -c -g -O2 conftest.c >&5
- configure:8170: $? = 0
- configure:8174: /usr/bin/nm -B conftest.o \| sed -n -e 's/^.*[ ]\([BCDEGRST][BCDEGRST]*\)[ ][ ]*_\([_A-Za-z][_A-Za-z0-9]*\)$/\1 _\2 \2/p' | sed '/ __gnu_lto/d' \> conftest.nm
- configure:8177: $? = 0
- configure:8243: gcc -o conftest -g -O2 conftest.c conftstm.o >&5
- warning: (x86_64) could not find object file symbol for symbol _main
- configure:8246: $? = 0
- configure:8284: result: ok
- configure:8331: checking for sysroot
- configure:8361: result: no
- configure:8368: checking for a working dd
- configure:8406: result: /bin/dd
- configure:8410: checking how to truncate binary pipes
- configure:8425: result: /bin/dd bs=4096 count=1
- configure:8754: checking for mt
- configure:8784: result: no
- configure:8804: checking if : is a manifest tool
- configure:8810: : '-?'
- configure:8818: result: no
- configure:8874: checking for dsymutil
- configure:8890: found /usr/bin/dsymutil
- configure:8901: result: dsymutil
- configure:8966: checking for nmedit
- configure:8982: found /usr/bin/nmedit
- configure:8993: result: nmedit
- configure:9058: checking for lipo
- configure:9074: found /usr/bin/lipo
- configure:9085: result: lipo
- configure:9150: checking for otool
- configure:9166: found /usr/bin/otool
- configure:9177: result: otool
- configure:9242: checking for otool64
- configure:9272: result: no
- configure:9317: checking for -single_module linker flag
- gcc -g -O2 -o libconftest.dylib -dynamiclib -Wl,-single_module conftest.c
- configure:9350: result: yes
- configure:9353: checking for -exported_symbols_list linker flag
- configure:9373: gcc -o conftest -g -O2 -Wl,-exported_symbols_list,conftest.sym conftest.c >&5
- configure:9373: $? = 0
- configure:9383: result: yes
- configure:9386: checking for -force_load linker flag
- gcc -g -O2 -c -o conftest.o conftest.c
- ar cru libconftest.a conftest.o
- ranlib libconftest.a
- gcc -g -O2 -o conftest conftest.c -Wl,-force_load,./libconftest.a
- configure:9418: result: yes
- configure:9495: checking how to run the C preprocessor
- configure:9526: gcc -E conftest.c
- configure:9526: $? = 0
- configure:9540: gcc -E conftest.c
- conftest.c:10:10: fatal error: 'ac_nonexistent.h' file not found
- #include <ac_nonexistent.h>
- ^~~~~~~~~~~~~~~~~~
- 1 error generated.
- configure:9540: $? = 1
- configure: failed program was:
- | /* confdefs.h */
- | #define PACKAGE_NAME "Bitcoin Core"
- | #define PACKAGE_TARNAME "bitcoin"
- | #define PACKAGE_VERSION "0.18.99"
- | #define PACKAGE_STRING "Bitcoin Core 0.18.99"
- | #define PACKAGE_BUGREPORT "https://github.com/bitcoin/bitcoin/issues"
- | #define PACKAGE_URL "https://bitcoincore.org/"
- | #define HAVE_CXX11 1
- | /* end confdefs.h. */
- | #include <ac_nonexistent.h>
- configure:9565: result: gcc -E
- configure:9585: gcc -E conftest.c
- configure:9585: $? = 0
- configure:9599: gcc -E conftest.c
- conftest.c:10:10: fatal error: 'ac_nonexistent.h' file not found
- #include <ac_nonexistent.h>
- ^~~~~~~~~~~~~~~~~~
- 1 error generated.
- configure:9599: $? = 1
- configure: failed program was:
- | /* confdefs.h */
- | #define PACKAGE_NAME "Bitcoin Core"
- | #define PACKAGE_TARNAME "bitcoin"
- | #define PACKAGE_VERSION "0.18.99"
- | #define PACKAGE_STRING "Bitcoin Core 0.18.99"
- | #define PACKAGE_BUGREPORT "https://github.com/bitcoin/bitcoin/issues"
- | #define PACKAGE_URL "https://bitcoincore.org/"
- | #define HAVE_CXX11 1
- | /* end confdefs.h. */
- | #include <ac_nonexistent.h>
- configure:9628: checking for ANSI C header files
- configure:9648: gcc -c -g -O2 conftest.c >&5
- configure:9648: $? = 0
- configure:9721: gcc -o conftest -g -O2 conftest.c >&5
- configure:9721: $? = 0
- configure:9721: ./conftest
- configure:9721: $? = 0
- configure:9732: result: yes
- configure:9745: checking for sys/types.h
- configure:9745: gcc -c -g -O2 conftest.c >&5
- configure:9745: $? = 0
- configure:9745: result: yes
- configure:9745: checking for sys/stat.h
- configure:9745: gcc -c -g -O2 conftest.c >&5
- configure:9745: $? = 0
- configure:9745: result: yes
- configure:9745: checking for stdlib.h
- configure:9745: gcc -c -g -O2 conftest.c >&5
- configure:9745: $? = 0
- configure:9745: result: yes
- configure:9745: checking for string.h
- configure:9745: gcc -c -g -O2 conftest.c >&5
- configure:9745: $? = 0
- configure:9745: result: yes
- configure:9745: checking for memory.h
- configure:9745: gcc -c -g -O2 conftest.c >&5
- configure:9745: $? = 0
- configure:9745: result: yes
- configure:9745: checking for strings.h
- configure:9745: gcc -c -g -O2 conftest.c >&5
- configure:9745: $? = 0
- configure:9745: result: yes
- configure:9745: checking for inttypes.h
- configure:9745: gcc -c -g -O2 conftest.c >&5
- configure:9745: $? = 0
- configure:9745: result: yes
- configure:9745: checking for stdint.h
- configure:9745: gcc -c -g -O2 conftest.c >&5
- configure:9745: $? = 0
- configure:9745: result: yes
- configure:9745: checking for unistd.h
- configure:9745: gcc -c -g -O2 conftest.c >&5
- configure:9745: $? = 0
- configure:9745: result: yes
- configure:9759: checking for dlfcn.h
- configure:9759: gcc -c -g -O2 conftest.c >&5
- configure:9759: $? = 0
- configure:9759: result: yes
- configure:10024: checking for objdir
- configure:10039: result: .libs
- configure:10303: checking if gcc supports -fno-rtti -fno-exceptions
- configure:10321: gcc -c -g -O2 -fno-rtti -fno-exceptions conftest.c >&5
- configure:10325: $? = 0
- configure:10338: result: yes
- configure:10696: checking for gcc option to produce PIC
- configure:10703: result: -fno-common -DPIC
- configure:10711: checking if gcc PIC flag -fno-common -DPIC works
- configure:10729: gcc -c -g -O2 -fno-common -DPIC -DPIC conftest.c >&5
- configure:10733: $? = 0
- configure:10746: result: yes
- configure:10775: checking if gcc static flag -static works
- configure:10803: result: no
- configure:10818: checking if gcc supports -c -o file.o
- configure:10839: gcc -c -g -O2 -o out/conftest2.o conftest.c >&5
- configure:10843: $? = 0
- configure:10865: result: yes
- configure:10873: checking if gcc supports -c -o file.o
- configure:10920: result: yes
- configure:10953: checking whether the gcc linker (/Applications/Xcode.app/Contents/Developer/Toolchains/XcodeDefault.xctoolchain/usr/bin/ld) supports shared libraries
- configure:12212: result: yes
- configure:12452: checking dynamic linker characteristics
- configure:13270: result: darwin18.7.0 dyld
- configure:13392: checking how to hardcode library paths into programs
- configure:13417: result: immediate
- configure:13965: checking whether stripping libraries is possible
- configure:13979: result: yes
- configure:14005: checking if libtool supports shared libraries
- configure:14007: result: yes
- configure:14010: checking whether to build shared libraries
- configure:14035: result: yes
- configure:14038: checking whether to build static libraries
- configure:14042: result: yes
- configure:14065: checking how to run the C++ preprocessor
- configure:14092: g++ -std=c++11 -E conftest.cpp
- configure:14092: $? = 0
- configure:14106: g++ -std=c++11 -E conftest.cpp
- conftest.cpp:22:10: fatal error: 'ac_nonexistent.h' file not found
- #include <ac_nonexistent.h>
- ^~~~~~~~~~~~~~~~~~
- 1 error generated.
- configure:14106: $? = 1
- configure: failed program was:
- | /* confdefs.h */
- | #define PACKAGE_NAME "Bitcoin Core"
- | #define PACKAGE_TARNAME "bitcoin"
- | #define PACKAGE_VERSION "0.18.99"
- | #define PACKAGE_STRING "Bitcoin Core 0.18.99"
- | #define PACKAGE_BUGREPORT "https://github.com/bitcoin/bitcoin/issues"
- | #define PACKAGE_URL "https://bitcoincore.org/"
- | #define HAVE_CXX11 1
- | #define STDC_HEADERS 1
- | #define HAVE_SYS_TYPES_H 1
- | #define HAVE_SYS_STAT_H 1
- | #define HAVE_STDLIB_H 1
- | #define HAVE_STRING_H 1
- | #define HAVE_MEMORY_H 1
- | #define HAVE_STRINGS_H 1
- | #define HAVE_INTTYPES_H 1
- | #define HAVE_STDINT_H 1
- | #define HAVE_UNISTD_H 1
- | #define HAVE_DLFCN_H 1
- | #define LT_OBJDIR ".libs/"
- | /* end confdefs.h. */
- | #include <ac_nonexistent.h>
- configure:14131: result: g++ -std=c++11 -E
- configure:14151: g++ -std=c++11 -E conftest.cpp
- configure:14151: $? = 0
- configure:14165: g++ -std=c++11 -E conftest.cpp
- conftest.cpp:22:10: fatal error: 'ac_nonexistent.h' file not found
- #include <ac_nonexistent.h>
- ^~~~~~~~~~~~~~~~~~
- 1 error generated.
- configure:14165: $? = 1
- configure: failed program was:
- | /* confdefs.h */
- | #define PACKAGE_NAME "Bitcoin Core"
- | #define PACKAGE_TARNAME "bitcoin"
- | #define PACKAGE_VERSION "0.18.99"
- | #define PACKAGE_STRING "Bitcoin Core 0.18.99"
- | #define PACKAGE_BUGREPORT "https://github.com/bitcoin/bitcoin/issues"
- | #define PACKAGE_URL "https://bitcoincore.org/"
- | #define HAVE_CXX11 1
- | #define STDC_HEADERS 1
- | #define HAVE_SYS_TYPES_H 1
- | #define HAVE_SYS_STAT_H 1
- | #define HAVE_STDLIB_H 1
- | #define HAVE_STRING_H 1
- | #define HAVE_MEMORY_H 1
- | #define HAVE_STRINGS_H 1
- | #define HAVE_INTTYPES_H 1
- | #define HAVE_STDINT_H 1
- | #define HAVE_UNISTD_H 1
- | #define HAVE_DLFCN_H 1
- | #define LT_OBJDIR ".libs/"
- | /* end confdefs.h. */
- | #include <ac_nonexistent.h>
- configure:14327: checking for ld used by g++ -std=c++11
- configure:14394: result: /Applications/Xcode.app/Contents/Developer/Toolchains/XcodeDefault.xctoolchain/usr/bin/ld
- configure:14401: checking if the linker (/Applications/Xcode.app/Contents/Developer/Toolchains/XcodeDefault.xctoolchain/usr/bin/ld) is GNU ld
- configure:14416: result: no
- configure:14471: checking whether the g++ -std=c++11 linker (/Applications/Xcode.app/Contents/Developer/Toolchains/XcodeDefault.xctoolchain/usr/bin/ld) supports shared libraries
- configure:15544: result: yes
- configure:15580: g++ -std=c++11 -c -g -O2 conftest.cpp >&5
- configure:15583: $? = 0
- configure:16064: checking for g++ -std=c++11 option to produce PIC
- configure:16071: result: -fno-common -DPIC
- configure:16079: checking if g++ -std=c++11 PIC flag -fno-common -DPIC works
- configure:16097: g++ -std=c++11 -c -g -O2 -fno-common -DPIC -DPIC conftest.cpp >&5
- configure:16101: $? = 0
- configure:16114: result: yes
- configure:16137: checking if g++ -std=c++11 static flag -static works
- configure:16165: result: no
- configure:16177: checking if g++ -std=c++11 supports -c -o file.o
- configure:16198: g++ -std=c++11 -c -g -O2 -o out/conftest2.o conftest.cpp >&5
- configure:16202: $? = 0
- configure:16224: result: yes
- configure:16229: checking if g++ -std=c++11 supports -c -o file.o
- configure:16276: result: yes
- configure:16306: checking whether the g++ -std=c++11 linker (/Applications/Xcode.app/Contents/Developer/Toolchains/XcodeDefault.xctoolchain/usr/bin/ld) supports shared libraries
- configure:16346: result: yes
- configure:16487: checking dynamic linker characteristics
- configure:17232: result: darwin18.7.0 dyld
- configure:17297: checking how to hardcode library paths into programs
- configure:17322: result: immediate
- configure:17430: checking for ar
- configure:17448: found /usr/bin/ar
- configure:17460: result: /usr/bin/ar
- configure:17528: checking for ranlib
- configure:17546: found /usr/bin/ranlib
- configure:17558: result: /usr/bin/ranlib
- configure:17626: checking for strip
- configure:17644: found /usr/bin/strip
- configure:17656: result: /usr/bin/strip
- configure:17724: checking for gcov
- configure:17742: found /usr/bin/gcov
- configure:17754: result: /usr/bin/gcov
- configure:17778: checking for lcov
- configure:17811: result: no
- configure:17820: checking for python3.5
- configure:17853: result: no
- configure:17820: checking for python3.6
- configure:17853: result: no
- configure:17820: checking for python3.7
- configure:17838: found /usr/local/bin/python3.7
- configure:17850: result: /usr/local/bin/python3.7
- configure:17863: checking for genhtml
- configure:17896: result: no
- configure:17903: checking for git
- configure:17921: found /usr/bin/git
- configure:17933: result: /usr/bin/git
- configure:17943: checking for ccache
- configure:17976: result: no
- configure:17983: checking for xgettext
- configure:18016: result: no
- configure:18023: checking for hexdump
- configure:18041: found /usr/bin/hexdump
- configure:18053: result: /usr/bin/hexdump
- configure:18107: checking for readelf
- configure:18140: result: no
- configure:18205: checking for c++filt
- configure:18223: found /usr/bin/c++filt
- configure:18235: result: /usr/bin/c++filt
- configure:18303: checking for objcopy
- configure:18336: result: no
- configure:18357: checking for doxygen
- configure:18390: result: no
- configure:18396: WARNING: Doxygen not found
- configure:18651: checking whether C++ compiler accepts -Werror
- configure:18670: g++ -std=c++11 -c -g -O2 -Werror conftest.cpp >&5
- configure:18670: $? = 0
- configure:18678: result: yes
- configure:19168: checking whether C++ compiler accepts -Wall
- configure:19187: g++ -std=c++11 -c -g -O2 -Werror -Wall conftest.cpp >&5
- configure:19187: $? = 0
- configure:19196: result: yes
- configure:19205: checking whether C++ compiler accepts -Wextra
- configure:19224: g++ -std=c++11 -c -g -O2 -Werror -Wextra conftest.cpp >&5
- configure:19224: $? = 0
- configure:19233: result: yes
- configure:19242: checking whether C++ compiler accepts -Wformat
- configure:19261: g++ -std=c++11 -c -g -O2 -Werror -Wformat conftest.cpp >&5
- configure:19261: $? = 0
- configure:19270: result: yes
- configure:19279: checking whether C++ compiler accepts -Wvla
- configure:19298: g++ -std=c++11 -c -g -O2 -Werror -Wvla conftest.cpp >&5
- configure:19298: $? = 0
- configure:19307: result: yes
- configure:19316: checking whether C++ compiler accepts -Wswitch
- configure:19335: g++ -std=c++11 -c -g -O2 -Werror -Wswitch conftest.cpp >&5
- configure:19335: $? = 0
- configure:19344: result: yes
- configure:19353: checking whether C++ compiler accepts -Wformat-security
- configure:19372: g++ -std=c++11 -c -g -O2 -Werror -Wformat-security conftest.cpp >&5
- configure:19372: $? = 0
- configure:19381: result: yes
- configure:19390: checking whether C++ compiler accepts -Wthread-safety-analysis
- configure:19409: g++ -std=c++11 -c -g -O2 -Werror -Wthread-safety-analysis conftest.cpp >&5
- configure:19409: $? = 0
- configure:19418: result: yes
- configure:19427: checking whether C++ compiler accepts -Wrange-loop-analysis
- configure:19446: g++ -std=c++11 -c -g -O2 -Werror -Wrange-loop-analysis conftest.cpp >&5
- configure:19446: $? = 0
- configure:19455: result: yes
- configure:19464: checking whether C++ compiler accepts -Wredundant-decls
- configure:19483: g++ -std=c++11 -c -g -O2 -Werror -Wredundant-decls conftest.cpp >&5
- configure:19483: $? = 0
- configure:19492: result: yes
- configure:19505: checking whether C++ compiler accepts -Wunused-parameter
- configure:19524: g++ -std=c++11 -c -g -O2 -Werror -Wunused-parameter conftest.cpp >&5
- configure:19524: $? = 0
- configure:19533: result: yes
- configure:19542: checking whether C++ compiler accepts -Wself-assign
- configure:19561: g++ -std=c++11 -c -g -O2 -Werror -Wself-assign conftest.cpp >&5
- configure:19561: $? = 0
- configure:19570: result: yes
- configure:19579: checking whether C++ compiler accepts -Wunused-local-typedef
- configure:19598: g++ -std=c++11 -c -g -O2 -Werror -Wunused-local-typedef conftest.cpp >&5
- configure:19598: $? = 0
- configure:19607: result: yes
- configure:19616: checking whether C++ compiler accepts -Wdeprecated-register
- configure:19635: g++ -std=c++11 -c -g -O2 -Werror -Wdeprecated-register conftest.cpp >&5
- configure:19635: $? = 0
- configure:19644: result: yes
- configure:19653: checking whether C++ compiler accepts -Wimplicit-fallthrough
- configure:19672: g++ -std=c++11 -c -g -O2 -Werror -Wimplicit-fallthrough conftest.cpp >&5
- configure:19672: $? = 0
- configure:19681: result: yes
- configure:19702: checking whether C++ compiler accepts -msse4.2
- configure:19721: g++ -std=c++11 -c -g -O2 -Werror -msse4.2 conftest.cpp >&5
- configure:19721: $? = 0
- configure:19730: result: yes
- configure:19739: checking whether C++ compiler accepts -msse4.1
- configure:19758: g++ -std=c++11 -c -g -O2 -Werror -msse4.1 conftest.cpp >&5
- configure:19758: $? = 0
- configure:19767: result: yes
- configure:19776: checking whether C++ compiler accepts -mavx -mavx2
- configure:19795: g++ -std=c++11 -c -g -O2 -Werror -mavx -mavx2 conftest.cpp >&5
- configure:19795: $? = 0
- configure:19804: result: yes
- configure:19813: checking whether C++ compiler accepts -msse4 -msha
- configure:19832: g++ -std=c++11 -c -g -O2 -Werror -msse4 -msha conftest.cpp >&5
- configure:19832: $? = 0
- configure:19841: result: yes
- configure:19852: checking for assembler crc32 support
- configure:19878: g++ -std=c++11 -c -g -O2 -msse4.2 conftest.cpp >&5
- configure:19878: $? = 0
- configure:19879: result: yes
- configure:19891: checking for SSE4.1 intrinsics
- configure:19910: g++ -std=c++11 -c -g -O2 -msse4.1 conftest.cpp >&5
- configure:19910: $? = 0
- configure:19911: result: yes
- configure:19925: checking for AVX2 intrinsics
- configure:19944: g++ -std=c++11 -c -g -O2 -mavx -mavx2 conftest.cpp >&5
- configure:19944: $? = 0
- configure:19945: result: yes
- configure:19959: checking for SHA-NI intrinsics
- configure:19980: g++ -std=c++11 -c -g -O2 -msse4 -msha conftest.cpp >&5
- configure:19980: $? = 0
- configure:19981: result: yes
- configure:21048: checking for rsvg-convert
- configure:21066: found /usr/local/bin/rsvg-convert
- configure:21078: result: /usr/local/bin/rsvg-convert
- configure:21092: checking for brew
- configure:21108: found /usr/local/bin/brew
- configure:21119: result: brew
- configure:21537: checking whether the linker accepts -Wl,-headerpad_max_install_names
- configure:21556: g++ -std=c++11 -o conftest -g -O2 -DHAVE_BUILD_INFO -D__STDC_FORMAT_MACROS -I/usr/local/opt/berkeley-db@4/include -Wl,-headerpad_max_install_names conftest.cpp -L/usr/local/opt/berkeley-db@4/lib >&5
- configure:21556: $? = 0
- configure:21565: result: yes
- configure:21666: checking for pkg-config
- configure:21684: found /usr/local/bin/pkg-config
- configure:21696: result: /usr/local/bin/pkg-config
- configure:21721: checking pkg-config is at least version 0.9.0
- configure:21724: result: yes
- configure:21839: checking whether byte ordering is bigendian
- configure:21854: g++ -std=c++11 -c -g -O2 -DHAVE_BUILD_INFO -D__STDC_FORMAT_MACROS -I/usr/local/opt/berkeley-db@4/include -DMAC_OSX conftest.cpp >&5
- configure:21854: $? = 0
- configure:21899: g++ -std=c++11 -c -g -O2 -DHAVE_BUILD_INFO -D__STDC_FORMAT_MACROS -I/usr/local/opt/berkeley-db@4/include -DMAC_OSX conftest.cpp >&5
- configure:21899: $? = 0
- configure:21917: g++ -std=c++11 -c -g -O2 -DHAVE_BUILD_INFO -D__STDC_FORMAT_MACROS -I/usr/local/opt/berkeley-db@4/include -DMAC_OSX conftest.cpp >&5
- conftest.cpp:33:11: error: expected ';' after expression
- not big endian
- ^
- ;
- conftest.cpp:33:8: error: use of undeclared identifier 'big'
- not big endian
- ^
- conftest.cpp:33:12: error: use of undeclared identifier 'endian'
- not big endian
- ^
- 3 errors generated.
- configure:21917: $? = 1
- configure: failed program was:
- | /* confdefs.h */
- | #define PACKAGE_NAME "Bitcoin Core"
- | #define PACKAGE_TARNAME "bitcoin"
- | #define PACKAGE_VERSION "0.18.99"
- | #define PACKAGE_STRING "Bitcoin Core 0.18.99"
- | #define PACKAGE_BUGREPORT "https://github.com/bitcoin/bitcoin/issues"
- | #define PACKAGE_URL "https://bitcoincore.org/"
- | #define HAVE_CXX11 1
- | #define STDC_HEADERS 1
- | #define HAVE_SYS_TYPES_H 1
- | #define HAVE_SYS_STAT_H 1
- | #define HAVE_STDLIB_H 1
- | #define HAVE_STRING_H 1
- | #define HAVE_MEMORY_H 1
- | #define HAVE_STRINGS_H 1
- | #define HAVE_INTTYPES_H 1
- | #define HAVE_STDINT_H 1
- | #define HAVE_UNISTD_H 1
- | #define HAVE_DLFCN_H 1
- | #define LT_OBJDIR ".libs/"
- | #define USE_ASM 1
- | #define ENABLE_SSE41 1
- | #define ENABLE_AVX2 1
- | #define ENABLE_SHANI 1
- | /* end confdefs.h. */
- | #include <sys/types.h>
- | #include <sys/param.h>
- |
- | int
- | main ()
- | {
- | #if BYTE_ORDER != BIG_ENDIAN
- | not big endian
- | #endif
- |
- | ;
- | return 0;
- | }
- configure:22045: result: no
- configure:22247: checking whether gcc is Clang
- configure:22272: result: yes
- configure:22319: checking whether Clang needs flag to prevent "argument unused" warning when linking with -pthread
- configure:22344: gcc -o conftest -Werror -Wunknown-warning-option -pthread -g -O2 -DHAVE_BUILD_INFO -D__STDC_FORMAT_MACROS -I/usr/local/opt/berkeley-db@4/include -DMAC_OSX -Wl,-headerpad_max_install_names conftest.c -L/usr/local/opt/berkeley-db@4/lib >&5
- configure:22344: $? = 0
- configure:22350: (gcc -c -Werror -Wunknown-warning-option -pthread -g -O2 -DHAVE_BUILD_INFO -D__STDC_FORMAT_MACROS -I/usr/local/opt/berkeley-db@4/include -DMAC_OSX conftest.c >&5) && (echo ==== >&5) && (gcc -o conftest -Werror -Wunknown-warning-option -pthread -g -O2 -DHAVE_BUILD_INFO -D__STDC_FORMAT_MACROS -I/usr/local/opt/berkeley-db@4/include -DMAC_OSX -Wl,-headerpad_max_install_names conftest.o -L/usr/local/opt/berkeley-db@4/lib >&5)
- ====
- configure:22350: $? = 0
- configure:22368: result: no
- configure:22517: checking for joinable pthread attribute
- configure:22535: gcc -o conftest -g -O2 -pthread -DHAVE_BUILD_INFO -D__STDC_FORMAT_MACROS -I/usr/local/opt/berkeley-db@4/include -DMAC_OSX -Wl,-headerpad_max_install_names conftest.c -L/usr/local/opt/berkeley-db@4/lib >&5
- configure:22535: $? = 0
- configure:22543: result: PTHREAD_CREATE_JOINABLE
- configure:22557: checking whether more special flags are required for pthreads
- configure:22570: result: no
- configure:22578: checking for PTHREAD_PRIO_INHERIT
- configure:22594: gcc -o conftest -g -O2 -pthread -DHAVE_BUILD_INFO -D__STDC_FORMAT_MACROS -I/usr/local/opt/berkeley-db@4/include -DMAC_OSX -Wl,-headerpad_max_install_names conftest.c -L/usr/local/opt/berkeley-db@4/lib >&5
- configure:22594: $? = 0
- configure:22603: result: yes
- configure:22716: checking for special C compiler options needed for large files
- configure:22761: result: no
- configure:22767: checking for _FILE_OFFSET_BITS value needed for large files
- configure:22792: g++ -std=c++11 -c -g -O2 -DHAVE_BUILD_INFO -D__STDC_FORMAT_MACROS -I/usr/local/opt/berkeley-db@4/include -DMAC_OSX conftest.cpp >&5
- configure:22792: $? = 0
- configure:22824: result: no
- configure:22910: checking whether strerror_r is declared
- configure:22910: g++ -std=c++11 -c -g -O2 -DHAVE_BUILD_INFO -D__STDC_FORMAT_MACROS -I/usr/local/opt/berkeley-db@4/include -DMAC_OSX conftest.cpp >&5
- configure:22910: $? = 0
- configure:22910: result: yes
- configure:22923: checking for strerror_r
- configure:22923: g++ -std=c++11 -o conftest -g -O2 -DHAVE_BUILD_INFO -D__STDC_FORMAT_MACROS -I/usr/local/opt/berkeley-db@4/include -DMAC_OSX -Wl,-headerpad_max_install_names conftest.cpp -L/usr/local/opt/berkeley-db@4/lib >&5
- configure:22923: $? = 0
- configure:22923: result: yes
- configure:22932: checking whether strerror_r returns char *
- configure:22956: g++ -std=c++11 -c -g -O2 -DHAVE_BUILD_INFO -D__STDC_FORMAT_MACROS -I/usr/local/opt/berkeley-db@4/include -DMAC_OSX conftest.cpp >&5
- conftest.cpp:68:13: error: indirection requires pointer operand ('int' invalid)
- char x = *strerror_r (0, buf, sizeof buf);
- ^~~~~~~~~~~~~~~~~~~~~~~~~~~~~~~~
- conftest.cpp:69:10: error: cannot initialize a variable of type 'char *' with an rvalue of type 'int'
- char *p = strerror_r (0, buf, sizeof buf);
- ^ ~~~~~~~~~~~~~~~~~~~~~~~~~~~~~~~
- 2 errors generated.
- configure:22956: $? = 1
- configure: failed program was:
- | /* confdefs.h */
- | #define PACKAGE_NAME "Bitcoin Core"
- | #define PACKAGE_TARNAME "bitcoin"
- | #define PACKAGE_VERSION "0.18.99"
- | #define PACKAGE_STRING "Bitcoin Core 0.18.99"
- | #define PACKAGE_BUGREPORT "https://github.com/bitcoin/bitcoin/issues"
- | #define PACKAGE_URL "https://bitcoincore.org/"
- | #define HAVE_CXX11 1
- | #define STDC_HEADERS 1
- | #define HAVE_SYS_TYPES_H 1
- | #define HAVE_SYS_STAT_H 1
- | #define HAVE_STDLIB_H 1
- | #define HAVE_STRING_H 1
- | #define HAVE_MEMORY_H 1
- | #define HAVE_STRINGS_H 1
- | #define HAVE_INTTYPES_H 1
- | #define HAVE_STDINT_H 1
- | #define HAVE_UNISTD_H 1
- | #define HAVE_DLFCN_H 1
- | #define LT_OBJDIR ".libs/"
- | #define USE_ASM 1
- | #define ENABLE_SSE41 1
- | #define ENABLE_AVX2 1
- | #define ENABLE_SHANI 1
- | #define HAVE_PTHREAD_PRIO_INHERIT 1
- | #define HAVE_PTHREAD 1
- | #define HAVE_DECL_STRERROR_R 1
- | #define HAVE_STRERROR_R 1
- | /* end confdefs.h. */
- | #include <stdio.h>
- | #ifdef HAVE_SYS_TYPES_H
- | # include <sys/types.h>
- | #endif
- | #ifdef HAVE_SYS_STAT_H
- | # include <sys/stat.h>
- | #endif
- | #ifdef STDC_HEADERS
- | # include <stdlib.h>
- | # include <stddef.h>
- | #else
- | # ifdef HAVE_STDLIB_H
- | # include <stdlib.h>
- | # endif
- | #endif
- | #ifdef HAVE_STRING_H
- | # if !defined STDC_HEADERS && defined HAVE_MEMORY_H
- | # include <memory.h>
- | # endif
- | # include <string.h>
- | #endif
- | #ifdef HAVE_STRINGS_H
- | # include <strings.h>
- | #endif
- | #ifdef HAVE_INTTYPES_H
- | # include <inttypes.h>
- | #endif
- | #ifdef HAVE_STDINT_H
- | # include <stdint.h>
- | #endif
- | #ifdef HAVE_UNISTD_H
- | # include <unistd.h>
- | #endif
- | int
- | main ()
- | {
- |
- | char buf[100];
- | char x = *strerror_r (0, buf, sizeof buf);
- | char *p = strerror_r (0, buf, sizeof buf);
- | return !p || x;
- |
- | ;
- | return 0;
- | }
- configure:22994: result: no
- configure:23015: checking whether the linker accepts -Wl,--large-address-aware
- configure:23034: g++ -std=c++11 -o conftest -g -O2 -DHAVE_BUILD_INFO -D__STDC_FORMAT_MACROS -I/usr/local/opt/berkeley-db@4/include -DMAC_OSX -Wl,-headerpad_max_install_names -Wl,--large-address-aware conftest.cpp -L/usr/local/opt/berkeley-db@4/lib >&5
- ld: unknown option: --large-address-aware
- clang: error: linker command failed with exit code 1 (use -v to see invocation)
- configure:23034: $? = 1
- configure: failed program was:
- | /* confdefs.h */
- | #define PACKAGE_NAME "Bitcoin Core"
- | #define PACKAGE_TARNAME "bitcoin"
- | #define PACKAGE_VERSION "0.18.99"
- | #define PACKAGE_STRING "Bitcoin Core 0.18.99"
- | #define PACKAGE_BUGREPORT "https://github.com/bitcoin/bitcoin/issues"
- | #define PACKAGE_URL "https://bitcoincore.org/"
- | #define HAVE_CXX11 1
- | #define STDC_HEADERS 1
- | #define HAVE_SYS_TYPES_H 1
- | #define HAVE_SYS_STAT_H 1
- | #define HAVE_STDLIB_H 1
- | #define HAVE_STRING_H 1
- | #define HAVE_MEMORY_H 1
- | #define HAVE_STRINGS_H 1
- | #define HAVE_INTTYPES_H 1
- | #define HAVE_STDINT_H 1
- | #define HAVE_UNISTD_H 1
- | #define HAVE_DLFCN_H 1
- | #define LT_OBJDIR ".libs/"
- | #define USE_ASM 1
- | #define ENABLE_SSE41 1
- | #define ENABLE_AVX2 1
- | #define ENABLE_SHANI 1
- | #define HAVE_PTHREAD_PRIO_INHERIT 1
- | #define HAVE_PTHREAD 1
- | #define HAVE_DECL_STRERROR_R 1
- | #define HAVE_STRERROR_R 1
- | /* end confdefs.h. */
- |
- | int
- | main ()
- | {
- |
- | ;
- | return 0;
- | }
- configure:23043: result: no
- configure:23055: checking for __attribute__((visibility))
- configure:23079: g++ -std=c++11 -o conftest -g -O2 -DHAVE_BUILD_INFO -D__STDC_FORMAT_MACROS -I/usr/local/opt/berkeley-db@4/include -DMAC_OSX -Wl,-headerpad_max_install_names conftest.cpp -L/usr/local/opt/berkeley-db@4/lib >&5
- conftest.cpp:35:56: warning: target does not support 'protected' visibility; using 'default' [-Wunsupported-visibility]
- int foo_pro( void ) __attribute__((visibility("protected")));
- ^
- 1 warning generated.
- configure:23079: $? = 0
- configure:23092: result: no
- configure:23108: checking for __attribute__((dllexport))
- configure:23129: g++ -std=c++11 -o conftest -g -O2 -DHAVE_BUILD_INFO -D__STDC_FORMAT_MACROS -I/usr/local/opt/berkeley-db@4/include -DMAC_OSX -Wl,-headerpad_max_install_names conftest.cpp -L/usr/local/opt/berkeley-db@4/lib >&5
- conftest.cpp:32:36: warning: unknown attribute 'dllexport' ignored [-Wunknown-attributes]
- __attribute__((dllexport)) int foo( void ) { return 0; }
- ^
- 1 warning generated.
- configure:23129: $? = 0
- configure:23142: result: no
- configure:23158: checking for __attribute__((dllimport))
- configure:23179: g++ -std=c++11 -o conftest -g -O2 -DHAVE_BUILD_INFO -D__STDC_FORMAT_MACROS -I/usr/local/opt/berkeley-db@4/include -DMAC_OSX -Wl,-headerpad_max_install_names conftest.cpp -L/usr/local/opt/berkeley-db@4/lib >&5
- conftest.cpp:32:52: warning: unknown attribute 'dllimport' ignored [-Wunknown-attributes]
- int foo( void ) __attribute__((dllimport));
- ^
- 1 warning generated.
- configure:23179: $? = 0
- configure:23192: result: no
- configure:23364: checking for library containing clock_gettime
- configure:23395: g++ -std=c++11 -o conftest -g -O2 -DHAVE_BUILD_INFO -D__STDC_FORMAT_MACROS -I/usr/local/opt/berkeley-db@4/include -DMAC_OSX -Wl,-headerpad_max_install_names conftest.cpp -L/usr/local/opt/berkeley-db@4/lib >&5
- configure:23395: $? = 0
- configure:23412: result: none required
- configure:23544: checking whether C++ compiler accepts -fPIC
- configure:23563: g++ -std=c++11 -c -g -O2 -fPIC -DHAVE_BUILD_INFO -D__STDC_FORMAT_MACROS -I/usr/local/opt/berkeley-db@4/include -DMAC_OSX conftest.cpp >&5
- configure:23563: $? = 0
- configure:23571: result: yes
- configure:23584: checking whether C++ compiler accepts -fstack-reuse=none
- configure:23603: g++ -std=c++11 -c -g -O2 -fstack-reuse=none -DHAVE_BUILD_INFO -D__STDC_FORMAT_MACROS -I/usr/local/opt/berkeley-db@4/include -DMAC_OSX conftest.cpp >&5
- clang: error: unknown argument: '-fstack-reuse=none'
- configure:23603: $? = 1
- configure: failed program was:
- | /* confdefs.h */
- | #define PACKAGE_NAME "Bitcoin Core"
- | #define PACKAGE_TARNAME "bitcoin"
- | #define PACKAGE_VERSION "0.18.99"
- | #define PACKAGE_STRING "Bitcoin Core 0.18.99"
- | #define PACKAGE_BUGREPORT "https://github.com/bitcoin/bitcoin/issues"
- | #define PACKAGE_URL "https://bitcoincore.org/"
- | #define HAVE_CXX11 1
- | #define STDC_HEADERS 1
- | #define HAVE_SYS_TYPES_H 1
- | #define HAVE_SYS_STAT_H 1
- | #define HAVE_STDLIB_H 1
- | #define HAVE_STRING_H 1
- | #define HAVE_MEMORY_H 1
- | #define HAVE_STRINGS_H 1
- | #define HAVE_INTTYPES_H 1
- | #define HAVE_STDINT_H 1
- | #define HAVE_UNISTD_H 1
- | #define HAVE_DLFCN_H 1
- | #define LT_OBJDIR ".libs/"
- | #define USE_ASM 1
- | #define ENABLE_SSE41 1
- | #define ENABLE_AVX2 1
- | #define ENABLE_SHANI 1
- | #define HAVE_PTHREAD_PRIO_INHERIT 1
- | #define HAVE_PTHREAD 1
- | #define HAVE_DECL_STRERROR_R 1
- | #define HAVE_STRERROR_R 1
- | /* end confdefs.h. */
- |
- | int
- | main ()
- | {
- |
- | ;
- | return 0;
- | }
- configure:23611: result: no
- configure:23621: checking whether C++ compiler accepts -Wstack-protector
- configure:23640: g++ -std=c++11 -c -g -O2 -Wstack-protector -DHAVE_BUILD_INFO -D__STDC_FORMAT_MACROS -I/usr/local/opt/berkeley-db@4/include -DMAC_OSX conftest.cpp >&5
- configure:23640: $? = 0
- configure:23648: result: yes
- configure:23656: checking whether C++ compiler accepts -fstack-protector-all
- configure:23675: g++ -std=c++11 -c -g -O2 -fstack-protector-all -DHAVE_BUILD_INFO -D__STDC_FORMAT_MACROS -I/usr/local/opt/berkeley-db@4/include -DMAC_OSX conftest.cpp >&5
- configure:23675: $? = 0
- configure:23683: result: yes
- configure:23692: checking whether C++ preprocessor accepts -D_FORTIFY_SOURCE=2
- configure:23711: g++ -std=c++11 -E -DHAVE_BUILD_INFO -D__STDC_FORMAT_MACROS -I/usr/local/opt/berkeley-db@4/include -DMAC_OSX -D_FORTIFY_SOURCE=2 conftest.cpp
- configure:23711: $? = 0
- configure:23719: result: yes
- configure:23723: checking whether C++ preprocessor accepts -U_FORTIFY_SOURCE
- configure:23742: g++ -std=c++11 -E -DHAVE_BUILD_INFO -D__STDC_FORMAT_MACROS -I/usr/local/opt/berkeley-db@4/include -DMAC_OSX -U_FORTIFY_SOURCE conftest.cpp
- configure:23742: $? = 0
- configure:23750: result: yes
- configure:23767: checking whether the linker accepts -Wl,--dynamicbase
- configure:23786: g++ -std=c++11 -o conftest -g -O2 -DHAVE_BUILD_INFO -D__STDC_FORMAT_MACROS -I/usr/local/opt/berkeley-db@4/include -DMAC_OSX -Wl,-headerpad_max_install_names -Wl,--dynamicbase conftest.cpp -L/usr/local/opt/berkeley-db@4/lib >&5
- ld: unknown option: --dynamicbase
- clang: error: linker command failed with exit code 1 (use -v to see invocation)
- configure:23786: $? = 1
- configure: failed program was:
- | /* confdefs.h */
- | #define PACKAGE_NAME "Bitcoin Core"
- | #define PACKAGE_TARNAME "bitcoin"
- | #define PACKAGE_VERSION "0.18.99"
- | #define PACKAGE_STRING "Bitcoin Core 0.18.99"
- | #define PACKAGE_BUGREPORT "https://github.com/bitcoin/bitcoin/issues"
- | #define PACKAGE_URL "https://bitcoincore.org/"
- | #define HAVE_CXX11 1
- | #define STDC_HEADERS 1
- | #define HAVE_SYS_TYPES_H 1
- | #define HAVE_SYS_STAT_H 1
- | #define HAVE_STDLIB_H 1
- | #define HAVE_STRING_H 1
- | #define HAVE_MEMORY_H 1
- | #define HAVE_STRINGS_H 1
- | #define HAVE_INTTYPES_H 1
- | #define HAVE_STDINT_H 1
- | #define HAVE_UNISTD_H 1
- | #define HAVE_DLFCN_H 1
- | #define LT_OBJDIR ".libs/"
- | #define USE_ASM 1
- | #define ENABLE_SSE41 1
- | #define ENABLE_AVX2 1
- | #define ENABLE_SHANI 1
- | #define HAVE_PTHREAD_PRIO_INHERIT 1
- | #define HAVE_PTHREAD 1
- | #define HAVE_DECL_STRERROR_R 1
- | #define HAVE_STRERROR_R 1
- | /* end confdefs.h. */
- |
- | int
- | main ()
- | {
- |
- | ;
- | return 0;
- | }
- configure:23795: result: no
- configure:23803: checking whether the linker accepts -Wl,--nxcompat
- configure:23822: g++ -std=c++11 -o conftest -g -O2 -DHAVE_BUILD_INFO -D__STDC_FORMAT_MACROS -I/usr/local/opt/berkeley-db@4/include -DMAC_OSX -Wl,-headerpad_max_install_names -Wl,--nxcompat conftest.cpp -L/usr/local/opt/berkeley-db@4/lib >&5
- ld: unknown option: --nxcompat
- clang: error: linker command failed with exit code 1 (use -v to see invocation)
- configure:23822: $? = 1
- configure: failed program was:
- | /* confdefs.h */
- | #define PACKAGE_NAME "Bitcoin Core"
- | #define PACKAGE_TARNAME "bitcoin"
- | #define PACKAGE_VERSION "0.18.99"
- | #define PACKAGE_STRING "Bitcoin Core 0.18.99"
- | #define PACKAGE_BUGREPORT "https://github.com/bitcoin/bitcoin/issues"
- | #define PACKAGE_URL "https://bitcoincore.org/"
- | #define HAVE_CXX11 1
- | #define STDC_HEADERS 1
- | #define HAVE_SYS_TYPES_H 1
- | #define HAVE_SYS_STAT_H 1
- | #define HAVE_STDLIB_H 1
- | #define HAVE_STRING_H 1
- | #define HAVE_MEMORY_H 1
- | #define HAVE_STRINGS_H 1
- | #define HAVE_INTTYPES_H 1
- | #define HAVE_STDINT_H 1
- | #define HAVE_UNISTD_H 1
- | #define HAVE_DLFCN_H 1
- | #define LT_OBJDIR ".libs/"
- | #define USE_ASM 1
- | #define ENABLE_SSE41 1
- | #define ENABLE_AVX2 1
- | #define ENABLE_SHANI 1
- | #define HAVE_PTHREAD_PRIO_INHERIT 1
- | #define HAVE_PTHREAD 1
- | #define HAVE_DECL_STRERROR_R 1
- | #define HAVE_STRERROR_R 1
- | /* end confdefs.h. */
- |
- | int
- | main ()
- | {
- |
- | ;
- | return 0;
- | }
- configure:23831: result: no
- configure:23839: checking whether the linker accepts -Wl,--high-entropy-va
- configure:23858: g++ -std=c++11 -o conftest -g -O2 -DHAVE_BUILD_INFO -D__STDC_FORMAT_MACROS -I/usr/local/opt/berkeley-db@4/include -DMAC_OSX -Wl,-headerpad_max_install_names -Wl,--high-entropy-va conftest.cpp -L/usr/local/opt/berkeley-db@4/lib >&5
- ld: unknown option: --high-entropy-va
- clang: error: linker command failed with exit code 1 (use -v to see invocation)
- configure:23858: $? = 1
- configure: failed program was:
- | /* confdefs.h */
- | #define PACKAGE_NAME "Bitcoin Core"
- | #define PACKAGE_TARNAME "bitcoin"
- | #define PACKAGE_VERSION "0.18.99"
- | #define PACKAGE_STRING "Bitcoin Core 0.18.99"
- | #define PACKAGE_BUGREPORT "https://github.com/bitcoin/bitcoin/issues"
- | #define PACKAGE_URL "https://bitcoincore.org/"
- | #define HAVE_CXX11 1
- | #define STDC_HEADERS 1
- | #define HAVE_SYS_TYPES_H 1
- | #define HAVE_SYS_STAT_H 1
- | #define HAVE_STDLIB_H 1
- | #define HAVE_STRING_H 1
- | #define HAVE_MEMORY_H 1
- | #define HAVE_STRINGS_H 1
- | #define HAVE_INTTYPES_H 1
- | #define HAVE_STDINT_H 1
- | #define HAVE_UNISTD_H 1
- | #define HAVE_DLFCN_H 1
- | #define LT_OBJDIR ".libs/"
- | #define USE_ASM 1
- | #define ENABLE_SSE41 1
- | #define ENABLE_AVX2 1
- | #define ENABLE_SHANI 1
- | #define HAVE_PTHREAD_PRIO_INHERIT 1
- | #define HAVE_PTHREAD 1
- | #define HAVE_DECL_STRERROR_R 1
- | #define HAVE_STRERROR_R 1
- | /* end confdefs.h. */
- |
- | int
- | main ()
- | {
- |
- | ;
- | return 0;
- | }
- configure:23867: result: no
- configure:23875: checking whether the linker accepts -Wl,-z,relro
- configure:23894: g++ -std=c++11 -o conftest -g -O2 -DHAVE_BUILD_INFO -D__STDC_FORMAT_MACROS -I/usr/local/opt/berkeley-db@4/include -DMAC_OSX -Wl,-headerpad_max_install_names -Wl,-z,relro conftest.cpp -L/usr/local/opt/berkeley-db@4/lib >&5
- ld: unknown option: -z
- clang: error: linker command failed with exit code 1 (use -v to see invocation)
- configure:23894: $? = 1
- configure: failed program was:
- | /* confdefs.h */
- | #define PACKAGE_NAME "Bitcoin Core"
- | #define PACKAGE_TARNAME "bitcoin"
- | #define PACKAGE_VERSION "0.18.99"
- | #define PACKAGE_STRING "Bitcoin Core 0.18.99"
- | #define PACKAGE_BUGREPORT "https://github.com/bitcoin/bitcoin/issues"
- | #define PACKAGE_URL "https://bitcoincore.org/"
- | #define HAVE_CXX11 1
- | #define STDC_HEADERS 1
- | #define HAVE_SYS_TYPES_H 1
- | #define HAVE_SYS_STAT_H 1
- | #define HAVE_STDLIB_H 1
- | #define HAVE_STRING_H 1
- | #define HAVE_MEMORY_H 1
- | #define HAVE_STRINGS_H 1
- | #define HAVE_INTTYPES_H 1
- | #define HAVE_STDINT_H 1
- | #define HAVE_UNISTD_H 1
- | #define HAVE_DLFCN_H 1
- | #define LT_OBJDIR ".libs/"
- | #define USE_ASM 1
- | #define ENABLE_SSE41 1
- | #define ENABLE_AVX2 1
- | #define ENABLE_SHANI 1
- | #define HAVE_PTHREAD_PRIO_INHERIT 1
- | #define HAVE_PTHREAD 1
- | #define HAVE_DECL_STRERROR_R 1
- | #define HAVE_STRERROR_R 1
- | /* end confdefs.h. */
- |
- | int
- | main ()
- | {
- |
- | ;
- | return 0;
- | }
- configure:23903: result: no
- configure:23911: checking whether the linker accepts -Wl,-z,now
- configure:23930: g++ -std=c++11 -o conftest -g -O2 -DHAVE_BUILD_INFO -D__STDC_FORMAT_MACROS -I/usr/local/opt/berkeley-db@4/include -DMAC_OSX -Wl,-headerpad_max_install_names -Wl,-z,now conftest.cpp -L/usr/local/opt/berkeley-db@4/lib >&5
- ld: unknown option: -z
- clang: error: linker command failed with exit code 1 (use -v to see invocation)
- configure:23930: $? = 1
- configure: failed program was:
- | /* confdefs.h */
- | #define PACKAGE_NAME "Bitcoin Core"
- | #define PACKAGE_TARNAME "bitcoin"
- | #define PACKAGE_VERSION "0.18.99"
- | #define PACKAGE_STRING "Bitcoin Core 0.18.99"
- | #define PACKAGE_BUGREPORT "https://github.com/bitcoin/bitcoin/issues"
- | #define PACKAGE_URL "https://bitcoincore.org/"
- | #define HAVE_CXX11 1
- | #define STDC_HEADERS 1
- | #define HAVE_SYS_TYPES_H 1
- | #define HAVE_SYS_STAT_H 1
- | #define HAVE_STDLIB_H 1
- | #define HAVE_STRING_H 1
- | #define HAVE_MEMORY_H 1
- | #define HAVE_STRINGS_H 1
- | #define HAVE_INTTYPES_H 1
- | #define HAVE_STDINT_H 1
- | #define HAVE_UNISTD_H 1
- | #define HAVE_DLFCN_H 1
- | #define LT_OBJDIR ".libs/"
- | #define USE_ASM 1
- | #define ENABLE_SSE41 1
- | #define ENABLE_AVX2 1
- | #define ENABLE_SHANI 1
- | #define HAVE_PTHREAD_PRIO_INHERIT 1
- | #define HAVE_PTHREAD 1
- | #define HAVE_DECL_STRERROR_R 1
- | #define HAVE_STRERROR_R 1
- | /* end confdefs.h. */
- |
- | int
- | main ()
- | {
- |
- | ;
- | return 0;
- | }
- configure:23939: result: no
- configure:23948: checking whether the linker accepts -fPIE -pie
- configure:23967: g++ -std=c++11 -o conftest -g -O2 -DHAVE_BUILD_INFO -D__STDC_FORMAT_MACROS -I/usr/local/opt/berkeley-db@4/include -DMAC_OSX -Wl,-headerpad_max_install_names -Werror -fPIE -pie conftest.cpp -L/usr/local/opt/berkeley-db@4/lib >&5
- clang: error: argument unused during compilation: '-pie' [-Werror,-Wunused-command-line-argument]
- configure:23967: $? = 1
- configure: failed program was:
- | /* confdefs.h */
- | #define PACKAGE_NAME "Bitcoin Core"
- | #define PACKAGE_TARNAME "bitcoin"
- | #define PACKAGE_VERSION "0.18.99"
- | #define PACKAGE_STRING "Bitcoin Core 0.18.99"
- | #define PACKAGE_BUGREPORT "https://github.com/bitcoin/bitcoin/issues"
- | #define PACKAGE_URL "https://bitcoincore.org/"
- | #define HAVE_CXX11 1
- | #define STDC_HEADERS 1
- | #define HAVE_SYS_TYPES_H 1
- | #define HAVE_SYS_STAT_H 1
- | #define HAVE_STDLIB_H 1
- | #define HAVE_STRING_H 1
- | #define HAVE_MEMORY_H 1
- | #define HAVE_STRINGS_H 1
- | #define HAVE_INTTYPES_H 1
- | #define HAVE_STDINT_H 1
- | #define HAVE_UNISTD_H 1
- | #define HAVE_DLFCN_H 1
- | #define LT_OBJDIR ".libs/"
- | #define USE_ASM 1
- | #define ENABLE_SSE41 1
- | #define ENABLE_AVX2 1
- | #define ENABLE_SHANI 1
- | #define HAVE_PTHREAD_PRIO_INHERIT 1
- | #define HAVE_PTHREAD 1
- | #define HAVE_DECL_STRERROR_R 1
- | #define HAVE_STRERROR_R 1
- | /* end confdefs.h. */
- |
- | int
- | main ()
- | {
- |
- | ;
- | return 0;
- | }
- configure:23977: result: no
- configure:24034: checking whether the linker accepts -Wl,-dead_strip
- configure:24053: g++ -std=c++11 -o conftest -g -O2 -DHAVE_BUILD_INFO -D__STDC_FORMAT_MACROS -I/usr/local/opt/berkeley-db@4/include -DMAC_OSX -Wl,-headerpad_max_install_names -Wl,-dead_strip conftest.cpp -L/usr/local/opt/berkeley-db@4/lib >&5
- configure:24053: $? = 0
- configure:24062: result: yes
- configure:24075: checking endian.h usability
- configure:24075: g++ -std=c++11 -c -g -O2 -DHAVE_BUILD_INFO -D__STDC_FORMAT_MACROS -I/usr/local/opt/berkeley-db@4/include -DMAC_OSX conftest.cpp >&5
- conftest.cpp:63:10: fatal error: 'endian.h' file not found
- #include <endian.h>
- ^~~~~~~~~~
- 1 error generated.
- configure:24075: $? = 1
- configure: failed program was:
- | /* confdefs.h */
- | #define PACKAGE_NAME "Bitcoin Core"
- | #define PACKAGE_TARNAME "bitcoin"
- | #define PACKAGE_VERSION "0.18.99"
- | #define PACKAGE_STRING "Bitcoin Core 0.18.99"
- | #define PACKAGE_BUGREPORT "https://github.com/bitcoin/bitcoin/issues"
- | #define PACKAGE_URL "https://bitcoincore.org/"
- | #define HAVE_CXX11 1
- | #define STDC_HEADERS 1
- | #define HAVE_SYS_TYPES_H 1
- | #define HAVE_SYS_STAT_H 1
- | #define HAVE_STDLIB_H 1
- | #define HAVE_STRING_H 1
- | #define HAVE_MEMORY_H 1
- | #define HAVE_STRINGS_H 1
- | #define HAVE_INTTYPES_H 1
- | #define HAVE_STDINT_H 1
- | #define HAVE_UNISTD_H 1
- | #define HAVE_DLFCN_H 1
- | #define LT_OBJDIR ".libs/"
- | #define USE_ASM 1
- | #define ENABLE_SSE41 1
- | #define ENABLE_AVX2 1
- | #define ENABLE_SHANI 1
- | #define HAVE_PTHREAD_PRIO_INHERIT 1
- | #define HAVE_PTHREAD 1
- | #define HAVE_DECL_STRERROR_R 1
- | #define HAVE_STRERROR_R 1
- | /* end confdefs.h. */
- | #include <stdio.h>
- | #ifdef HAVE_SYS_TYPES_H
- | # include <sys/types.h>
- | #endif
- | #ifdef HAVE_SYS_STAT_H
- | # include <sys/stat.h>
- | #endif
- | #ifdef STDC_HEADERS
- | # include <stdlib.h>
- | # include <stddef.h>
- | #else
- | # ifdef HAVE_STDLIB_H
- | # include <stdlib.h>
- | # endif
- | #endif
- | #ifdef HAVE_STRING_H
- | # if !defined STDC_HEADERS && defined HAVE_MEMORY_H
- | # include <memory.h>
- | # endif
- | # include <string.h>
- | #endif
- | #ifdef HAVE_STRINGS_H
- | # include <strings.h>
- | #endif
- | #ifdef HAVE_INTTYPES_H
- | # include <inttypes.h>
- | #endif
- | #ifdef HAVE_STDINT_H
- | # include <stdint.h>
- | #endif
- | #ifdef HAVE_UNISTD_H
- | # include <unistd.h>
- | #endif
- | #include <endian.h>
- configure:24075: result: no
- configure:24075: checking endian.h presence
- configure:24075: g++ -std=c++11 -E -DHAVE_BUILD_INFO -D__STDC_FORMAT_MACROS -I/usr/local/opt/berkeley-db@4/include -DMAC_OSX conftest.cpp
- conftest.cpp:30:10: fatal error: 'endian.h' file not found
- #include <endian.h>
- ^~~~~~~~~~
- 1 error generated.
- configure:24075: $? = 1
- configure: failed program was:
- | /* confdefs.h */
- | #define PACKAGE_NAME "Bitcoin Core"
- | #define PACKAGE_TARNAME "bitcoin"
- | #define PACKAGE_VERSION "0.18.99"
- | #define PACKAGE_STRING "Bitcoin Core 0.18.99"
- | #define PACKAGE_BUGREPORT "https://github.com/bitcoin/bitcoin/issues"
- | #define PACKAGE_URL "https://bitcoincore.org/"
- | #define HAVE_CXX11 1
- | #define STDC_HEADERS 1
- | #define HAVE_SYS_TYPES_H 1
- | #define HAVE_SYS_STAT_H 1
- | #define HAVE_STDLIB_H 1
- | #define HAVE_STRING_H 1
- | #define HAVE_MEMORY_H 1
- | #define HAVE_STRINGS_H 1
- | #define HAVE_INTTYPES_H 1
- | #define HAVE_STDINT_H 1
- | #define HAVE_UNISTD_H 1
- | #define HAVE_DLFCN_H 1
- | #define LT_OBJDIR ".libs/"
- | #define USE_ASM 1
- | #define ENABLE_SSE41 1
- | #define ENABLE_AVX2 1
- | #define ENABLE_SHANI 1
- | #define HAVE_PTHREAD_PRIO_INHERIT 1
- | #define HAVE_PTHREAD 1
- | #define HAVE_DECL_STRERROR_R 1
- | #define HAVE_STRERROR_R 1
- | /* end confdefs.h. */
- | #include <endian.h>
- configure:24075: result: no
- configure:24075: checking for endian.h
- configure:24075: result: no
- configure:24075: checking sys/endian.h usability
- configure:24075: g++ -std=c++11 -c -g -O2 -DHAVE_BUILD_INFO -D__STDC_FORMAT_MACROS -I/usr/local/opt/berkeley-db@4/include -DMAC_OSX conftest.cpp >&5
- conftest.cpp:63:10: fatal error: 'sys/endian.h' file not found
- #include <sys/endian.h>
- ^~~~~~~~~~~~~~
- 1 error generated.
- configure:24075: $? = 1
- configure: failed program was:
- | /* confdefs.h */
- | #define PACKAGE_NAME "Bitcoin Core"
- | #define PACKAGE_TARNAME "bitcoin"
- | #define PACKAGE_VERSION "0.18.99"
- | #define PACKAGE_STRING "Bitcoin Core 0.18.99"
- | #define PACKAGE_BUGREPORT "https://github.com/bitcoin/bitcoin/issues"
- | #define PACKAGE_URL "https://bitcoincore.org/"
- | #define HAVE_CXX11 1
- | #define STDC_HEADERS 1
- | #define HAVE_SYS_TYPES_H 1
- | #define HAVE_SYS_STAT_H 1
- | #define HAVE_STDLIB_H 1
- | #define HAVE_STRING_H 1
- | #define HAVE_MEMORY_H 1
- | #define HAVE_STRINGS_H 1
- | #define HAVE_INTTYPES_H 1
- | #define HAVE_STDINT_H 1
- | #define HAVE_UNISTD_H 1
- | #define HAVE_DLFCN_H 1
- | #define LT_OBJDIR ".libs/"
- | #define USE_ASM 1
- | #define ENABLE_SSE41 1
- | #define ENABLE_AVX2 1
- | #define ENABLE_SHANI 1
- | #define HAVE_PTHREAD_PRIO_INHERIT 1
- | #define HAVE_PTHREAD 1
- | #define HAVE_DECL_STRERROR_R 1
- | #define HAVE_STRERROR_R 1
- | /* end confdefs.h. */
- | #include <stdio.h>
- | #ifdef HAVE_SYS_TYPES_H
- | # include <sys/types.h>
- | #endif
- | #ifdef HAVE_SYS_STAT_H
- | # include <sys/stat.h>
- | #endif
- | #ifdef STDC_HEADERS
- | # include <stdlib.h>
- | # include <stddef.h>
- | #else
- | # ifdef HAVE_STDLIB_H
- | # include <stdlib.h>
- | # endif
- | #endif
- | #ifdef HAVE_STRING_H
- | # if !defined STDC_HEADERS && defined HAVE_MEMORY_H
- | # include <memory.h>
- | # endif
- | # include <string.h>
- | #endif
- | #ifdef HAVE_STRINGS_H
- | # include <strings.h>
- | #endif
- | #ifdef HAVE_INTTYPES_H
- | # include <inttypes.h>
- | #endif
- | #ifdef HAVE_STDINT_H
- | # include <stdint.h>
- | #endif
- | #ifdef HAVE_UNISTD_H
- | # include <unistd.h>
- | #endif
- | #include <sys/endian.h>
- configure:24075: result: no
- configure:24075: checking sys/endian.h presence
- configure:24075: g++ -std=c++11 -E -DHAVE_BUILD_INFO -D__STDC_FORMAT_MACROS -I/usr/local/opt/berkeley-db@4/include -DMAC_OSX conftest.cpp
- conftest.cpp:30:10: fatal error: 'sys/endian.h' file not found
- #include <sys/endian.h>
- ^~~~~~~~~~~~~~
- 1 error generated.
- configure:24075: $? = 1
- configure: failed program was:
- | /* confdefs.h */
- | #define PACKAGE_NAME "Bitcoin Core"
- | #define PACKAGE_TARNAME "bitcoin"
- | #define PACKAGE_VERSION "0.18.99"
- | #define PACKAGE_STRING "Bitcoin Core 0.18.99"
- | #define PACKAGE_BUGREPORT "https://github.com/bitcoin/bitcoin/issues"
- | #define PACKAGE_URL "https://bitcoincore.org/"
- | #define HAVE_CXX11 1
- | #define STDC_HEADERS 1
- | #define HAVE_SYS_TYPES_H 1
- | #define HAVE_SYS_STAT_H 1
- | #define HAVE_STDLIB_H 1
- | #define HAVE_STRING_H 1
- | #define HAVE_MEMORY_H 1
- | #define HAVE_STRINGS_H 1
- | #define HAVE_INTTYPES_H 1
- | #define HAVE_STDINT_H 1
- | #define HAVE_UNISTD_H 1
- | #define HAVE_DLFCN_H 1
- | #define LT_OBJDIR ".libs/"
- | #define USE_ASM 1
- | #define ENABLE_SSE41 1
- | #define ENABLE_AVX2 1
- | #define ENABLE_SHANI 1
- | #define HAVE_PTHREAD_PRIO_INHERIT 1
- | #define HAVE_PTHREAD 1
- | #define HAVE_DECL_STRERROR_R 1
- | #define HAVE_STRERROR_R 1
- | /* end confdefs.h. */
- | #include <sys/endian.h>
- configure:24075: result: no
- configure:24075: checking for sys/endian.h
- configure:24075: result: no
- configure:24075: checking byteswap.h usability
- configure:24075: g++ -std=c++11 -c -g -O2 -DHAVE_BUILD_INFO -D__STDC_FORMAT_MACROS -I/usr/local/opt/berkeley-db@4/include -DMAC_OSX conftest.cpp >&5
- conftest.cpp:63:10: fatal error: 'byteswap.h' file not found
- #include <byteswap.h>
- ^~~~~~~~~~~~
- 1 error generated.
- configure:24075: $? = 1
- configure: failed program was:
- | /* confdefs.h */
- | #define PACKAGE_NAME "Bitcoin Core"
- | #define PACKAGE_TARNAME "bitcoin"
- | #define PACKAGE_VERSION "0.18.99"
- | #define PACKAGE_STRING "Bitcoin Core 0.18.99"
- | #define PACKAGE_BUGREPORT "https://github.com/bitcoin/bitcoin/issues"
- | #define PACKAGE_URL "https://bitcoincore.org/"
- | #define HAVE_CXX11 1
- | #define STDC_HEADERS 1
- | #define HAVE_SYS_TYPES_H 1
- | #define HAVE_SYS_STAT_H 1
- | #define HAVE_STDLIB_H 1
- | #define HAVE_STRING_H 1
- | #define HAVE_MEMORY_H 1
- | #define HAVE_STRINGS_H 1
- | #define HAVE_INTTYPES_H 1
- | #define HAVE_STDINT_H 1
- | #define HAVE_UNISTD_H 1
- | #define HAVE_DLFCN_H 1
- | #define LT_OBJDIR ".libs/"
- | #define USE_ASM 1
- | #define ENABLE_SSE41 1
- | #define ENABLE_AVX2 1
- | #define ENABLE_SHANI 1
- | #define HAVE_PTHREAD_PRIO_INHERIT 1
- | #define HAVE_PTHREAD 1
- | #define HAVE_DECL_STRERROR_R 1
- | #define HAVE_STRERROR_R 1
- | /* end confdefs.h. */
- | #include <stdio.h>
- | #ifdef HAVE_SYS_TYPES_H
- | # include <sys/types.h>
- | #endif
- | #ifdef HAVE_SYS_STAT_H
- | # include <sys/stat.h>
- | #endif
- | #ifdef STDC_HEADERS
- | # include <stdlib.h>
- | # include <stddef.h>
- | #else
- | # ifdef HAVE_STDLIB_H
- | # include <stdlib.h>
- | # endif
- | #endif
- | #ifdef HAVE_STRING_H
- | # if !defined STDC_HEADERS && defined HAVE_MEMORY_H
- | # include <memory.h>
- | # endif
- | # include <string.h>
- | #endif
- | #ifdef HAVE_STRINGS_H
- | # include <strings.h>
- | #endif
- | #ifdef HAVE_INTTYPES_H
- | # include <inttypes.h>
- | #endif
- | #ifdef HAVE_STDINT_H
- | # include <stdint.h>
- | #endif
- | #ifdef HAVE_UNISTD_H
- | # include <unistd.h>
- | #endif
- | #include <byteswap.h>
- configure:24075: result: no
- configure:24075: checking byteswap.h presence
- configure:24075: g++ -std=c++11 -E -DHAVE_BUILD_INFO -D__STDC_FORMAT_MACROS -I/usr/local/opt/berkeley-db@4/include -DMAC_OSX conftest.cpp
- conftest.cpp:30:10: fatal error: 'byteswap.h' file not found
- #include <byteswap.h>
- ^~~~~~~~~~~~
- 1 error generated.
- configure:24075: $? = 1
- configure: failed program was:
- | /* confdefs.h */
- | #define PACKAGE_NAME "Bitcoin Core"
- | #define PACKAGE_TARNAME "bitcoin"
- | #define PACKAGE_VERSION "0.18.99"
- | #define PACKAGE_STRING "Bitcoin Core 0.18.99"
- | #define PACKAGE_BUGREPORT "https://github.com/bitcoin/bitcoin/issues"
- | #define PACKAGE_URL "https://bitcoincore.org/"
- | #define HAVE_CXX11 1
- | #define STDC_HEADERS 1
- | #define HAVE_SYS_TYPES_H 1
- | #define HAVE_SYS_STAT_H 1
- | #define HAVE_STDLIB_H 1
- | #define HAVE_STRING_H 1
- | #define HAVE_MEMORY_H 1
- | #define HAVE_STRINGS_H 1
- | #define HAVE_INTTYPES_H 1
- | #define HAVE_STDINT_H 1
- | #define HAVE_UNISTD_H 1
- | #define HAVE_DLFCN_H 1
- | #define LT_OBJDIR ".libs/"
- | #define USE_ASM 1
- | #define ENABLE_SSE41 1
- | #define ENABLE_AVX2 1
- | #define ENABLE_SHANI 1
- | #define HAVE_PTHREAD_PRIO_INHERIT 1
- | #define HAVE_PTHREAD 1
- | #define HAVE_DECL_STRERROR_R 1
- | #define HAVE_STRERROR_R 1
- | /* end confdefs.h. */
- | #include <byteswap.h>
- configure:24075: result: no
- configure:24075: checking for byteswap.h
- configure:24075: result: no
- configure:24075: checking stdio.h usability
- configure:24075: g++ -std=c++11 -c -g -O2 -DHAVE_BUILD_INFO -D__STDC_FORMAT_MACROS -I/usr/local/opt/berkeley-db@4/include -DMAC_OSX conftest.cpp >&5
- configure:24075: $? = 0
- configure:24075: result: yes
- configure:24075: checking stdio.h presence
- configure:24075: g++ -std=c++11 -E -DHAVE_BUILD_INFO -D__STDC_FORMAT_MACROS -I/usr/local/opt/berkeley-db@4/include -DMAC_OSX conftest.cpp
- configure:24075: $? = 0
- configure:24075: result: yes
- configure:24075: checking for stdio.h
- configure:24075: result: yes
- configure:24075: checking for stdlib.h
- configure:24075: result: yes
- configure:24075: checking for unistd.h
- configure:24075: result: yes
- configure:24075: checking for strings.h
- configure:24075: result: yes
- configure:24075: checking for sys/types.h
- configure:24075: result: yes
- configure:24075: checking for sys/stat.h
- configure:24075: result: yes
- configure:24075: checking sys/select.h usability
- configure:24075: g++ -std=c++11 -c -g -O2 -DHAVE_BUILD_INFO -D__STDC_FORMAT_MACROS -I/usr/local/opt/berkeley-db@4/include -DMAC_OSX conftest.cpp >&5
- configure:24075: $? = 0
- configure:24075: result: yes
- configure:24075: checking sys/select.h presence
- configure:24075: g++ -std=c++11 -E -DHAVE_BUILD_INFO -D__STDC_FORMAT_MACROS -I/usr/local/opt/berkeley-db@4/include -DMAC_OSX conftest.cpp
- configure:24075: $? = 0
- configure:24075: result: yes
- configure:24075: checking for sys/select.h
- configure:24075: result: yes
- configure:24075: checking sys/prctl.h usability
- configure:24075: g++ -std=c++11 -c -g -O2 -DHAVE_BUILD_INFO -D__STDC_FORMAT_MACROS -I/usr/local/opt/berkeley-db@4/include -DMAC_OSX conftest.cpp >&5
- conftest.cpp:70:10: fatal error: 'sys/prctl.h' file not found
- #include <sys/prctl.h>
- ^~~~~~~~~~~~~
- 1 error generated.
- configure:24075: $? = 1
- configure: failed program was:
- | /* confdefs.h */
- | #define PACKAGE_NAME "Bitcoin Core"
- | #define PACKAGE_TARNAME "bitcoin"
- | #define PACKAGE_VERSION "0.18.99"
- | #define PACKAGE_STRING "Bitcoin Core 0.18.99"
- | #define PACKAGE_BUGREPORT "https://github.com/bitcoin/bitcoin/issues"
- | #define PACKAGE_URL "https://bitcoincore.org/"
- | #define HAVE_CXX11 1
- | #define STDC_HEADERS 1
- | #define HAVE_SYS_TYPES_H 1
- | #define HAVE_SYS_STAT_H 1
- | #define HAVE_STDLIB_H 1
- | #define HAVE_STRING_H 1
- | #define HAVE_MEMORY_H 1
- | #define HAVE_STRINGS_H 1
- | #define HAVE_INTTYPES_H 1
- | #define HAVE_STDINT_H 1
- | #define HAVE_UNISTD_H 1
- | #define HAVE_DLFCN_H 1
- | #define LT_OBJDIR ".libs/"
- | #define USE_ASM 1
- | #define ENABLE_SSE41 1
- | #define ENABLE_AVX2 1
- | #define ENABLE_SHANI 1
- | #define HAVE_PTHREAD_PRIO_INHERIT 1
- | #define HAVE_PTHREAD 1
- | #define HAVE_DECL_STRERROR_R 1
- | #define HAVE_STRERROR_R 1
- | #define HAVE_STDIO_H 1
- | #define HAVE_STDLIB_H 1
- | #define HAVE_UNISTD_H 1
- | #define HAVE_STRINGS_H 1
- | #define HAVE_SYS_TYPES_H 1
- | #define HAVE_SYS_STAT_H 1
- | #define HAVE_SYS_SELECT_H 1
- | /* end confdefs.h. */
- | #include <stdio.h>
- | #ifdef HAVE_SYS_TYPES_H
- | # include <sys/types.h>
- | #endif
- | #ifdef HAVE_SYS_STAT_H
- | # include <sys/stat.h>
- | #endif
- | #ifdef STDC_HEADERS
- | # include <stdlib.h>
- | # include <stddef.h>
- | #else
- | # ifdef HAVE_STDLIB_H
- | # include <stdlib.h>
- | # endif
- | #endif
- | #ifdef HAVE_STRING_H
- | # if !defined STDC_HEADERS && defined HAVE_MEMORY_H
- | # include <memory.h>
- | # endif
- | # include <string.h>
- | #endif
- | #ifdef HAVE_STRINGS_H
- | # include <strings.h>
- | #endif
- | #ifdef HAVE_INTTYPES_H
- | # include <inttypes.h>
- | #endif
- | #ifdef HAVE_STDINT_H
- | # include <stdint.h>
- | #endif
- | #ifdef HAVE_UNISTD_H
- | # include <unistd.h>
- | #endif
- | #include <sys/prctl.h>
- configure:24075: result: no
- configure:24075: checking sys/prctl.h presence
- configure:24075: g++ -std=c++11 -E -DHAVE_BUILD_INFO -D__STDC_FORMAT_MACROS -I/usr/local/opt/berkeley-db@4/include -DMAC_OSX conftest.cpp
- conftest.cpp:37:10: fatal error: 'sys/prctl.h' file not found
- #include <sys/prctl.h>
- ^~~~~~~~~~~~~
- 1 error generated.
- configure:24075: $? = 1
- configure: failed program was:
- | /* confdefs.h */
- | #define PACKAGE_NAME "Bitcoin Core"
- | #define PACKAGE_TARNAME "bitcoin"
- | #define PACKAGE_VERSION "0.18.99"
- | #define PACKAGE_STRING "Bitcoin Core 0.18.99"
- | #define PACKAGE_BUGREPORT "https://github.com/bitcoin/bitcoin/issues"
- | #define PACKAGE_URL "https://bitcoincore.org/"
- | #define HAVE_CXX11 1
- | #define STDC_HEADERS 1
- | #define HAVE_SYS_TYPES_H 1
- | #define HAVE_SYS_STAT_H 1
- | #define HAVE_STDLIB_H 1
- | #define HAVE_STRING_H 1
- | #define HAVE_MEMORY_H 1
- | #define HAVE_STRINGS_H 1
- | #define HAVE_INTTYPES_H 1
- | #define HAVE_STDINT_H 1
- | #define HAVE_UNISTD_H 1
- | #define HAVE_DLFCN_H 1
- | #define LT_OBJDIR ".libs/"
- | #define USE_ASM 1
- | #define ENABLE_SSE41 1
- | #define ENABLE_AVX2 1
- | #define ENABLE_SHANI 1
- | #define HAVE_PTHREAD_PRIO_INHERIT 1
- | #define HAVE_PTHREAD 1
- | #define HAVE_DECL_STRERROR_R 1
- | #define HAVE_STRERROR_R 1
- | #define HAVE_STDIO_H 1
- | #define HAVE_STDLIB_H 1
- | #define HAVE_UNISTD_H 1
- | #define HAVE_STRINGS_H 1
- | #define HAVE_SYS_TYPES_H 1
- | #define HAVE_SYS_STAT_H 1
- | #define HAVE_SYS_SELECT_H 1
- | /* end confdefs.h. */
- | #include <sys/prctl.h>
- configure:24075: result: no
- configure:24075: checking for sys/prctl.h
- configure:24075: result: no
- configure:24086: checking whether getifaddrs is declared
- configure:24086: g++ -std=c++11 -c -g -O2 -DHAVE_BUILD_INFO -D__STDC_FORMAT_MACROS -I/usr/local/opt/berkeley-db@4/include -DMAC_OSX conftest.cpp >&5
- configure:24086: $? = 0
- configure:24086: result: yes
- configure:24099: checking whether freeifaddrs is declared
- configure:24099: g++ -std=c++11 -c -g -O2 -DHAVE_BUILD_INFO -D__STDC_FORMAT_MACROS -I/usr/local/opt/berkeley-db@4/include -DMAC_OSX conftest.cpp >&5
- configure:24099: $? = 0
- configure:24099: result: yes
- configure:24113: checking whether strnlen is declared
- configure:24113: g++ -std=c++11 -c -g -O2 -DHAVE_BUILD_INFO -D__STDC_FORMAT_MACROS -I/usr/local/opt/berkeley-db@4/include -DMAC_OSX conftest.cpp >&5
- configure:24113: $? = 0
- configure:24113: result: yes
- configure:24126: checking whether daemon is declared
- configure:24126: g++ -std=c++11 -c -g -O2 -DHAVE_BUILD_INFO -D__STDC_FORMAT_MACROS -I/usr/local/opt/berkeley-db@4/include -DMAC_OSX conftest.cpp >&5
- conftest.cpp:78:10: warning: 'daemon' is deprecated: first deprecated in macOS 10.5 - Use posix_spawn APIs instead. [-Wdeprecated-declarations]
- (void) daemon;
- ^
- /Applications/Xcode.app/Contents/Developer/Platforms/MacOSX.platform/Developer/SDKs/MacOSX10.14.sdk/usr/include/stdlib.h:293:6: note: 'daemon' has been explicitly marked deprecated here
- int daemon(int, int) __DARWIN_1050(daemon) __OSX_AVAILABLE_BUT_DEPRECATED_MSG(__MAC_10_0, __MAC_10_5, __IPHONE_2_0, __IPHONE_2_0, "Use posix_spawn APIs instead.") __WATCHOS_PROHIBITED __TVOS_PROHIBITED;
- ^
- 1 warning generated.
- configure:24126: $? = 0
- configure:24126: result: yes
- configure:24138: checking whether le16toh is declared
- configure:24138: g++ -std=c++11 -c -g -O2 -DHAVE_BUILD_INFO -D__STDC_FORMAT_MACROS -I/usr/local/opt/berkeley-db@4/include -DMAC_OSX conftest.cpp >&5
- conftest.cpp:52:10: error: use of undeclared identifier 'le16toh'
- (void) le16toh;
- ^
- 1 error generated.
- configure:24138: $? = 1
- configure: failed program was:
- | /* confdefs.h */
- | #define PACKAGE_NAME "Bitcoin Core"
- | #define PACKAGE_TARNAME "bitcoin"
- | #define PACKAGE_VERSION "0.18.99"
- | #define PACKAGE_STRING "Bitcoin Core 0.18.99"
- | #define PACKAGE_BUGREPORT "https://github.com/bitcoin/bitcoin/issues"
- | #define PACKAGE_URL "https://bitcoincore.org/"
- | #define HAVE_CXX11 1
- | #define STDC_HEADERS 1
- | #define HAVE_SYS_TYPES_H 1
- | #define HAVE_SYS_STAT_H 1
- | #define HAVE_STDLIB_H 1
- | #define HAVE_STRING_H 1
- | #define HAVE_MEMORY_H 1
- | #define HAVE_STRINGS_H 1
- | #define HAVE_INTTYPES_H 1
- | #define HAVE_STDINT_H 1
- | #define HAVE_UNISTD_H 1
- | #define HAVE_DLFCN_H 1
- | #define LT_OBJDIR ".libs/"
- | #define USE_ASM 1
- | #define ENABLE_SSE41 1
- | #define ENABLE_AVX2 1
- | #define ENABLE_SHANI 1
- | #define HAVE_PTHREAD_PRIO_INHERIT 1
- | #define HAVE_PTHREAD 1
- | #define HAVE_DECL_STRERROR_R 1
- | #define HAVE_STRERROR_R 1
- | #define HAVE_STDIO_H 1
- | #define HAVE_STDLIB_H 1
- | #define HAVE_UNISTD_H 1
- | #define HAVE_STRINGS_H 1
- | #define HAVE_SYS_TYPES_H 1
- | #define HAVE_SYS_STAT_H 1
- | #define HAVE_SYS_SELECT_H 1
- | #define HAVE_DECL_GETIFADDRS 1
- | #define HAVE_DECL_FREEIFADDRS 1
- | #define HAVE_DECL_STRNLEN 1
- | #define HAVE_DECL_DAEMON 1
- | /* end confdefs.h. */
- | #if HAVE_ENDIAN_H
- | #include <endian.h>
- | #elif HAVE_SYS_ENDIAN_H
- | #include <sys/endian.h>
- | #endif
- |
- | int
- | main ()
- | {
- | #ifndef le16toh
- | #ifdef __cplusplus
- | (void) le16toh;
- | #else
- | (void) le16toh;
- | #endif
- | #endif
- |
- | ;
- | return 0;
- | }
- configure:24138: result: no
- configure:24153: checking whether le32toh is declared
- configure:24153: g++ -std=c++11 -c -g -O2 -DHAVE_BUILD_INFO -D__STDC_FORMAT_MACROS -I/usr/local/opt/berkeley-db@4/include -DMAC_OSX conftest.cpp >&5
- conftest.cpp:53:10: error: use of undeclared identifier 'le32toh'
- (void) le32toh;
- ^
- 1 error generated.
- configure:24153: $? = 1
- configure: failed program was:
- | /* confdefs.h */
- | #define PACKAGE_NAME "Bitcoin Core"
- | #define PACKAGE_TARNAME "bitcoin"
- | #define PACKAGE_VERSION "0.18.99"
- | #define PACKAGE_STRING "Bitcoin Core 0.18.99"
- | #define PACKAGE_BUGREPORT "https://github.com/bitcoin/bitcoin/issues"
- | #define PACKAGE_URL "https://bitcoincore.org/"
- | #define HAVE_CXX11 1
- | #define STDC_HEADERS 1
- | #define HAVE_SYS_TYPES_H 1
- | #define HAVE_SYS_STAT_H 1
- | #define HAVE_STDLIB_H 1
- | #define HAVE_STRING_H 1
- | #define HAVE_MEMORY_H 1
- | #define HAVE_STRINGS_H 1
- | #define HAVE_INTTYPES_H 1
- | #define HAVE_STDINT_H 1
- | #define HAVE_UNISTD_H 1
- | #define HAVE_DLFCN_H 1
- | #define LT_OBJDIR ".libs/"
- | #define USE_ASM 1
- | #define ENABLE_SSE41 1
- | #define ENABLE_AVX2 1
- | #define ENABLE_SHANI 1
- | #define HAVE_PTHREAD_PRIO_INHERIT 1
- | #define HAVE_PTHREAD 1
- | #define HAVE_DECL_STRERROR_R 1
- | #define HAVE_STRERROR_R 1
- | #define HAVE_STDIO_H 1
- | #define HAVE_STDLIB_H 1
- | #define HAVE_UNISTD_H 1
- | #define HAVE_STRINGS_H 1
- | #define HAVE_SYS_TYPES_H 1
- | #define HAVE_SYS_STAT_H 1
- | #define HAVE_SYS_SELECT_H 1
- | #define HAVE_DECL_GETIFADDRS 1
- | #define HAVE_DECL_FREEIFADDRS 1
- | #define HAVE_DECL_STRNLEN 1
- | #define HAVE_DECL_DAEMON 1
- | #define HAVE_DECL_LE16TOH 0
- | /* end confdefs.h. */
- | #if HAVE_ENDIAN_H
- | #include <endian.h>
- | #elif HAVE_SYS_ENDIAN_H
- | #include <sys/endian.h>
- | #endif
- |
- | int
- | main ()
- | {
- | #ifndef le32toh
- | #ifdef __cplusplus
- | (void) le32toh;
- | #else
- | (void) le32toh;
- | #endif
- | #endif
- |
- | ;
- | return 0;
- | }
- configure:24153: result: no
- configure:24168: checking whether le64toh is declared
- configure:24168: g++ -std=c++11 -c -g -O2 -DHAVE_BUILD_INFO -D__STDC_FORMAT_MACROS -I/usr/local/opt/berkeley-db@4/include -DMAC_OSX conftest.cpp >&5
- conftest.cpp:54:10: error: use of undeclared identifier 'le64toh'
- (void) le64toh;
- ^
- 1 error generated.
- configure:24168: $? = 1
- configure: failed program was:
- | /* confdefs.h */
- | #define PACKAGE_NAME "Bitcoin Core"
- | #define PACKAGE_TARNAME "bitcoin"
- | #define PACKAGE_VERSION "0.18.99"
- | #define PACKAGE_STRING "Bitcoin Core 0.18.99"
- | #define PACKAGE_BUGREPORT "https://github.com/bitcoin/bitcoin/issues"
- | #define PACKAGE_URL "https://bitcoincore.org/"
- | #define HAVE_CXX11 1
- | #define STDC_HEADERS 1
- | #define HAVE_SYS_TYPES_H 1
- | #define HAVE_SYS_STAT_H 1
- | #define HAVE_STDLIB_H 1
- | #define HAVE_STRING_H 1
- | #define HAVE_MEMORY_H 1
- | #define HAVE_STRINGS_H 1
- | #define HAVE_INTTYPES_H 1
- | #define HAVE_STDINT_H 1
- | #define HAVE_UNISTD_H 1
- | #define HAVE_DLFCN_H 1
- | #define LT_OBJDIR ".libs/"
- | #define USE_ASM 1
- | #define ENABLE_SSE41 1
- | #define ENABLE_AVX2 1
- | #define ENABLE_SHANI 1
- | #define HAVE_PTHREAD_PRIO_INHERIT 1
- | #define HAVE_PTHREAD 1
- | #define HAVE_DECL_STRERROR_R 1
- | #define HAVE_STRERROR_R 1
- | #define HAVE_STDIO_H 1
- | #define HAVE_STDLIB_H 1
- | #define HAVE_UNISTD_H 1
- | #define HAVE_STRINGS_H 1
- | #define HAVE_SYS_TYPES_H 1
- | #define HAVE_SYS_STAT_H 1
- | #define HAVE_SYS_SELECT_H 1
- | #define HAVE_DECL_GETIFADDRS 1
- | #define HAVE_DECL_FREEIFADDRS 1
- | #define HAVE_DECL_STRNLEN 1
- | #define HAVE_DECL_DAEMON 1
- | #define HAVE_DECL_LE16TOH 0
- | #define HAVE_DECL_LE32TOH 0
- | /* end confdefs.h. */
- | #if HAVE_ENDIAN_H
- | #include <endian.h>
- | #elif HAVE_SYS_ENDIAN_H
- | #include <sys/endian.h>
- | #endif
- |
- | int
- | main ()
- | {
- | #ifndef le64toh
- | #ifdef __cplusplus
- | (void) le64toh;
- | #else
- | (void) le64toh;
- | #endif
- | #endif
- |
- | ;
- | return 0;
- | }
- configure:24168: result: no
- configure:24183: checking whether htole16 is declared
- configure:24183: g++ -std=c++11 -c -g -O2 -DHAVE_BUILD_INFO -D__STDC_FORMAT_MACROS -I/usr/local/opt/berkeley-db@4/include -DMAC_OSX conftest.cpp >&5
- conftest.cpp:55:10: error: use of undeclared identifier 'htole16'
- (void) htole16;
- ^
- 1 error generated.
- configure:24183: $? = 1
- configure: failed program was:
- | /* confdefs.h */
- | #define PACKAGE_NAME "Bitcoin Core"
- | #define PACKAGE_TARNAME "bitcoin"
- | #define PACKAGE_VERSION "0.18.99"
- | #define PACKAGE_STRING "Bitcoin Core 0.18.99"
- | #define PACKAGE_BUGREPORT "https://github.com/bitcoin/bitcoin/issues"
- | #define PACKAGE_URL "https://bitcoincore.org/"
- | #define HAVE_CXX11 1
- | #define STDC_HEADERS 1
- | #define HAVE_SYS_TYPES_H 1
- | #define HAVE_SYS_STAT_H 1
- | #define HAVE_STDLIB_H 1
- | #define HAVE_STRING_H 1
- | #define HAVE_MEMORY_H 1
- | #define HAVE_STRINGS_H 1
- | #define HAVE_INTTYPES_H 1
- | #define HAVE_STDINT_H 1
- | #define HAVE_UNISTD_H 1
- | #define HAVE_DLFCN_H 1
- | #define LT_OBJDIR ".libs/"
- | #define USE_ASM 1
- | #define ENABLE_SSE41 1
- | #define ENABLE_AVX2 1
- | #define ENABLE_SHANI 1
- | #define HAVE_PTHREAD_PRIO_INHERIT 1
- | #define HAVE_PTHREAD 1
- | #define HAVE_DECL_STRERROR_R 1
- | #define HAVE_STRERROR_R 1
- | #define HAVE_STDIO_H 1
- | #define HAVE_STDLIB_H 1
- | #define HAVE_UNISTD_H 1
- | #define HAVE_STRINGS_H 1
- | #define HAVE_SYS_TYPES_H 1
- | #define HAVE_SYS_STAT_H 1
- | #define HAVE_SYS_SELECT_H 1
- | #define HAVE_DECL_GETIFADDRS 1
- | #define HAVE_DECL_FREEIFADDRS 1
- | #define HAVE_DECL_STRNLEN 1
- | #define HAVE_DECL_DAEMON 1
- | #define HAVE_DECL_LE16TOH 0
- | #define HAVE_DECL_LE32TOH 0
- | #define HAVE_DECL_LE64TOH 0
- | /* end confdefs.h. */
- | #if HAVE_ENDIAN_H
- | #include <endian.h>
- | #elif HAVE_SYS_ENDIAN_H
- | #include <sys/endian.h>
- | #endif
- |
- | int
- | main ()
- | {
- | #ifndef htole16
- | #ifdef __cplusplus
- | (void) htole16;
- | #else
- | (void) htole16;
- | #endif
- | #endif
- |
- | ;
- | return 0;
- | }
- configure:24183: result: no
- configure:24198: checking whether htole32 is declared
- configure:24198: g++ -std=c++11 -c -g -O2 -DHAVE_BUILD_INFO -D__STDC_FORMAT_MACROS -I/usr/local/opt/berkeley-db@4/include -DMAC_OSX conftest.cpp >&5
- conftest.cpp:56:10: error: use of undeclared identifier 'htole32'
- (void) htole32;
- ^
- 1 error generated.
- configure:24198: $? = 1
- configure: failed program was:
- | /* confdefs.h */
- | #define PACKAGE_NAME "Bitcoin Core"
- | #define PACKAGE_TARNAME "bitcoin"
- | #define PACKAGE_VERSION "0.18.99"
- | #define PACKAGE_STRING "Bitcoin Core 0.18.99"
- | #define PACKAGE_BUGREPORT "https://github.com/bitcoin/bitcoin/issues"
- | #define PACKAGE_URL "https://bitcoincore.org/"
- | #define HAVE_CXX11 1
- | #define STDC_HEADERS 1
- | #define HAVE_SYS_TYPES_H 1
- | #define HAVE_SYS_STAT_H 1
- | #define HAVE_STDLIB_H 1
- | #define HAVE_STRING_H 1
- | #define HAVE_MEMORY_H 1
- | #define HAVE_STRINGS_H 1
- | #define HAVE_INTTYPES_H 1
- | #define HAVE_STDINT_H 1
- | #define HAVE_UNISTD_H 1
- | #define HAVE_DLFCN_H 1
- | #define LT_OBJDIR ".libs/"
- | #define USE_ASM 1
- | #define ENABLE_SSE41 1
- | #define ENABLE_AVX2 1
- | #define ENABLE_SHANI 1
- | #define HAVE_PTHREAD_PRIO_INHERIT 1
- | #define HAVE_PTHREAD 1
- | #define HAVE_DECL_STRERROR_R 1
- | #define HAVE_STRERROR_R 1
- | #define HAVE_STDIO_H 1
- | #define HAVE_STDLIB_H 1
- | #define HAVE_UNISTD_H 1
- | #define HAVE_STRINGS_H 1
- | #define HAVE_SYS_TYPES_H 1
- | #define HAVE_SYS_STAT_H 1
- | #define HAVE_SYS_SELECT_H 1
- | #define HAVE_DECL_GETIFADDRS 1
- | #define HAVE_DECL_FREEIFADDRS 1
- | #define HAVE_DECL_STRNLEN 1
- | #define HAVE_DECL_DAEMON 1
- | #define HAVE_DECL_LE16TOH 0
- | #define HAVE_DECL_LE32TOH 0
- | #define HAVE_DECL_LE64TOH 0
- | #define HAVE_DECL_HTOLE16 0
- | /* end confdefs.h. */
- | #if HAVE_ENDIAN_H
- | #include <endian.h>
- | #elif HAVE_SYS_ENDIAN_H
- | #include <sys/endian.h>
- | #endif
- |
- | int
- | main ()
- | {
- | #ifndef htole32
- | #ifdef __cplusplus
- | (void) htole32;
- | #else
- | (void) htole32;
- | #endif
- | #endif
- |
- | ;
- | return 0;
- | }
- configure:24198: result: no
- configure:24213: checking whether htole64 is declared
- configure:24213: g++ -std=c++11 -c -g -O2 -DHAVE_BUILD_INFO -D__STDC_FORMAT_MACROS -I/usr/local/opt/berkeley-db@4/include -DMAC_OSX conftest.cpp >&5
- conftest.cpp:57:10: error: use of undeclared identifier 'htole64'
- (void) htole64;
- ^
- 1 error generated.
- configure:24213: $? = 1
- configure: failed program was:
- | /* confdefs.h */
- | #define PACKAGE_NAME "Bitcoin Core"
- | #define PACKAGE_TARNAME "bitcoin"
- | #define PACKAGE_VERSION "0.18.99"
- | #define PACKAGE_STRING "Bitcoin Core 0.18.99"
- | #define PACKAGE_BUGREPORT "https://github.com/bitcoin/bitcoin/issues"
- | #define PACKAGE_URL "https://bitcoincore.org/"
- | #define HAVE_CXX11 1
- | #define STDC_HEADERS 1
- | #define HAVE_SYS_TYPES_H 1
- | #define HAVE_SYS_STAT_H 1
- | #define HAVE_STDLIB_H 1
- | #define HAVE_STRING_H 1
- | #define HAVE_MEMORY_H 1
- | #define HAVE_STRINGS_H 1
- | #define HAVE_INTTYPES_H 1
- | #define HAVE_STDINT_H 1
- | #define HAVE_UNISTD_H 1
- | #define HAVE_DLFCN_H 1
- | #define LT_OBJDIR ".libs/"
- | #define USE_ASM 1
- | #define ENABLE_SSE41 1
- | #define ENABLE_AVX2 1
- | #define ENABLE_SHANI 1
- | #define HAVE_PTHREAD_PRIO_INHERIT 1
- | #define HAVE_PTHREAD 1
- | #define HAVE_DECL_STRERROR_R 1
- | #define HAVE_STRERROR_R 1
- | #define HAVE_STDIO_H 1
- | #define HAVE_STDLIB_H 1
- | #define HAVE_UNISTD_H 1
- | #define HAVE_STRINGS_H 1
- | #define HAVE_SYS_TYPES_H 1
- | #define HAVE_SYS_STAT_H 1
- | #define HAVE_SYS_SELECT_H 1
- | #define HAVE_DECL_GETIFADDRS 1
- | #define HAVE_DECL_FREEIFADDRS 1
- | #define HAVE_DECL_STRNLEN 1
- | #define HAVE_DECL_DAEMON 1
- | #define HAVE_DECL_LE16TOH 0
- | #define HAVE_DECL_LE32TOH 0
- | #define HAVE_DECL_LE64TOH 0
- | #define HAVE_DECL_HTOLE16 0
- | #define HAVE_DECL_HTOLE32 0
- | /* end confdefs.h. */
- | #if HAVE_ENDIAN_H
- | #include <endian.h>
- | #elif HAVE_SYS_ENDIAN_H
- | #include <sys/endian.h>
- | #endif
- |
- | int
- | main ()
- | {
- | #ifndef htole64
- | #ifdef __cplusplus
- | (void) htole64;
- | #else
- | (void) htole64;
- | #endif
- | #endif
- |
- | ;
- | return 0;
- | }
- configure:24213: result: no
- configure:24228: checking whether be16toh is declared
- configure:24228: g++ -std=c++11 -c -g -O2 -DHAVE_BUILD_INFO -D__STDC_FORMAT_MACROS -I/usr/local/opt/berkeley-db@4/include -DMAC_OSX conftest.cpp >&5
- conftest.cpp:58:10: error: use of undeclared identifier 'be16toh'
- (void) be16toh;
- ^
- 1 error generated.
- configure:24228: $? = 1
- configure: failed program was:
- | /* confdefs.h */
- | #define PACKAGE_NAME "Bitcoin Core"
- | #define PACKAGE_TARNAME "bitcoin"
- | #define PACKAGE_VERSION "0.18.99"
- | #define PACKAGE_STRING "Bitcoin Core 0.18.99"
- | #define PACKAGE_BUGREPORT "https://github.com/bitcoin/bitcoin/issues"
- | #define PACKAGE_URL "https://bitcoincore.org/"
- | #define HAVE_CXX11 1
- | #define STDC_HEADERS 1
- | #define HAVE_SYS_TYPES_H 1
- | #define HAVE_SYS_STAT_H 1
- | #define HAVE_STDLIB_H 1
- | #define HAVE_STRING_H 1
- | #define HAVE_MEMORY_H 1
- | #define HAVE_STRINGS_H 1
- | #define HAVE_INTTYPES_H 1
- | #define HAVE_STDINT_H 1
- | #define HAVE_UNISTD_H 1
- | #define HAVE_DLFCN_H 1
- | #define LT_OBJDIR ".libs/"
- | #define USE_ASM 1
- | #define ENABLE_SSE41 1
- | #define ENABLE_AVX2 1
- | #define ENABLE_SHANI 1
- | #define HAVE_PTHREAD_PRIO_INHERIT 1
- | #define HAVE_PTHREAD 1
- | #define HAVE_DECL_STRERROR_R 1
- | #define HAVE_STRERROR_R 1
- | #define HAVE_STDIO_H 1
- | #define HAVE_STDLIB_H 1
- | #define HAVE_UNISTD_H 1
- | #define HAVE_STRINGS_H 1
- | #define HAVE_SYS_TYPES_H 1
- | #define HAVE_SYS_STAT_H 1
- | #define HAVE_SYS_SELECT_H 1
- | #define HAVE_DECL_GETIFADDRS 1
- | #define HAVE_DECL_FREEIFADDRS 1
- | #define HAVE_DECL_STRNLEN 1
- | #define HAVE_DECL_DAEMON 1
- | #define HAVE_DECL_LE16TOH 0
- | #define HAVE_DECL_LE32TOH 0
- | #define HAVE_DECL_LE64TOH 0
- | #define HAVE_DECL_HTOLE16 0
- | #define HAVE_DECL_HTOLE32 0
- | #define HAVE_DECL_HTOLE64 0
- | /* end confdefs.h. */
- | #if HAVE_ENDIAN_H
- | #include <endian.h>
- | #elif HAVE_SYS_ENDIAN_H
- | #include <sys/endian.h>
- | #endif
- |
- | int
- | main ()
- | {
- | #ifndef be16toh
- | #ifdef __cplusplus
- | (void) be16toh;
- | #else
- | (void) be16toh;
- | #endif
- | #endif
- |
- | ;
- | return 0;
- | }
- configure:24228: result: no
- configure:24243: checking whether be32toh is declared
- configure:24243: g++ -std=c++11 -c -g -O2 -DHAVE_BUILD_INFO -D__STDC_FORMAT_MACROS -I/usr/local/opt/berkeley-db@4/include -DMAC_OSX conftest.cpp >&5
- conftest.cpp:59:10: error: use of undeclared identifier 'be32toh'
- (void) be32toh;
- ^
- 1 error generated.
- configure:24243: $? = 1
- configure: failed program was:
- | /* confdefs.h */
- | #define PACKAGE_NAME "Bitcoin Core"
- | #define PACKAGE_TARNAME "bitcoin"
- | #define PACKAGE_VERSION "0.18.99"
- | #define PACKAGE_STRING "Bitcoin Core 0.18.99"
- | #define PACKAGE_BUGREPORT "https://github.com/bitcoin/bitcoin/issues"
- | #define PACKAGE_URL "https://bitcoincore.org/"
- | #define HAVE_CXX11 1
- | #define STDC_HEADERS 1
- | #define HAVE_SYS_TYPES_H 1
- | #define HAVE_SYS_STAT_H 1
- | #define HAVE_STDLIB_H 1
- | #define HAVE_STRING_H 1
- | #define HAVE_MEMORY_H 1
- | #define HAVE_STRINGS_H 1
- | #define HAVE_INTTYPES_H 1
- | #define HAVE_STDINT_H 1
- | #define HAVE_UNISTD_H 1
- | #define HAVE_DLFCN_H 1
- | #define LT_OBJDIR ".libs/"
- | #define USE_ASM 1
- | #define ENABLE_SSE41 1
- | #define ENABLE_AVX2 1
- | #define ENABLE_SHANI 1
- | #define HAVE_PTHREAD_PRIO_INHERIT 1
- | #define HAVE_PTHREAD 1
- | #define HAVE_DECL_STRERROR_R 1
- | #define HAVE_STRERROR_R 1
- | #define HAVE_STDIO_H 1
- | #define HAVE_STDLIB_H 1
- | #define HAVE_UNISTD_H 1
- | #define HAVE_STRINGS_H 1
- | #define HAVE_SYS_TYPES_H 1
- | #define HAVE_SYS_STAT_H 1
- | #define HAVE_SYS_SELECT_H 1
- | #define HAVE_DECL_GETIFADDRS 1
- | #define HAVE_DECL_FREEIFADDRS 1
- | #define HAVE_DECL_STRNLEN 1
- | #define HAVE_DECL_DAEMON 1
- | #define HAVE_DECL_LE16TOH 0
- | #define HAVE_DECL_LE32TOH 0
- | #define HAVE_DECL_LE64TOH 0
- | #define HAVE_DECL_HTOLE16 0
- | #define HAVE_DECL_HTOLE32 0
- | #define HAVE_DECL_HTOLE64 0
- | #define HAVE_DECL_BE16TOH 0
- | /* end confdefs.h. */
- | #if HAVE_ENDIAN_H
- | #include <endian.h>
- | #elif HAVE_SYS_ENDIAN_H
- | #include <sys/endian.h>
- | #endif
- |
- | int
- | main ()
- | {
- | #ifndef be32toh
- | #ifdef __cplusplus
- | (void) be32toh;
- | #else
- | (void) be32toh;
- | #endif
- | #endif
- |
- | ;
- | return 0;
- | }
- configure:24243: result: no
- configure:24258: checking whether be64toh is declared
- configure:24258: g++ -std=c++11 -c -g -O2 -DHAVE_BUILD_INFO -D__STDC_FORMAT_MACROS -I/usr/local/opt/berkeley-db@4/include -DMAC_OSX conftest.cpp >&5
- conftest.cpp:60:10: error: use of undeclared identifier 'be64toh'
- (void) be64toh;
- ^
- 1 error generated.
- configure:24258: $? = 1
- configure: failed program was:
- | /* confdefs.h */
- | #define PACKAGE_NAME "Bitcoin Core"
- | #define PACKAGE_TARNAME "bitcoin"
- | #define PACKAGE_VERSION "0.18.99"
- | #define PACKAGE_STRING "Bitcoin Core 0.18.99"
- | #define PACKAGE_BUGREPORT "https://github.com/bitcoin/bitcoin/issues"
- | #define PACKAGE_URL "https://bitcoincore.org/"
- | #define HAVE_CXX11 1
- | #define STDC_HEADERS 1
- | #define HAVE_SYS_TYPES_H 1
- | #define HAVE_SYS_STAT_H 1
- | #define HAVE_STDLIB_H 1
- | #define HAVE_STRING_H 1
- | #define HAVE_MEMORY_H 1
- | #define HAVE_STRINGS_H 1
- | #define HAVE_INTTYPES_H 1
- | #define HAVE_STDINT_H 1
- | #define HAVE_UNISTD_H 1
- | #define HAVE_DLFCN_H 1
- | #define LT_OBJDIR ".libs/"
- | #define USE_ASM 1
- | #define ENABLE_SSE41 1
- | #define ENABLE_AVX2 1
- | #define ENABLE_SHANI 1
- | #define HAVE_PTHREAD_PRIO_INHERIT 1
- | #define HAVE_PTHREAD 1
- | #define HAVE_DECL_STRERROR_R 1
- | #define HAVE_STRERROR_R 1
- | #define HAVE_STDIO_H 1
- | #define HAVE_STDLIB_H 1
- | #define HAVE_UNISTD_H 1
- | #define HAVE_STRINGS_H 1
- | #define HAVE_SYS_TYPES_H 1
- | #define HAVE_SYS_STAT_H 1
- | #define HAVE_SYS_SELECT_H 1
- | #define HAVE_DECL_GETIFADDRS 1
- | #define HAVE_DECL_FREEIFADDRS 1
- | #define HAVE_DECL_STRNLEN 1
- | #define HAVE_DECL_DAEMON 1
- | #define HAVE_DECL_LE16TOH 0
- | #define HAVE_DECL_LE32TOH 0
- | #define HAVE_DECL_LE64TOH 0
- | #define HAVE_DECL_HTOLE16 0
- | #define HAVE_DECL_HTOLE32 0
- | #define HAVE_DECL_HTOLE64 0
- | #define HAVE_DECL_BE16TOH 0
- | #define HAVE_DECL_BE32TOH 0
- | /* end confdefs.h. */
- | #if HAVE_ENDIAN_H
- | #include <endian.h>
- | #elif HAVE_SYS_ENDIAN_H
- | #include <sys/endian.h>
- | #endif
- |
- | int
- | main ()
- | {
- | #ifndef be64toh
- | #ifdef __cplusplus
- | (void) be64toh;
- | #else
- | (void) be64toh;
- | #endif
- | #endif
- |
- | ;
- | return 0;
- | }
- configure:24258: result: no
- configure:24273: checking whether htobe16 is declared
- configure:24273: g++ -std=c++11 -c -g -O2 -DHAVE_BUILD_INFO -D__STDC_FORMAT_MACROS -I/usr/local/opt/berkeley-db@4/include -DMAC_OSX conftest.cpp >&5
- conftest.cpp:61:10: error: use of undeclared identifier 'htobe16'
- (void) htobe16;
- ^
- 1 error generated.
- configure:24273: $? = 1
- configure: failed program was:
- | /* confdefs.h */
- | #define PACKAGE_NAME "Bitcoin Core"
- | #define PACKAGE_TARNAME "bitcoin"
- | #define PACKAGE_VERSION "0.18.99"
- | #define PACKAGE_STRING "Bitcoin Core 0.18.99"
- | #define PACKAGE_BUGREPORT "https://github.com/bitcoin/bitcoin/issues"
- | #define PACKAGE_URL "https://bitcoincore.org/"
- | #define HAVE_CXX11 1
- | #define STDC_HEADERS 1
- | #define HAVE_SYS_TYPES_H 1
- | #define HAVE_SYS_STAT_H 1
- | #define HAVE_STDLIB_H 1
- | #define HAVE_STRING_H 1
- | #define HAVE_MEMORY_H 1
- | #define HAVE_STRINGS_H 1
- | #define HAVE_INTTYPES_H 1
- | #define HAVE_STDINT_H 1
- | #define HAVE_UNISTD_H 1
- | #define HAVE_DLFCN_H 1
- | #define LT_OBJDIR ".libs/"
- | #define USE_ASM 1
- | #define ENABLE_SSE41 1
- | #define ENABLE_AVX2 1
- | #define ENABLE_SHANI 1
- | #define HAVE_PTHREAD_PRIO_INHERIT 1
- | #define HAVE_PTHREAD 1
- | #define HAVE_DECL_STRERROR_R 1
- | #define HAVE_STRERROR_R 1
- | #define HAVE_STDIO_H 1
- | #define HAVE_STDLIB_H 1
- | #define HAVE_UNISTD_H 1
- | #define HAVE_STRINGS_H 1
- | #define HAVE_SYS_TYPES_H 1
- | #define HAVE_SYS_STAT_H 1
- | #define HAVE_SYS_SELECT_H 1
- | #define HAVE_DECL_GETIFADDRS 1
- | #define HAVE_DECL_FREEIFADDRS 1
- | #define HAVE_DECL_STRNLEN 1
- | #define HAVE_DECL_DAEMON 1
- | #define HAVE_DECL_LE16TOH 0
- | #define HAVE_DECL_LE32TOH 0
- | #define HAVE_DECL_LE64TOH 0
- | #define HAVE_DECL_HTOLE16 0
- | #define HAVE_DECL_HTOLE32 0
- | #define HAVE_DECL_HTOLE64 0
- | #define HAVE_DECL_BE16TOH 0
- | #define HAVE_DECL_BE32TOH 0
- | #define HAVE_DECL_BE64TOH 0
- | /* end confdefs.h. */
- | #if HAVE_ENDIAN_H
- | #include <endian.h>
- | #elif HAVE_SYS_ENDIAN_H
- | #include <sys/endian.h>
- | #endif
- |
- | int
- | main ()
- | {
- | #ifndef htobe16
- | #ifdef __cplusplus
- | (void) htobe16;
- | #else
- | (void) htobe16;
- | #endif
- | #endif
- |
- | ;
- | return 0;
- | }
- configure:24273: result: no
- configure:24288: checking whether htobe32 is declared
- configure:24288: g++ -std=c++11 -c -g -O2 -DHAVE_BUILD_INFO -D__STDC_FORMAT_MACROS -I/usr/local/opt/berkeley-db@4/include -DMAC_OSX conftest.cpp >&5
- conftest.cpp:62:10: error: use of undeclared identifier 'htobe32'
- (void) htobe32;
- ^
- 1 error generated.
- configure:24288: $? = 1
- configure: failed program was:
- | /* confdefs.h */
- | #define PACKAGE_NAME "Bitcoin Core"
- | #define PACKAGE_TARNAME "bitcoin"
- | #define PACKAGE_VERSION "0.18.99"
- | #define PACKAGE_STRING "Bitcoin Core 0.18.99"
- | #define PACKAGE_BUGREPORT "https://github.com/bitcoin/bitcoin/issues"
- | #define PACKAGE_URL "https://bitcoincore.org/"
- | #define HAVE_CXX11 1
- | #define STDC_HEADERS 1
- | #define HAVE_SYS_TYPES_H 1
- | #define HAVE_SYS_STAT_H 1
- | #define HAVE_STDLIB_H 1
- | #define HAVE_STRING_H 1
- | #define HAVE_MEMORY_H 1
- | #define HAVE_STRINGS_H 1
- | #define HAVE_INTTYPES_H 1
- | #define HAVE_STDINT_H 1
- | #define HAVE_UNISTD_H 1
- | #define HAVE_DLFCN_H 1
- | #define LT_OBJDIR ".libs/"
- | #define USE_ASM 1
- | #define ENABLE_SSE41 1
- | #define ENABLE_AVX2 1
- | #define ENABLE_SHANI 1
- | #define HAVE_PTHREAD_PRIO_INHERIT 1
- | #define HAVE_PTHREAD 1
- | #define HAVE_DECL_STRERROR_R 1
- | #define HAVE_STRERROR_R 1
- | #define HAVE_STDIO_H 1
- | #define HAVE_STDLIB_H 1
- | #define HAVE_UNISTD_H 1
- | #define HAVE_STRINGS_H 1
- | #define HAVE_SYS_TYPES_H 1
- | #define HAVE_SYS_STAT_H 1
- | #define HAVE_SYS_SELECT_H 1
- | #define HAVE_DECL_GETIFADDRS 1
- | #define HAVE_DECL_FREEIFADDRS 1
- | #define HAVE_DECL_STRNLEN 1
- | #define HAVE_DECL_DAEMON 1
- | #define HAVE_DECL_LE16TOH 0
- | #define HAVE_DECL_LE32TOH 0
- | #define HAVE_DECL_LE64TOH 0
- | #define HAVE_DECL_HTOLE16 0
- | #define HAVE_DECL_HTOLE32 0
- | #define HAVE_DECL_HTOLE64 0
- | #define HAVE_DECL_BE16TOH 0
- | #define HAVE_DECL_BE32TOH 0
- | #define HAVE_DECL_BE64TOH 0
- | #define HAVE_DECL_HTOBE16 0
- | /* end confdefs.h. */
- | #if HAVE_ENDIAN_H
- | #include <endian.h>
- | #elif HAVE_SYS_ENDIAN_H
- | #include <sys/endian.h>
- | #endif
- |
- | int
- | main ()
- | {
- | #ifndef htobe32
- | #ifdef __cplusplus
- | (void) htobe32;
- | #else
- | (void) htobe32;
- | #endif
- | #endif
- |
- | ;
- | return 0;
- | }
- configure:24288: result: no
- configure:24303: checking whether htobe64 is declared
- configure:24303: g++ -std=c++11 -c -g -O2 -DHAVE_BUILD_INFO -D__STDC_FORMAT_MACROS -I/usr/local/opt/berkeley-db@4/include -DMAC_OSX conftest.cpp >&5
- conftest.cpp:63:10: error: use of undeclared identifier 'htobe64'
- (void) htobe64;
- ^
- 1 error generated.
- configure:24303: $? = 1
- configure: failed program was:
- | /* confdefs.h */
- | #define PACKAGE_NAME "Bitcoin Core"
- | #define PACKAGE_TARNAME "bitcoin"
- | #define PACKAGE_VERSION "0.18.99"
- | #define PACKAGE_STRING "Bitcoin Core 0.18.99"
- | #define PACKAGE_BUGREPORT "https://github.com/bitcoin/bitcoin/issues"
- | #define PACKAGE_URL "https://bitcoincore.org/"
- | #define HAVE_CXX11 1
- | #define STDC_HEADERS 1
- | #define HAVE_SYS_TYPES_H 1
- | #define HAVE_SYS_STAT_H 1
- | #define HAVE_STDLIB_H 1
- | #define HAVE_STRING_H 1
- | #define HAVE_MEMORY_H 1
- | #define HAVE_STRINGS_H 1
- | #define HAVE_INTTYPES_H 1
- | #define HAVE_STDINT_H 1
- | #define HAVE_UNISTD_H 1
- | #define HAVE_DLFCN_H 1
- | #define LT_OBJDIR ".libs/"
- | #define USE_ASM 1
- | #define ENABLE_SSE41 1
- | #define ENABLE_AVX2 1
- | #define ENABLE_SHANI 1
- | #define HAVE_PTHREAD_PRIO_INHERIT 1
- | #define HAVE_PTHREAD 1
- | #define HAVE_DECL_STRERROR_R 1
- | #define HAVE_STRERROR_R 1
- | #define HAVE_STDIO_H 1
- | #define HAVE_STDLIB_H 1
- | #define HAVE_UNISTD_H 1
- | #define HAVE_STRINGS_H 1
- | #define HAVE_SYS_TYPES_H 1
- | #define HAVE_SYS_STAT_H 1
- | #define HAVE_SYS_SELECT_H 1
- | #define HAVE_DECL_GETIFADDRS 1
- | #define HAVE_DECL_FREEIFADDRS 1
- | #define HAVE_DECL_STRNLEN 1
- | #define HAVE_DECL_DAEMON 1
- | #define HAVE_DECL_LE16TOH 0
- | #define HAVE_DECL_LE32TOH 0
- | #define HAVE_DECL_LE64TOH 0
- | #define HAVE_DECL_HTOLE16 0
- | #define HAVE_DECL_HTOLE32 0
- | #define HAVE_DECL_HTOLE64 0
- | #define HAVE_DECL_BE16TOH 0
- | #define HAVE_DECL_BE32TOH 0
- | #define HAVE_DECL_BE64TOH 0
- | #define HAVE_DECL_HTOBE16 0
- | #define HAVE_DECL_HTOBE32 0
- | /* end confdefs.h. */
- | #if HAVE_ENDIAN_H
- | #include <endian.h>
- | #elif HAVE_SYS_ENDIAN_H
- | #include <sys/endian.h>
- | #endif
- |
- | int
- | main ()
- | {
- | #ifndef htobe64
- | #ifdef __cplusplus
- | (void) htobe64;
- | #else
- | (void) htobe64;
- | #endif
- | #endif
- |
- | ;
- | return 0;
- | }
- configure:24303: result: no
- configure:24320: checking whether bswap_16 is declared
- configure:24320: g++ -std=c++11 -c -g -O2 -DHAVE_BUILD_INFO -D__STDC_FORMAT_MACROS -I/usr/local/opt/berkeley-db@4/include -DMAC_OSX conftest.cpp >&5
- conftest.cpp:62:10: error: use of undeclared identifier 'bswap_16'
- (void) bswap_16;
- ^
- 1 error generated.
- configure:24320: $? = 1
- configure: failed program was:
- | /* confdefs.h */
- | #define PACKAGE_NAME "Bitcoin Core"
- | #define PACKAGE_TARNAME "bitcoin"
- | #define PACKAGE_VERSION "0.18.99"
- | #define PACKAGE_STRING "Bitcoin Core 0.18.99"
- | #define PACKAGE_BUGREPORT "https://github.com/bitcoin/bitcoin/issues"
- | #define PACKAGE_URL "https://bitcoincore.org/"
- | #define HAVE_CXX11 1
- | #define STDC_HEADERS 1
- | #define HAVE_SYS_TYPES_H 1
- | #define HAVE_SYS_STAT_H 1
- | #define HAVE_STDLIB_H 1
- | #define HAVE_STRING_H 1
- | #define HAVE_MEMORY_H 1
- | #define HAVE_STRINGS_H 1
- | #define HAVE_INTTYPES_H 1
- | #define HAVE_STDINT_H 1
- | #define HAVE_UNISTD_H 1
- | #define HAVE_DLFCN_H 1
- | #define LT_OBJDIR ".libs/"
- | #define USE_ASM 1
- | #define ENABLE_SSE41 1
- | #define ENABLE_AVX2 1
- | #define ENABLE_SHANI 1
- | #define HAVE_PTHREAD_PRIO_INHERIT 1
- | #define HAVE_PTHREAD 1
- | #define HAVE_DECL_STRERROR_R 1
- | #define HAVE_STRERROR_R 1
- | #define HAVE_STDIO_H 1
- | #define HAVE_STDLIB_H 1
- | #define HAVE_UNISTD_H 1
- | #define HAVE_STRINGS_H 1
- | #define HAVE_SYS_TYPES_H 1
- | #define HAVE_SYS_STAT_H 1
- | #define HAVE_SYS_SELECT_H 1
- | #define HAVE_DECL_GETIFADDRS 1
- | #define HAVE_DECL_FREEIFADDRS 1
- | #define HAVE_DECL_STRNLEN 1
- | #define HAVE_DECL_DAEMON 1
- | #define HAVE_DECL_LE16TOH 0
- | #define HAVE_DECL_LE32TOH 0
- | #define HAVE_DECL_LE64TOH 0
- | #define HAVE_DECL_HTOLE16 0
- | #define HAVE_DECL_HTOLE32 0
- | #define HAVE_DECL_HTOLE64 0
- | #define HAVE_DECL_BE16TOH 0
- | #define HAVE_DECL_BE32TOH 0
- | #define HAVE_DECL_BE64TOH 0
- | #define HAVE_DECL_HTOBE16 0
- | #define HAVE_DECL_HTOBE32 0
- | #define HAVE_DECL_HTOBE64 0
- | /* end confdefs.h. */
- | #if HAVE_BYTESWAP_H
- | #include <byteswap.h>
- | #endif
- |
- | int
- | main ()
- | {
- | #ifndef bswap_16
- | #ifdef __cplusplus
- | (void) bswap_16;
- | #else
- | (void) bswap_16;
- | #endif
- | #endif
- |
- | ;
- | return 0;
- | }
- configure:24320: result: no
- configure:24333: checking whether bswap_32 is declared
- configure:24333: g++ -std=c++11 -c -g -O2 -DHAVE_BUILD_INFO -D__STDC_FORMAT_MACROS -I/usr/local/opt/berkeley-db@4/include -DMAC_OSX conftest.cpp >&5
- conftest.cpp:63:10: error: use of undeclared identifier 'bswap_32'
- (void) bswap_32;
- ^
- 1 error generated.
- configure:24333: $? = 1
- configure: failed program was:
- | /* confdefs.h */
- | #define PACKAGE_NAME "Bitcoin Core"
- | #define PACKAGE_TARNAME "bitcoin"
- | #define PACKAGE_VERSION "0.18.99"
- | #define PACKAGE_STRING "Bitcoin Core 0.18.99"
- | #define PACKAGE_BUGREPORT "https://github.com/bitcoin/bitcoin/issues"
- | #define PACKAGE_URL "https://bitcoincore.org/"
- | #define HAVE_CXX11 1
- | #define STDC_HEADERS 1
- | #define HAVE_SYS_TYPES_H 1
- | #define HAVE_SYS_STAT_H 1
- | #define HAVE_STDLIB_H 1
- | #define HAVE_STRING_H 1
- | #define HAVE_MEMORY_H 1
- | #define HAVE_STRINGS_H 1
- | #define HAVE_INTTYPES_H 1
- | #define HAVE_STDINT_H 1
- | #define HAVE_UNISTD_H 1
- | #define HAVE_DLFCN_H 1
- | #define LT_OBJDIR ".libs/"
- | #define USE_ASM 1
- | #define ENABLE_SSE41 1
- | #define ENABLE_AVX2 1
- | #define ENABLE_SHANI 1
- | #define HAVE_PTHREAD_PRIO_INHERIT 1
- | #define HAVE_PTHREAD 1
- | #define HAVE_DECL_STRERROR_R 1
- | #define HAVE_STRERROR_R 1
- | #define HAVE_STDIO_H 1
- | #define HAVE_STDLIB_H 1
- | #define HAVE_UNISTD_H 1
- | #define HAVE_STRINGS_H 1
- | #define HAVE_SYS_TYPES_H 1
- | #define HAVE_SYS_STAT_H 1
- | #define HAVE_SYS_SELECT_H 1
- | #define HAVE_DECL_GETIFADDRS 1
- | #define HAVE_DECL_FREEIFADDRS 1
- | #define HAVE_DECL_STRNLEN 1
- | #define HAVE_DECL_DAEMON 1
- | #define HAVE_DECL_LE16TOH 0
- | #define HAVE_DECL_LE32TOH 0
- | #define HAVE_DECL_LE64TOH 0
- | #define HAVE_DECL_HTOLE16 0
- | #define HAVE_DECL_HTOLE32 0
- | #define HAVE_DECL_HTOLE64 0
- | #define HAVE_DECL_BE16TOH 0
- | #define HAVE_DECL_BE32TOH 0
- | #define HAVE_DECL_BE64TOH 0
- | #define HAVE_DECL_HTOBE16 0
- | #define HAVE_DECL_HTOBE32 0
- | #define HAVE_DECL_HTOBE64 0
- | #define HAVE_DECL_BSWAP_16 0
- | /* end confdefs.h. */
- | #if HAVE_BYTESWAP_H
- | #include <byteswap.h>
- | #endif
- |
- | int
- | main ()
- | {
- | #ifndef bswap_32
- | #ifdef __cplusplus
- | (void) bswap_32;
- | #else
- | (void) bswap_32;
- | #endif
- | #endif
- |
- | ;
- | return 0;
- | }
- configure:24333: result: no
- configure:24346: checking whether bswap_64 is declared
- configure:24346: g++ -std=c++11 -c -g -O2 -DHAVE_BUILD_INFO -D__STDC_FORMAT_MACROS -I/usr/local/opt/berkeley-db@4/include -DMAC_OSX conftest.cpp >&5
- conftest.cpp:64:10: error: use of undeclared identifier 'bswap_64'
- (void) bswap_64;
- ^
- 1 error generated.
- configure:24346: $? = 1
- configure: failed program was:
- | /* confdefs.h */
- | #define PACKAGE_NAME "Bitcoin Core"
- | #define PACKAGE_TARNAME "bitcoin"
- | #define PACKAGE_VERSION "0.18.99"
- | #define PACKAGE_STRING "Bitcoin Core 0.18.99"
- | #define PACKAGE_BUGREPORT "https://github.com/bitcoin/bitcoin/issues"
- | #define PACKAGE_URL "https://bitcoincore.org/"
- | #define HAVE_CXX11 1
- | #define STDC_HEADERS 1
- | #define HAVE_SYS_TYPES_H 1
- | #define HAVE_SYS_STAT_H 1
- | #define HAVE_STDLIB_H 1
- | #define HAVE_STRING_H 1
- | #define HAVE_MEMORY_H 1
- | #define HAVE_STRINGS_H 1
- | #define HAVE_INTTYPES_H 1
- | #define HAVE_STDINT_H 1
- | #define HAVE_UNISTD_H 1
- | #define HAVE_DLFCN_H 1
- | #define LT_OBJDIR ".libs/"
- | #define USE_ASM 1
- | #define ENABLE_SSE41 1
- | #define ENABLE_AVX2 1
- | #define ENABLE_SHANI 1
- | #define HAVE_PTHREAD_PRIO_INHERIT 1
- | #define HAVE_PTHREAD 1
- | #define HAVE_DECL_STRERROR_R 1
- | #define HAVE_STRERROR_R 1
- | #define HAVE_STDIO_H 1
- | #define HAVE_STDLIB_H 1
- | #define HAVE_UNISTD_H 1
- | #define HAVE_STRINGS_H 1
- | #define HAVE_SYS_TYPES_H 1
- | #define HAVE_SYS_STAT_H 1
- | #define HAVE_SYS_SELECT_H 1
- | #define HAVE_DECL_GETIFADDRS 1
- | #define HAVE_DECL_FREEIFADDRS 1
- | #define HAVE_DECL_STRNLEN 1
- | #define HAVE_DECL_DAEMON 1
- | #define HAVE_DECL_LE16TOH 0
- | #define HAVE_DECL_LE32TOH 0
- | #define HAVE_DECL_LE64TOH 0
- | #define HAVE_DECL_HTOLE16 0
- | #define HAVE_DECL_HTOLE32 0
- | #define HAVE_DECL_HTOLE64 0
- | #define HAVE_DECL_BE16TOH 0
- | #define HAVE_DECL_BE32TOH 0
- | #define HAVE_DECL_BE64TOH 0
- | #define HAVE_DECL_HTOBE16 0
- | #define HAVE_DECL_HTOBE32 0
- | #define HAVE_DECL_HTOBE64 0
- | #define HAVE_DECL_BSWAP_16 0
- | #define HAVE_DECL_BSWAP_32 0
- | /* end confdefs.h. */
- | #if HAVE_BYTESWAP_H
- | #include <byteswap.h>
- | #endif
- |
- | int
- | main ()
- | {
- | #ifndef bswap_64
- | #ifdef __cplusplus
- | (void) bswap_64;
- | #else
- | (void) bswap_64;
- | #endif
- | #endif
- |
- | ;
- | return 0;
- | }
- configure:24346: result: no
- configure:24361: checking whether __builtin_clz is declared
- configure:24361: g++ -std=c++11 -c -g -O2 -DHAVE_BUILD_INFO -D__STDC_FORMAT_MACROS -I/usr/local/opt/berkeley-db@4/include -DMAC_OSX conftest.cpp >&5
- conftest.cpp:94:10: error: builtin functions must be directly called
- (void) __builtin_clz;
- ^
- 1 error generated.
- configure:24361: $? = 1
- configure: failed program was:
- | /* confdefs.h */
- | #define PACKAGE_NAME "Bitcoin Core"
- | #define PACKAGE_TARNAME "bitcoin"
- | #define PACKAGE_VERSION "0.18.99"
- | #define PACKAGE_STRING "Bitcoin Core 0.18.99"
- | #define PACKAGE_BUGREPORT "https://github.com/bitcoin/bitcoin/issues"
- | #define PACKAGE_URL "https://bitcoincore.org/"
- | #define HAVE_CXX11 1
- | #define STDC_HEADERS 1
- | #define HAVE_SYS_TYPES_H 1
- | #define HAVE_SYS_STAT_H 1
- | #define HAVE_STDLIB_H 1
- | #define HAVE_STRING_H 1
- | #define HAVE_MEMORY_H 1
- | #define HAVE_STRINGS_H 1
- | #define HAVE_INTTYPES_H 1
- | #define HAVE_STDINT_H 1
- | #define HAVE_UNISTD_H 1
- | #define HAVE_DLFCN_H 1
- | #define LT_OBJDIR ".libs/"
- | #define USE_ASM 1
- | #define ENABLE_SSE41 1
- | #define ENABLE_AVX2 1
- | #define ENABLE_SHANI 1
- | #define HAVE_PTHREAD_PRIO_INHERIT 1
- | #define HAVE_PTHREAD 1
- | #define HAVE_DECL_STRERROR_R 1
- | #define HAVE_STRERROR_R 1
- | #define HAVE_STDIO_H 1
- | #define HAVE_STDLIB_H 1
- | #define HAVE_UNISTD_H 1
- | #define HAVE_STRINGS_H 1
- | #define HAVE_SYS_TYPES_H 1
- | #define HAVE_SYS_STAT_H 1
- | #define HAVE_SYS_SELECT_H 1
- | #define HAVE_DECL_GETIFADDRS 1
- | #define HAVE_DECL_FREEIFADDRS 1
- | #define HAVE_DECL_STRNLEN 1
- | #define HAVE_DECL_DAEMON 1
- | #define HAVE_DECL_LE16TOH 0
- | #define HAVE_DECL_LE32TOH 0
- | #define HAVE_DECL_LE64TOH 0
- | #define HAVE_DECL_HTOLE16 0
- | #define HAVE_DECL_HTOLE32 0
- | #define HAVE_DECL_HTOLE64 0
- | #define HAVE_DECL_BE16TOH 0
- | #define HAVE_DECL_BE32TOH 0
- | #define HAVE_DECL_BE64TOH 0
- | #define HAVE_DECL_HTOBE16 0
- | #define HAVE_DECL_HTOBE32 0
- | #define HAVE_DECL_HTOBE64 0
- | #define HAVE_DECL_BSWAP_16 0
- | #define HAVE_DECL_BSWAP_32 0
- | #define HAVE_DECL_BSWAP_64 0
- | /* end confdefs.h. */
- | #include <stdio.h>
- | #ifdef HAVE_SYS_TYPES_H
- | # include <sys/types.h>
- | #endif
- | #ifdef HAVE_SYS_STAT_H
- | # include <sys/stat.h>
- | #endif
- | #ifdef STDC_HEADERS
- | # include <stdlib.h>
- | # include <stddef.h>
- | #else
- | # ifdef HAVE_STDLIB_H
- | # include <stdlib.h>
- | # endif
- | #endif
- | #ifdef HAVE_STRING_H
- | # if !defined STDC_HEADERS && defined HAVE_MEMORY_H
- | # include <memory.h>
- | # endif
- | # include <string.h>
- | #endif
- | #ifdef HAVE_STRINGS_H
- | # include <strings.h>
- | #endif
- | #ifdef HAVE_INTTYPES_H
- | # include <inttypes.h>
- | #endif
- | #ifdef HAVE_STDINT_H
- | # include <stdint.h>
- | #endif
- | #ifdef HAVE_UNISTD_H
- | # include <unistd.h>
- | #endif
- | int
- | main ()
- | {
- | #ifndef __builtin_clz
- | #ifdef __cplusplus
- | (void) __builtin_clz;
- | #else
- | (void) __builtin_clz;
- | #endif
- | #endif
- |
- | ;
- | return 0;
- | }
- configure:24361: result: no
- configure:24371: checking whether __builtin_clzl is declared
- configure:24371: g++ -std=c++11 -c -g -O2 -DHAVE_BUILD_INFO -D__STDC_FORMAT_MACROS -I/usr/local/opt/berkeley-db@4/include -DMAC_OSX conftest.cpp >&5
- conftest.cpp:95:10: error: builtin functions must be directly called
- (void) __builtin_clzl;
- ^
- 1 error generated.
- configure:24371: $? = 1
- configure: failed program was:
- | /* confdefs.h */
- | #define PACKAGE_NAME "Bitcoin Core"
- | #define PACKAGE_TARNAME "bitcoin"
- | #define PACKAGE_VERSION "0.18.99"
- | #define PACKAGE_STRING "Bitcoin Core 0.18.99"
- | #define PACKAGE_BUGREPORT "https://github.com/bitcoin/bitcoin/issues"
- | #define PACKAGE_URL "https://bitcoincore.org/"
- | #define HAVE_CXX11 1
- | #define STDC_HEADERS 1
- | #define HAVE_SYS_TYPES_H 1
- | #define HAVE_SYS_STAT_H 1
- | #define HAVE_STDLIB_H 1
- | #define HAVE_STRING_H 1
- | #define HAVE_MEMORY_H 1
- | #define HAVE_STRINGS_H 1
- | #define HAVE_INTTYPES_H 1
- | #define HAVE_STDINT_H 1
- | #define HAVE_UNISTD_H 1
- | #define HAVE_DLFCN_H 1
- | #define LT_OBJDIR ".libs/"
- | #define USE_ASM 1
- | #define ENABLE_SSE41 1
- | #define ENABLE_AVX2 1
- | #define ENABLE_SHANI 1
- | #define HAVE_PTHREAD_PRIO_INHERIT 1
- | #define HAVE_PTHREAD 1
- | #define HAVE_DECL_STRERROR_R 1
- | #define HAVE_STRERROR_R 1
- | #define HAVE_STDIO_H 1
- | #define HAVE_STDLIB_H 1
- | #define HAVE_UNISTD_H 1
- | #define HAVE_STRINGS_H 1
- | #define HAVE_SYS_TYPES_H 1
- | #define HAVE_SYS_STAT_H 1
- | #define HAVE_SYS_SELECT_H 1
- | #define HAVE_DECL_GETIFADDRS 1
- | #define HAVE_DECL_FREEIFADDRS 1
- | #define HAVE_DECL_STRNLEN 1
- | #define HAVE_DECL_DAEMON 1
- | #define HAVE_DECL_LE16TOH 0
- | #define HAVE_DECL_LE32TOH 0
- | #define HAVE_DECL_LE64TOH 0
- | #define HAVE_DECL_HTOLE16 0
- | #define HAVE_DECL_HTOLE32 0
- | #define HAVE_DECL_HTOLE64 0
- | #define HAVE_DECL_BE16TOH 0
- | #define HAVE_DECL_BE32TOH 0
- | #define HAVE_DECL_BE64TOH 0
- | #define HAVE_DECL_HTOBE16 0
- | #define HAVE_DECL_HTOBE32 0
- | #define HAVE_DECL_HTOBE64 0
- | #define HAVE_DECL_BSWAP_16 0
- | #define HAVE_DECL_BSWAP_32 0
- | #define HAVE_DECL_BSWAP_64 0
- | #define HAVE_DECL___BUILTIN_CLZ 0
- | /* end confdefs.h. */
- | #include <stdio.h>
- | #ifdef HAVE_SYS_TYPES_H
- | # include <sys/types.h>
- | #endif
- | #ifdef HAVE_SYS_STAT_H
- | # include <sys/stat.h>
- | #endif
- | #ifdef STDC_HEADERS
- | # include <stdlib.h>
- | # include <stddef.h>
- | #else
- | # ifdef HAVE_STDLIB_H
- | # include <stdlib.h>
- | # endif
- | #endif
- | #ifdef HAVE_STRING_H
- | # if !defined STDC_HEADERS && defined HAVE_MEMORY_H
- | # include <memory.h>
- | # endif
- | # include <string.h>
- | #endif
- | #ifdef HAVE_STRINGS_H
- | # include <strings.h>
- | #endif
- | #ifdef HAVE_INTTYPES_H
- | # include <inttypes.h>
- | #endif
- | #ifdef HAVE_STDINT_H
- | # include <stdint.h>
- | #endif
- | #ifdef HAVE_UNISTD_H
- | # include <unistd.h>
- | #endif
- | int
- | main ()
- | {
- | #ifndef __builtin_clzl
- | #ifdef __cplusplus
- | (void) __builtin_clzl;
- | #else
- | (void) __builtin_clzl;
- | #endif
- | #endif
- |
- | ;
- | return 0;
- | }
- configure:24371: result: no
- configure:24381: checking whether __builtin_clzll is declared
- configure:24381: g++ -std=c++11 -c -g -O2 -DHAVE_BUILD_INFO -D__STDC_FORMAT_MACROS -I/usr/local/opt/berkeley-db@4/include -DMAC_OSX conftest.cpp >&5
- conftest.cpp:96:10: error: builtin functions must be directly called
- (void) __builtin_clzll;
- ^
- 1 error generated.
- configure:24381: $? = 1
- configure: failed program was:
- | /* confdefs.h */
- | #define PACKAGE_NAME "Bitcoin Core"
- | #define PACKAGE_TARNAME "bitcoin"
- | #define PACKAGE_VERSION "0.18.99"
- | #define PACKAGE_STRING "Bitcoin Core 0.18.99"
- | #define PACKAGE_BUGREPORT "https://github.com/bitcoin/bitcoin/issues"
- | #define PACKAGE_URL "https://bitcoincore.org/"
- | #define HAVE_CXX11 1
- | #define STDC_HEADERS 1
- | #define HAVE_SYS_TYPES_H 1
- | #define HAVE_SYS_STAT_H 1
- | #define HAVE_STDLIB_H 1
- | #define HAVE_STRING_H 1
- | #define HAVE_MEMORY_H 1
- | #define HAVE_STRINGS_H 1
- | #define HAVE_INTTYPES_H 1
- | #define HAVE_STDINT_H 1
- | #define HAVE_UNISTD_H 1
- | #define HAVE_DLFCN_H 1
- | #define LT_OBJDIR ".libs/"
- | #define USE_ASM 1
- | #define ENABLE_SSE41 1
- | #define ENABLE_AVX2 1
- | #define ENABLE_SHANI 1
- | #define HAVE_PTHREAD_PRIO_INHERIT 1
- | #define HAVE_PTHREAD 1
- | #define HAVE_DECL_STRERROR_R 1
- | #define HAVE_STRERROR_R 1
- | #define HAVE_STDIO_H 1
- | #define HAVE_STDLIB_H 1
- | #define HAVE_UNISTD_H 1
- | #define HAVE_STRINGS_H 1
- | #define HAVE_SYS_TYPES_H 1
- | #define HAVE_SYS_STAT_H 1
- | #define HAVE_SYS_SELECT_H 1
- | #define HAVE_DECL_GETIFADDRS 1
- | #define HAVE_DECL_FREEIFADDRS 1
- | #define HAVE_DECL_STRNLEN 1
- | #define HAVE_DECL_DAEMON 1
- | #define HAVE_DECL_LE16TOH 0
- | #define HAVE_DECL_LE32TOH 0
- | #define HAVE_DECL_LE64TOH 0
- | #define HAVE_DECL_HTOLE16 0
- | #define HAVE_DECL_HTOLE32 0
- | #define HAVE_DECL_HTOLE64 0
- | #define HAVE_DECL_BE16TOH 0
- | #define HAVE_DECL_BE32TOH 0
- | #define HAVE_DECL_BE64TOH 0
- | #define HAVE_DECL_HTOBE16 0
- | #define HAVE_DECL_HTOBE32 0
- | #define HAVE_DECL_HTOBE64 0
- | #define HAVE_DECL_BSWAP_16 0
- | #define HAVE_DECL_BSWAP_32 0
- | #define HAVE_DECL_BSWAP_64 0
- | #define HAVE_DECL___BUILTIN_CLZ 0
- | #define HAVE_DECL___BUILTIN_CLZL 0
- | /* end confdefs.h. */
- | #include <stdio.h>
- | #ifdef HAVE_SYS_TYPES_H
- | # include <sys/types.h>
- | #endif
- | #ifdef HAVE_SYS_STAT_H
- | # include <sys/stat.h>
- | #endif
- | #ifdef STDC_HEADERS
- | # include <stdlib.h>
- | # include <stddef.h>
- | #else
- | # ifdef HAVE_STDLIB_H
- | # include <stdlib.h>
- | # endif
- | #endif
- | #ifdef HAVE_STRING_H
- | # if !defined STDC_HEADERS && defined HAVE_MEMORY_H
- | # include <memory.h>
- | # endif
- | # include <string.h>
- | #endif
- | #ifdef HAVE_STRINGS_H
- | # include <strings.h>
- | #endif
- | #ifdef HAVE_INTTYPES_H
- | # include <inttypes.h>
- | #endif
- | #ifdef HAVE_STDINT_H
- | # include <stdint.h>
- | #endif
- | #ifdef HAVE_UNISTD_H
- | # include <unistd.h>
- | #endif
- | int
- | main ()
- | {
- | #ifndef __builtin_clzll
- | #ifdef __cplusplus
- | (void) __builtin_clzll;
- | #else
- | (void) __builtin_clzll;
- | #endif
- | #endif
- |
- | ;
- | return 0;
- | }
- configure:24381: result: no
- configure:24393: checking for getmemoryinfo
- configure:24406: g++ -std=c++11 -c -g -O2 -DHAVE_BUILD_INFO -D__STDC_FORMAT_MACROS -I/usr/local/opt/berkeley-db@4/include -DMAC_OSX conftest.cpp >&5
- conftest.cpp:59:10: fatal error: 'malloc.h' file not found
- #include <malloc.h>
- ^~~~~~~~~~
- 1 error generated.
- configure:24406: $? = 1
- configure: failed program was:
- | /* confdefs.h */
- | #define PACKAGE_NAME "Bitcoin Core"
- | #define PACKAGE_TARNAME "bitcoin"
- | #define PACKAGE_VERSION "0.18.99"
- | #define PACKAGE_STRING "Bitcoin Core 0.18.99"
- | #define PACKAGE_BUGREPORT "https://github.com/bitcoin/bitcoin/issues"
- | #define PACKAGE_URL "https://bitcoincore.org/"
- | #define HAVE_CXX11 1
- | #define STDC_HEADERS 1
- | #define HAVE_SYS_TYPES_H 1
- | #define HAVE_SYS_STAT_H 1
- | #define HAVE_STDLIB_H 1
- | #define HAVE_STRING_H 1
- | #define HAVE_MEMORY_H 1
- | #define HAVE_STRINGS_H 1
- | #define HAVE_INTTYPES_H 1
- | #define HAVE_STDINT_H 1
- | #define HAVE_UNISTD_H 1
- | #define HAVE_DLFCN_H 1
- | #define LT_OBJDIR ".libs/"
- | #define USE_ASM 1
- | #define ENABLE_SSE41 1
- | #define ENABLE_AVX2 1
- | #define ENABLE_SHANI 1
- | #define HAVE_PTHREAD_PRIO_INHERIT 1
- | #define HAVE_PTHREAD 1
- | #define HAVE_DECL_STRERROR_R 1
- | #define HAVE_STRERROR_R 1
- | #define HAVE_STDIO_H 1
- | #define HAVE_STDLIB_H 1
- | #define HAVE_UNISTD_H 1
- | #define HAVE_STRINGS_H 1
- | #define HAVE_SYS_TYPES_H 1
- | #define HAVE_SYS_STAT_H 1
- | #define HAVE_SYS_SELECT_H 1
- | #define HAVE_DECL_GETIFADDRS 1
- | #define HAVE_DECL_FREEIFADDRS 1
- | #define HAVE_DECL_STRNLEN 1
- | #define HAVE_DECL_DAEMON 1
- | #define HAVE_DECL_LE16TOH 0
- | #define HAVE_DECL_LE32TOH 0
- | #define HAVE_DECL_LE64TOH 0
- | #define HAVE_DECL_HTOLE16 0
- | #define HAVE_DECL_HTOLE32 0
- | #define HAVE_DECL_HTOLE64 0
- | #define HAVE_DECL_BE16TOH 0
- | #define HAVE_DECL_BE32TOH 0
- | #define HAVE_DECL_BE64TOH 0
- | #define HAVE_DECL_HTOBE16 0
- | #define HAVE_DECL_HTOBE32 0
- | #define HAVE_DECL_HTOBE64 0
- | #define HAVE_DECL_BSWAP_16 0
- | #define HAVE_DECL_BSWAP_32 0
- | #define HAVE_DECL_BSWAP_64 0
- | #define HAVE_DECL___BUILTIN_CLZ 0
- | #define HAVE_DECL___BUILTIN_CLZL 0
- | #define HAVE_DECL___BUILTIN_CLZLL 0
- | /* end confdefs.h. */
- | #include <malloc.h>
- | int
- | main ()
- | {
- | int f = malloc_info(0, NULL);
- | ;
- | return 0;
- | }
- configure:24412: result: no
- configure:24418: checking for mallopt M_ARENA_MAX
- configure:24431: g++ -std=c++11 -c -g -O2 -DHAVE_BUILD_INFO -D__STDC_FORMAT_MACROS -I/usr/local/opt/berkeley-db@4/include -DMAC_OSX conftest.cpp >&5
- conftest.cpp:59:10: fatal error: 'malloc.h' file not found
- #include <malloc.h>
- ^~~~~~~~~~
- 1 error generated.
- configure:24431: $? = 1
- configure: failed program was:
- | /* confdefs.h */
- | #define PACKAGE_NAME "Bitcoin Core"
- | #define PACKAGE_TARNAME "bitcoin"
- | #define PACKAGE_VERSION "0.18.99"
- | #define PACKAGE_STRING "Bitcoin Core 0.18.99"
- | #define PACKAGE_BUGREPORT "https://github.com/bitcoin/bitcoin/issues"
- | #define PACKAGE_URL "https://bitcoincore.org/"
- | #define HAVE_CXX11 1
- | #define STDC_HEADERS 1
- | #define HAVE_SYS_TYPES_H 1
- | #define HAVE_SYS_STAT_H 1
- | #define HAVE_STDLIB_H 1
- | #define HAVE_STRING_H 1
- | #define HAVE_MEMORY_H 1
- | #define HAVE_STRINGS_H 1
- | #define HAVE_INTTYPES_H 1
- | #define HAVE_STDINT_H 1
- | #define HAVE_UNISTD_H 1
- | #define HAVE_DLFCN_H 1
- | #define LT_OBJDIR ".libs/"
- | #define USE_ASM 1
- | #define ENABLE_SSE41 1
- | #define ENABLE_AVX2 1
- | #define ENABLE_SHANI 1
- | #define HAVE_PTHREAD_PRIO_INHERIT 1
- | #define HAVE_PTHREAD 1
- | #define HAVE_DECL_STRERROR_R 1
- | #define HAVE_STRERROR_R 1
- | #define HAVE_STDIO_H 1
- | #define HAVE_STDLIB_H 1
- | #define HAVE_UNISTD_H 1
- | #define HAVE_STRINGS_H 1
- | #define HAVE_SYS_TYPES_H 1
- | #define HAVE_SYS_STAT_H 1
- | #define HAVE_SYS_SELECT_H 1
- | #define HAVE_DECL_GETIFADDRS 1
- | #define HAVE_DECL_FREEIFADDRS 1
- | #define HAVE_DECL_STRNLEN 1
- | #define HAVE_DECL_DAEMON 1
- | #define HAVE_DECL_LE16TOH 0
- | #define HAVE_DECL_LE32TOH 0
- | #define HAVE_DECL_LE64TOH 0
- | #define HAVE_DECL_HTOLE16 0
- | #define HAVE_DECL_HTOLE32 0
- | #define HAVE_DECL_HTOLE64 0
- | #define HAVE_DECL_BE16TOH 0
- | #define HAVE_DECL_BE32TOH 0
- | #define HAVE_DECL_BE64TOH 0
- | #define HAVE_DECL_HTOBE16 0
- | #define HAVE_DECL_HTOBE32 0
- | #define HAVE_DECL_HTOBE64 0
- | #define HAVE_DECL_BSWAP_16 0
- | #define HAVE_DECL_BSWAP_32 0
- | #define HAVE_DECL_BSWAP_64 0
- | #define HAVE_DECL___BUILTIN_CLZ 0
- | #define HAVE_DECL___BUILTIN_CLZL 0
- | #define HAVE_DECL___BUILTIN_CLZLL 0
- | /* end confdefs.h. */
- | #include <malloc.h>
- | int
- | main ()
- | {
- | mallopt(M_ARENA_MAX, 1);
- | ;
- | return 0;
- | }
- configure:24437: result: no
- configure:24443: checking for visibility attribute
- configure:24452: g++ -std=c++11 -o conftest -g -O2 -DHAVE_BUILD_INFO -D__STDC_FORMAT_MACROS -I/usr/local/opt/berkeley-db@4/include -DMAC_OSX -Wl,-headerpad_max_install_names -Wl,-dead_strip conftest.cpp -L/usr/local/opt/berkeley-db@4/lib >&5
- configure:24452: $? = 0
- configure:24457: result: yes
- configure:24476: checking for thread_local support
- configure:24490: g++ -std=c++11 -o conftest -g -O2 -DHAVE_BUILD_INFO -D__STDC_FORMAT_MACROS -I/usr/local/opt/berkeley-db@4/include -DMAC_OSX -Wl,-headerpad_max_install_names -Wl,-dead_strip -pthread conftest.cpp -L/usr/local/opt/berkeley-db@4/lib >&5
- configure:24490: $? = 0
- configure:24503: result: no
- configure:24534: checking for Linux getrandom syscall
- configure:24549: g++ -std=c++11 -c -g -O2 -DHAVE_BUILD_INFO -D__STDC_FORMAT_MACROS -I/usr/local/opt/berkeley-db@4/include -DMAC_OSX conftest.cpp >&5
- conftest.cpp:62:12: fatal error: 'linux/random.h' file not found
- #include <linux/random.h>
- ^~~~~~~~~~~~~~~~
- 1 error generated.
- configure:24549: $? = 1
- configure: failed program was:
- | /* confdefs.h */
- | #define PACKAGE_NAME "Bitcoin Core"
- | #define PACKAGE_TARNAME "bitcoin"
- | #define PACKAGE_VERSION "0.18.99"
- | #define PACKAGE_STRING "Bitcoin Core 0.18.99"
- | #define PACKAGE_BUGREPORT "https://github.com/bitcoin/bitcoin/issues"
- | #define PACKAGE_URL "https://bitcoincore.org/"
- | #define HAVE_CXX11 1
- | #define STDC_HEADERS 1
- | #define HAVE_SYS_TYPES_H 1
- | #define HAVE_SYS_STAT_H 1
- | #define HAVE_STDLIB_H 1
- | #define HAVE_STRING_H 1
- | #define HAVE_MEMORY_H 1
- | #define HAVE_STRINGS_H 1
- | #define HAVE_INTTYPES_H 1
- | #define HAVE_STDINT_H 1
- | #define HAVE_UNISTD_H 1
- | #define HAVE_DLFCN_H 1
- | #define LT_OBJDIR ".libs/"
- | #define USE_ASM 1
- | #define ENABLE_SSE41 1
- | #define ENABLE_AVX2 1
- | #define ENABLE_SHANI 1
- | #define HAVE_PTHREAD_PRIO_INHERIT 1
- | #define HAVE_PTHREAD 1
- | #define HAVE_DECL_STRERROR_R 1
- | #define HAVE_STRERROR_R 1
- | #define HAVE_STDIO_H 1
- | #define HAVE_STDLIB_H 1
- | #define HAVE_UNISTD_H 1
- | #define HAVE_STRINGS_H 1
- | #define HAVE_SYS_TYPES_H 1
- | #define HAVE_SYS_STAT_H 1
- | #define HAVE_SYS_SELECT_H 1
- | #define HAVE_DECL_GETIFADDRS 1
- | #define HAVE_DECL_FREEIFADDRS 1
- | #define HAVE_DECL_STRNLEN 1
- | #define HAVE_DECL_DAEMON 1
- | #define HAVE_DECL_LE16TOH 0
- | #define HAVE_DECL_LE32TOH 0
- | #define HAVE_DECL_LE64TOH 0
- | #define HAVE_DECL_HTOLE16 0
- | #define HAVE_DECL_HTOLE32 0
- | #define HAVE_DECL_HTOLE64 0
- | #define HAVE_DECL_BE16TOH 0
- | #define HAVE_DECL_BE32TOH 0
- | #define HAVE_DECL_BE64TOH 0
- | #define HAVE_DECL_HTOBE16 0
- | #define HAVE_DECL_HTOBE32 0
- | #define HAVE_DECL_HTOBE64 0
- | #define HAVE_DECL_BSWAP_16 0
- | #define HAVE_DECL_BSWAP_32 0
- | #define HAVE_DECL_BSWAP_64 0
- | #define HAVE_DECL___BUILTIN_CLZ 0
- | #define HAVE_DECL___BUILTIN_CLZL 0
- | #define HAVE_DECL___BUILTIN_CLZLL 0
- | #define HAVE_VISIBILITY_ATTRIBUTE 1
- | /* end confdefs.h. */
- | #include <unistd.h>
- | #include <sys/syscall.h>
- | #include <linux/random.h>
- | int
- | main ()
- | {
- | syscall(SYS_getrandom, nullptr, 32, 0);
- | ;
- | return 0;
- | }
- configure:24555: result: no
- configure:24561: checking for getentropy
- configure:24574: g++ -std=c++11 -c -g -O2 -DHAVE_BUILD_INFO -D__STDC_FORMAT_MACROS -I/usr/local/opt/berkeley-db@4/include -DMAC_OSX conftest.cpp >&5
- conftest.cpp:64:2: error: use of undeclared identifier 'getentropy'
- getentropy(nullptr, 32)
- ^
- 1 error generated.
- configure:24574: $? = 1
- configure: failed program was:
- | /* confdefs.h */
- | #define PACKAGE_NAME "Bitcoin Core"
- | #define PACKAGE_TARNAME "bitcoin"
- | #define PACKAGE_VERSION "0.18.99"
- | #define PACKAGE_STRING "Bitcoin Core 0.18.99"
- | #define PACKAGE_BUGREPORT "https://github.com/bitcoin/bitcoin/issues"
- | #define PACKAGE_URL "https://bitcoincore.org/"
- | #define HAVE_CXX11 1
- | #define STDC_HEADERS 1
- | #define HAVE_SYS_TYPES_H 1
- | #define HAVE_SYS_STAT_H 1
- | #define HAVE_STDLIB_H 1
- | #define HAVE_STRING_H 1
- | #define HAVE_MEMORY_H 1
- | #define HAVE_STRINGS_H 1
- | #define HAVE_INTTYPES_H 1
- | #define HAVE_STDINT_H 1
- | #define HAVE_UNISTD_H 1
- | #define HAVE_DLFCN_H 1
- | #define LT_OBJDIR ".libs/"
- | #define USE_ASM 1
- | #define ENABLE_SSE41 1
- | #define ENABLE_AVX2 1
- | #define ENABLE_SHANI 1
- | #define HAVE_PTHREAD_PRIO_INHERIT 1
- | #define HAVE_PTHREAD 1
- | #define HAVE_DECL_STRERROR_R 1
- | #define HAVE_STRERROR_R 1
- | #define HAVE_STDIO_H 1
- | #define HAVE_STDLIB_H 1
- | #define HAVE_UNISTD_H 1
- | #define HAVE_STRINGS_H 1
- | #define HAVE_SYS_TYPES_H 1
- | #define HAVE_SYS_STAT_H 1
- | #define HAVE_SYS_SELECT_H 1
- | #define HAVE_DECL_GETIFADDRS 1
- | #define HAVE_DECL_FREEIFADDRS 1
- | #define HAVE_DECL_STRNLEN 1
- | #define HAVE_DECL_DAEMON 1
- | #define HAVE_DECL_LE16TOH 0
- | #define HAVE_DECL_LE32TOH 0
- | #define HAVE_DECL_LE64TOH 0
- | #define HAVE_DECL_HTOLE16 0
- | #define HAVE_DECL_HTOLE32 0
- | #define HAVE_DECL_HTOLE64 0
- | #define HAVE_DECL_BE16TOH 0
- | #define HAVE_DECL_BE32TOH 0
- | #define HAVE_DECL_BE64TOH 0
- | #define HAVE_DECL_HTOBE16 0
- | #define HAVE_DECL_HTOBE32 0
- | #define HAVE_DECL_HTOBE64 0
- | #define HAVE_DECL_BSWAP_16 0
- | #define HAVE_DECL_BSWAP_32 0
- | #define HAVE_DECL_BSWAP_64 0
- | #define HAVE_DECL___BUILTIN_CLZ 0
- | #define HAVE_DECL___BUILTIN_CLZL 0
- | #define HAVE_DECL___BUILTIN_CLZLL 0
- | #define HAVE_VISIBILITY_ATTRIBUTE 1
- | /* end confdefs.h. */
- | #include <unistd.h>
- | int
- | main ()
- | {
- | getentropy(nullptr, 32)
- | ;
- | return 0;
- | }
- configure:24580: result: no
- configure:24586: checking for getentropy via random.h
- configure:24600: g++ -std=c++11 -c -g -O2 -DHAVE_BUILD_INFO -D__STDC_FORMAT_MACROS -I/usr/local/opt/berkeley-db@4/include -DMAC_OSX conftest.cpp >&5
- configure:24600: $? = 0
- configure:24601: result: yes
- configure:24612: checking for sysctl KERN_ARND
- configure:24627: g++ -std=c++11 -c -g -O2 -DHAVE_BUILD_INFO -D__STDC_FORMAT_MACROS -I/usr/local/opt/berkeley-db@4/include -DMAC_OSX conftest.cpp >&5
- conftest.cpp:66:40: error: use of undeclared identifier 'KERN_ARND'
- static const int name[2] = {CTL_KERN, KERN_ARND};
- ^
- conftest.cpp:67:5: error: no matching function for call to 'sysctl'
- sysctl(name, 2, nullptr, nullptr, nullptr, 0);
- ^~~~~~
- /Applications/Xcode.app/Contents/Developer/Platforms/MacOSX.platform/Developer/SDKs/MacOSX10.14.sdk/usr/include/sys/sysctl.h:759:9: note: candidate function not viable: no known conversion from 'const int [2]' to 'int *' for 1st argument
- int sysctl(int *, u_int, void *, size_t *, void *, size_t);
- ^
- 2 errors generated.
- configure:24627: $? = 1
- configure: failed program was:
- | /* confdefs.h */
- | #define PACKAGE_NAME "Bitcoin Core"
- | #define PACKAGE_TARNAME "bitcoin"
- | #define PACKAGE_VERSION "0.18.99"
- | #define PACKAGE_STRING "Bitcoin Core 0.18.99"
- | #define PACKAGE_BUGREPORT "https://github.com/bitcoin/bitcoin/issues"
- | #define PACKAGE_URL "https://bitcoincore.org/"
- | #define HAVE_CXX11 1
- | #define STDC_HEADERS 1
- | #define HAVE_SYS_TYPES_H 1
- | #define HAVE_SYS_STAT_H 1
- | #define HAVE_STDLIB_H 1
- | #define HAVE_STRING_H 1
- | #define HAVE_MEMORY_H 1
- | #define HAVE_STRINGS_H 1
- | #define HAVE_INTTYPES_H 1
- | #define HAVE_STDINT_H 1
- | #define HAVE_UNISTD_H 1
- | #define HAVE_DLFCN_H 1
- | #define LT_OBJDIR ".libs/"
- | #define USE_ASM 1
- | #define ENABLE_SSE41 1
- | #define ENABLE_AVX2 1
- | #define ENABLE_SHANI 1
- | #define HAVE_PTHREAD_PRIO_INHERIT 1
- | #define HAVE_PTHREAD 1
- | #define HAVE_DECL_STRERROR_R 1
- | #define HAVE_STRERROR_R 1
- | #define HAVE_STDIO_H 1
- | #define HAVE_STDLIB_H 1
- | #define HAVE_UNISTD_H 1
- | #define HAVE_STRINGS_H 1
- | #define HAVE_SYS_TYPES_H 1
- | #define HAVE_SYS_STAT_H 1
- | #define HAVE_SYS_SELECT_H 1
- | #define HAVE_DECL_GETIFADDRS 1
- | #define HAVE_DECL_FREEIFADDRS 1
- | #define HAVE_DECL_STRNLEN 1
- | #define HAVE_DECL_DAEMON 1
- | #define HAVE_DECL_LE16TOH 0
- | #define HAVE_DECL_LE32TOH 0
- | #define HAVE_DECL_LE64TOH 0
- | #define HAVE_DECL_HTOLE16 0
- | #define HAVE_DECL_HTOLE32 0
- | #define HAVE_DECL_HTOLE64 0
- | #define HAVE_DECL_BE16TOH 0
- | #define HAVE_DECL_BE32TOH 0
- | #define HAVE_DECL_BE64TOH 0
- | #define HAVE_DECL_HTOBE16 0
- | #define HAVE_DECL_HTOBE32 0
- | #define HAVE_DECL_HTOBE64 0
- | #define HAVE_DECL_BSWAP_16 0
- | #define HAVE_DECL_BSWAP_32 0
- | #define HAVE_DECL_BSWAP_64 0
- | #define HAVE_DECL___BUILTIN_CLZ 0
- | #define HAVE_DECL___BUILTIN_CLZL 0
- | #define HAVE_DECL___BUILTIN_CLZLL 0
- | #define HAVE_VISIBILITY_ATTRIBUTE 1
- | #define HAVE_GETENTROPY_RAND 1
- | /* end confdefs.h. */
- | #include <sys/types.h>
- | #include <sys/sysctl.h>
- | int
- | main ()
- | {
- | static const int name[2] = {CTL_KERN, KERN_ARND};
- | sysctl(name, 2, nullptr, nullptr, nullptr, 0);
- | ;
- | return 0;
- | }
- configure:24633: result: no
- configure:24639: checking for if type char equals int8_t
- configure:24653: g++ -std=c++11 -c -g -O2 -DHAVE_BUILD_INFO -D__STDC_FORMAT_MACROS -I/usr/local/opt/berkeley-db@4/include -DMAC_OSX conftest.cpp >&5
- conftest.cpp:66:2: error: static_assert failed due to requirement 'std::is_same<int8_t, char>::value' ""
- static_assert(std::is_same<int8_t, char>::value, "");
- ^ ~~~~~~~~~~~~~~~~~~~~~~~~~~~~~~~~~
- 1 error generated.
- configure:24653: $? = 1
- configure: failed program was:
- | /* confdefs.h */
- | #define PACKAGE_NAME "Bitcoin Core"
- | #define PACKAGE_TARNAME "bitcoin"
- | #define PACKAGE_VERSION "0.18.99"
- | #define PACKAGE_STRING "Bitcoin Core 0.18.99"
- | #define PACKAGE_BUGREPORT "https://github.com/bitcoin/bitcoin/issues"
- | #define PACKAGE_URL "https://bitcoincore.org/"
- | #define HAVE_CXX11 1
- | #define STDC_HEADERS 1
- | #define HAVE_SYS_TYPES_H 1
- | #define HAVE_SYS_STAT_H 1
- | #define HAVE_STDLIB_H 1
- | #define HAVE_STRING_H 1
- | #define HAVE_MEMORY_H 1
- | #define HAVE_STRINGS_H 1
- | #define HAVE_INTTYPES_H 1
- | #define HAVE_STDINT_H 1
- | #define HAVE_UNISTD_H 1
- | #define HAVE_DLFCN_H 1
- | #define LT_OBJDIR ".libs/"
- | #define USE_ASM 1
- | #define ENABLE_SSE41 1
- | #define ENABLE_AVX2 1
- | #define ENABLE_SHANI 1
- | #define HAVE_PTHREAD_PRIO_INHERIT 1
- | #define HAVE_PTHREAD 1
- | #define HAVE_DECL_STRERROR_R 1
- | #define HAVE_STRERROR_R 1
- | #define HAVE_STDIO_H 1
- | #define HAVE_STDLIB_H 1
- | #define HAVE_UNISTD_H 1
- | #define HAVE_STRINGS_H 1
- | #define HAVE_SYS_TYPES_H 1
- | #define HAVE_SYS_STAT_H 1
- | #define HAVE_SYS_SELECT_H 1
- | #define HAVE_DECL_GETIFADDRS 1
- | #define HAVE_DECL_FREEIFADDRS 1
- | #define HAVE_DECL_STRNLEN 1
- | #define HAVE_DECL_DAEMON 1
- | #define HAVE_DECL_LE16TOH 0
- | #define HAVE_DECL_LE32TOH 0
- | #define HAVE_DECL_LE64TOH 0
- | #define HAVE_DECL_HTOLE16 0
- | #define HAVE_DECL_HTOLE32 0
- | #define HAVE_DECL_HTOLE64 0
- | #define HAVE_DECL_BE16TOH 0
- | #define HAVE_DECL_BE32TOH 0
- | #define HAVE_DECL_BE64TOH 0
- | #define HAVE_DECL_HTOBE16 0
- | #define HAVE_DECL_HTOBE32 0
- | #define HAVE_DECL_HTOBE64 0
- | #define HAVE_DECL_BSWAP_16 0
- | #define HAVE_DECL_BSWAP_32 0
- | #define HAVE_DECL_BSWAP_64 0
- | #define HAVE_DECL___BUILTIN_CLZ 0
- | #define HAVE_DECL___BUILTIN_CLZL 0
- | #define HAVE_DECL___BUILTIN_CLZLL 0
- | #define HAVE_VISIBILITY_ATTRIBUTE 1
- | #define HAVE_GETENTROPY_RAND 1
- | /* end confdefs.h. */
- | #include <stdint.h>
- | #include <type_traits>
- | int
- | main ()
- | {
- | static_assert(std::is_same<int8_t, char>::value, "");
- | ;
- | return 0;
- | }
- configure:24659: result: no
- configure:24704: checking for std::system
- configure:24718: g++ -std=c++11 -o conftest -g -O2 -DHAVE_BUILD_INFO -D__STDC_FORMAT_MACROS -I/usr/local/opt/berkeley-db@4/include -DMAC_OSX -Wl,-headerpad_max_install_names -Wl,-dead_strip conftest.cpp -L/usr/local/opt/berkeley-db@4/lib >&5
- configure:24718: $? = 0
- configure:24719: result: yes
- configure:24731: checking for ::_wsystem
- configure:24745: g++ -std=c++11 -o conftest -g -O2 -DHAVE_BUILD_INFO -D__STDC_FORMAT_MACROS -I/usr/local/opt/berkeley-db@4/include -DMAC_OSX -Wl,-headerpad_max_install_names -Wl,-dead_strip conftest.cpp -L/usr/local/opt/berkeley-db@4/lib >&5
- conftest.cpp:66:15: error: no member named '_wsystem' in the global namespace
- int nErr = ::_wsystem("");
- ~~^
- 1 error generated.
- configure:24745: $? = 1
- configure: failed program was:
- | /* confdefs.h */
- | #define PACKAGE_NAME "Bitcoin Core"
- | #define PACKAGE_TARNAME "bitcoin"
- | #define PACKAGE_VERSION "0.18.99"
- | #define PACKAGE_STRING "Bitcoin Core 0.18.99"
- | #define PACKAGE_BUGREPORT "https://github.com/bitcoin/bitcoin/issues"
- | #define PACKAGE_URL "https://bitcoincore.org/"
- | #define HAVE_CXX11 1
- | #define STDC_HEADERS 1
- | #define HAVE_SYS_TYPES_H 1
- | #define HAVE_SYS_STAT_H 1
- | #define HAVE_STDLIB_H 1
- | #define HAVE_STRING_H 1
- | #define HAVE_MEMORY_H 1
- | #define HAVE_STRINGS_H 1
- | #define HAVE_INTTYPES_H 1
- | #define HAVE_STDINT_H 1
- | #define HAVE_UNISTD_H 1
- | #define HAVE_DLFCN_H 1
- | #define LT_OBJDIR ".libs/"
- | #define USE_ASM 1
- | #define ENABLE_SSE41 1
- | #define ENABLE_AVX2 1
- | #define ENABLE_SHANI 1
- | #define HAVE_PTHREAD_PRIO_INHERIT 1
- | #define HAVE_PTHREAD 1
- | #define HAVE_DECL_STRERROR_R 1
- | #define HAVE_STRERROR_R 1
- | #define HAVE_STDIO_H 1
- | #define HAVE_STDLIB_H 1
- | #define HAVE_UNISTD_H 1
- | #define HAVE_STRINGS_H 1
- | #define HAVE_SYS_TYPES_H 1
- | #define HAVE_SYS_STAT_H 1
- | #define HAVE_SYS_SELECT_H 1
- | #define HAVE_DECL_GETIFADDRS 1
- | #define HAVE_DECL_FREEIFADDRS 1
- | #define HAVE_DECL_STRNLEN 1
- | #define HAVE_DECL_DAEMON 1
- | #define HAVE_DECL_LE16TOH 0
- | #define HAVE_DECL_LE32TOH 0
- | #define HAVE_DECL_LE64TOH 0
- | #define HAVE_DECL_HTOLE16 0
- | #define HAVE_DECL_HTOLE32 0
- | #define HAVE_DECL_HTOLE64 0
- | #define HAVE_DECL_BE16TOH 0
- | #define HAVE_DECL_BE32TOH 0
- | #define HAVE_DECL_BE64TOH 0
- | #define HAVE_DECL_HTOBE16 0
- | #define HAVE_DECL_HTOBE32 0
- | #define HAVE_DECL_HTOBE64 0
- | #define HAVE_DECL_BSWAP_16 0
- | #define HAVE_DECL_BSWAP_32 0
- | #define HAVE_DECL_BSWAP_64 0
- | #define HAVE_DECL___BUILTIN_CLZ 0
- | #define HAVE_DECL___BUILTIN_CLZL 0
- | #define HAVE_DECL___BUILTIN_CLZLL 0
- | #define HAVE_VISIBILITY_ATTRIBUTE 1
- | #define HAVE_GETENTROPY_RAND 1
- | #define HAVE_STD__SYSTEM 1
- | /* end confdefs.h. */
- |
- | int
- | main ()
- | {
- | int nErr = ::_wsystem("");
- |
- | ;
- | return 0;
- | }
- configure:24751: result: no
- configure:24876: checking for Qt5Core Qt5Gui Qt5Network Qt5Widgets
- configure:24883: $PKG_CONFIG --exists --print-errors "$qt5_modules"
- configure:24886: $? = 0
- configure:24900: $PKG_CONFIG --exists --print-errors "$qt5_modules"
- configure:24903: $? = 0
- configure:24941: result: yes
- configure:24973: checking for Qt5Test
- configure:24980: $PKG_CONFIG --exists --print-errors "${QT_LIB_PREFIX}Test"
- configure:24983: $? = 0
- configure:24997: $PKG_CONFIG --exists --print-errors "${QT_LIB_PREFIX}Test"
- configure:25000: $? = 0
- configure:25038: result: yes
- configure:25045: checking for Qt5DBus
- configure:25052: $PKG_CONFIG --exists --print-errors "${QT_LIB_PREFIX}DBus"
- configure:25055: $? = 0
- configure:25069: $PKG_CONFIG --exists --print-errors "${QT_LIB_PREFIX}DBus"
- configure:25072: $? = 0
- configure:25110: result: yes
- configure:26177: checking for static Qt
- configure:26203: g++ -std=c++11 -c -fPIC -g -O2 -DQT_NETWORK_LIB -F/usr/local/Cellar/qt/5.12.1/lib -DQT_WIDGETS_LIB -F/usr/local/Cellar/qt/5.12.1/lib -DQT_GUI_LIB -F/usr/local/Cellar/qt/5.12.1/lib -DQT_CORE_LIB -F/usr/local/Cellar/qt/5.12.1/lib -I/usr/local/Cellar/qt/5.12.1/lib/QtNetwork.framework/Headers -I/usr/local/Cellar/qt/5.12.1/lib/QtWidgets.framework/Headers -I/usr/local/Cellar/qt/5.12.1/lib/QtGui.framework/Headers -I/usr/local/Cellar/qt/5.12.1/lib/QtCore.framework/Headers -DHAVE_BUILD_INFO -D__STDC_FORMAT_MACROS -I/usr/local/opt/berkeley-db@4/include -DMAC_OSX conftest.cpp >&5
- conftest.cpp:65:28: warning: extra tokens at end of #ifndef directive [-Wextra-tokens]
- #ifndef QT_VERSION OR QT_VERSION_STR
- ^
- //
- conftest.cpp:74:9: error: use of undeclared identifier 'choke'
- choke
- ^
- 1 warning and 1 error generated.
- configure:26203: $? = 1
- configure: failed program was:
- | /* confdefs.h */
- | #define PACKAGE_NAME "Bitcoin Core"
- | #define PACKAGE_TARNAME "bitcoin"
- | #define PACKAGE_VERSION "0.18.99"
- | #define PACKAGE_STRING "Bitcoin Core 0.18.99"
- | #define PACKAGE_BUGREPORT "https://github.com/bitcoin/bitcoin/issues"
- | #define PACKAGE_URL "https://bitcoincore.org/"
- | #define HAVE_CXX11 1
- | #define STDC_HEADERS 1
- | #define HAVE_SYS_TYPES_H 1
- | #define HAVE_SYS_STAT_H 1
- | #define HAVE_STDLIB_H 1
- | #define HAVE_STRING_H 1
- | #define HAVE_MEMORY_H 1
- | #define HAVE_STRINGS_H 1
- | #define HAVE_INTTYPES_H 1
- | #define HAVE_STDINT_H 1
- | #define HAVE_UNISTD_H 1
- | #define HAVE_DLFCN_H 1
- | #define LT_OBJDIR ".libs/"
- | #define USE_ASM 1
- | #define ENABLE_SSE41 1
- | #define ENABLE_AVX2 1
- | #define ENABLE_SHANI 1
- | #define HAVE_PTHREAD_PRIO_INHERIT 1
- | #define HAVE_PTHREAD 1
- | #define HAVE_DECL_STRERROR_R 1
- | #define HAVE_STRERROR_R 1
- | #define HAVE_STDIO_H 1
- | #define HAVE_STDLIB_H 1
- | #define HAVE_UNISTD_H 1
- | #define HAVE_STRINGS_H 1
- | #define HAVE_SYS_TYPES_H 1
- | #define HAVE_SYS_STAT_H 1
- | #define HAVE_SYS_SELECT_H 1
- | #define HAVE_DECL_GETIFADDRS 1
- | #define HAVE_DECL_FREEIFADDRS 1
- | #define HAVE_DECL_STRNLEN 1
- | #define HAVE_DECL_DAEMON 1
- | #define HAVE_DECL_LE16TOH 0
- | #define HAVE_DECL_LE32TOH 0
- | #define HAVE_DECL_LE64TOH 0
- | #define HAVE_DECL_HTOLE16 0
- | #define HAVE_DECL_HTOLE32 0
- | #define HAVE_DECL_HTOLE64 0
- | #define HAVE_DECL_BE16TOH 0
- | #define HAVE_DECL_BE32TOH 0
- | #define HAVE_DECL_BE64TOH 0
- | #define HAVE_DECL_HTOBE16 0
- | #define HAVE_DECL_HTOBE32 0
- | #define HAVE_DECL_HTOBE64 0
- | #define HAVE_DECL_BSWAP_16 0
- | #define HAVE_DECL_BSWAP_32 0
- | #define HAVE_DECL_BSWAP_64 0
- | #define HAVE_DECL___BUILTIN_CLZ 0
- | #define HAVE_DECL___BUILTIN_CLZL 0
- | #define HAVE_DECL___BUILTIN_CLZLL 0
- | #define HAVE_VISIBILITY_ATTRIBUTE 1
- | #define HAVE_GETENTROPY_RAND 1
- | #define HAVE_STD__SYSTEM 1
- | #define HAVE_SYSTEM HAVE_STD__SYSTEM || HAVE_WSYSTEM
- | /* end confdefs.h. */
- |
- | #include <QtCore/qconfig.h>
- | #ifndef QT_VERSION OR QT_VERSION_STR
- | # include <QtCore/qglobal.h>
- | #endif
- |
- | int
- | main ()
- | {
- |
- | #if !defined(QT_STATIC)
- | choke
- | #endif
- |
- | ;
- | return 0;
- | }
- configure:26211: result: no
- configure:27956: checking whether -fPIE can be used with this Qt config
- configure:27982: g++ -std=c++11 -c -g -O2 -DQT_NETWORK_LIB -F/usr/local/Cellar/qt/5.12.1/lib -DQT_WIDGETS_LIB -F/usr/local/Cellar/qt/5.12.1/lib -DQT_GUI_LIB -F/usr/local/Cellar/qt/5.12.1/lib -DQT_CORE_LIB -F/usr/local/Cellar/qt/5.12.1/lib -I/usr/local/Cellar/qt/5.12.1/lib/QtNetwork.framework/Headers -I/usr/local/Cellar/qt/5.12.1/lib/QtWidgets.framework/Headers -I/usr/local/Cellar/qt/5.12.1/lib/QtGui.framework/Headers -I/usr/local/Cellar/qt/5.12.1/lib/QtCore.framework/Headers -DHAVE_BUILD_INFO -D__STDC_FORMAT_MACROS -I/usr/local/opt/berkeley-db@4/include -DMAC_OSX conftest.cpp >&5
- configure:27982: $? = 0
- configure:27983: result: yes
- configure:28056: checking for moc-qt5
- configure:28089: result: no
- configure:28056: checking for moc5
- configure:28089: result: no
- configure:28056: checking for moc
- configure:28074: found /usr/local/Cellar/qt/5.12.1/bin/moc
- configure:28086: result: /usr/local/Cellar/qt/5.12.1/bin/moc
- configure:28175: checking for uic-qt5
- configure:28208: result: no
- configure:28175: checking for uic5
- configure:28208: result: no
- configure:28175: checking for uic
- configure:28193: found /usr/local/Cellar/qt/5.12.1/bin/uic
- configure:28205: result: /usr/local/Cellar/qt/5.12.1/bin/uic
- configure:28294: checking for rcc-qt5
- configure:28327: result: no
- configure:28294: checking for rcc5
- configure:28327: result: no
- configure:28294: checking for rcc
- configure:28312: found /usr/local/Cellar/qt/5.12.1/bin/rcc
- configure:28324: result: /usr/local/Cellar/qt/5.12.1/bin/rcc
- configure:28413: checking for lrelease-qt5
- configure:28446: result: no
- configure:28413: checking for lrelease5
- configure:28446: result: no
- configure:28413: checking for lrelease
- configure:28431: found /usr/local/Cellar/qt/5.12.1/bin/lrelease
- configure:28443: result: /usr/local/Cellar/qt/5.12.1/bin/lrelease
- configure:28532: checking for lupdate-qt5
- configure:28565: result: no
- configure:28532: checking for lupdate5
- configure:28565: result: no
- configure:28532: checking for lupdate
- configure:28550: found /usr/local/Cellar/qt/5.12.1/bin/lupdate
- configure:28562: result: /usr/local/Cellar/qt/5.12.1/bin/lupdate
- configure:28652: checking whether the linker accepts -framework Foundation -framework ApplicationServices -framework AppKit
- configure:28671: g++ -std=c++11 -o conftest -g -O2 -DHAVE_BUILD_INFO -D__STDC_FORMAT_MACROS -I/usr/local/opt/berkeley-db@4/include -DMAC_OSX -Wl,-headerpad_max_install_names -Wl,-dead_strip -framework Foundation -framework ApplicationServices -framework AppKit conftest.cpp -L/usr/local/opt/berkeley-db@4/lib >&5
- configure:28671: $? = 0
- configure:28681: result: yes
- configure:28747: checking whether to build Bitcoin Core GUI
- configure:28777: result: yes (Qt5)
- configure:28800: checking for Berkeley DB C++ headers
- configure:28830: g++ -std=c++11 -c -g -O2 -DHAVE_BUILD_INFO -D__STDC_FORMAT_MACROS -I/usr/local/opt/berkeley-db@4/include -DMAC_OSX conftest.cpp >&5
- conftest.cpp:64:18: fatal error: 'bdb4.8/db_cxx.h' file not found
- #include <bdb4.8/db_cxx.h>
- ^~~~~~~~~~~~~~~~~
- 1 error generated.
- configure:28830: $? = 1
- configure: failed program was:
- | /* confdefs.h */
- | #define PACKAGE_NAME "Bitcoin Core"
- | #define PACKAGE_TARNAME "bitcoin"
- | #define PACKAGE_VERSION "0.18.99"
- | #define PACKAGE_STRING "Bitcoin Core 0.18.99"
- | #define PACKAGE_BUGREPORT "https://github.com/bitcoin/bitcoin/issues"
- | #define PACKAGE_URL "https://bitcoincore.org/"
- | #define HAVE_CXX11 1
- | #define STDC_HEADERS 1
- | #define HAVE_SYS_TYPES_H 1
- | #define HAVE_SYS_STAT_H 1
- | #define HAVE_STDLIB_H 1
- | #define HAVE_STRING_H 1
- | #define HAVE_MEMORY_H 1
- | #define HAVE_STRINGS_H 1
- | #define HAVE_INTTYPES_H 1
- | #define HAVE_STDINT_H 1
- | #define HAVE_UNISTD_H 1
- | #define HAVE_DLFCN_H 1
- | #define LT_OBJDIR ".libs/"
- | #define USE_ASM 1
- | #define ENABLE_SSE41 1
- | #define ENABLE_AVX2 1
- | #define ENABLE_SHANI 1
- | #define HAVE_PTHREAD_PRIO_INHERIT 1
- | #define HAVE_PTHREAD 1
- | #define HAVE_DECL_STRERROR_R 1
- | #define HAVE_STRERROR_R 1
- | #define HAVE_STDIO_H 1
- | #define HAVE_STDLIB_H 1
- | #define HAVE_UNISTD_H 1
- | #define HAVE_STRINGS_H 1
- | #define HAVE_SYS_TYPES_H 1
- | #define HAVE_SYS_STAT_H 1
- | #define HAVE_SYS_SELECT_H 1
- | #define HAVE_DECL_GETIFADDRS 1
- | #define HAVE_DECL_FREEIFADDRS 1
- | #define HAVE_DECL_STRNLEN 1
- | #define HAVE_DECL_DAEMON 1
- | #define HAVE_DECL_LE16TOH 0
- | #define HAVE_DECL_LE32TOH 0
- | #define HAVE_DECL_LE64TOH 0
- | #define HAVE_DECL_HTOLE16 0
- | #define HAVE_DECL_HTOLE32 0
- | #define HAVE_DECL_HTOLE64 0
- | #define HAVE_DECL_BE16TOH 0
- | #define HAVE_DECL_BE32TOH 0
- | #define HAVE_DECL_BE64TOH 0
- | #define HAVE_DECL_HTOBE16 0
- | #define HAVE_DECL_HTOBE32 0
- | #define HAVE_DECL_HTOBE64 0
- | #define HAVE_DECL_BSWAP_16 0
- | #define HAVE_DECL_BSWAP_32 0
- | #define HAVE_DECL_BSWAP_64 0
- | #define HAVE_DECL___BUILTIN_CLZ 0
- | #define HAVE_DECL___BUILTIN_CLZL 0
- | #define HAVE_DECL___BUILTIN_CLZLL 0
- | #define HAVE_VISIBILITY_ATTRIBUTE 1
- | #define HAVE_GETENTROPY_RAND 1
- | #define HAVE_STD__SYSTEM 1
- | #define HAVE_SYSTEM HAVE_STD__SYSTEM || HAVE_WSYSTEM
- | /* end confdefs.h. */
- |
- | #include <bdb4.8/db_cxx.h>
- |
- | int
- | main ()
- | {
- |
- | #if !((DB_VERSION_MAJOR == 4 && DB_VERSION_MINOR >= 8) || DB_VERSION_MAJOR > 4)
- | #error "failed to find bdb 4.8+"
- | #endif
- |
- | ;
- | return 0;
- | }
- configure:28830: g++ -std=c++11 -c -g -O2 -DHAVE_BUILD_INFO -D__STDC_FORMAT_MACROS -I/usr/local/opt/berkeley-db@4/include -DMAC_OSX conftest.cpp >&5
- conftest.cpp:64:18: fatal error: 'libdb4.8/db_cxx.h' file not found
- #include <libdb4.8/db_cxx.h>
- ^~~~~~~~~~~~~~~~~~~
- 1 error generated.
- configure:28830: $? = 1
- configure: failed program was:
- | /* confdefs.h */
- | #define PACKAGE_NAME "Bitcoin Core"
- | #define PACKAGE_TARNAME "bitcoin"
- | #define PACKAGE_VERSION "0.18.99"
- | #define PACKAGE_STRING "Bitcoin Core 0.18.99"
- | #define PACKAGE_BUGREPORT "https://github.com/bitcoin/bitcoin/issues"
- | #define PACKAGE_URL "https://bitcoincore.org/"
- | #define HAVE_CXX11 1
- | #define STDC_HEADERS 1
- | #define HAVE_SYS_TYPES_H 1
- | #define HAVE_SYS_STAT_H 1
- | #define HAVE_STDLIB_H 1
- | #define HAVE_STRING_H 1
- | #define HAVE_MEMORY_H 1
- | #define HAVE_STRINGS_H 1
- | #define HAVE_INTTYPES_H 1
- | #define HAVE_STDINT_H 1
- | #define HAVE_UNISTD_H 1
- | #define HAVE_DLFCN_H 1
- | #define LT_OBJDIR ".libs/"
- | #define USE_ASM 1
- | #define ENABLE_SSE41 1
- | #define ENABLE_AVX2 1
- | #define ENABLE_SHANI 1
- | #define HAVE_PTHREAD_PRIO_INHERIT 1
- | #define HAVE_PTHREAD 1
- | #define HAVE_DECL_STRERROR_R 1
- | #define HAVE_STRERROR_R 1
- | #define HAVE_STDIO_H 1
- | #define HAVE_STDLIB_H 1
- | #define HAVE_UNISTD_H 1
- | #define HAVE_STRINGS_H 1
- | #define HAVE_SYS_TYPES_H 1
- | #define HAVE_SYS_STAT_H 1
- | #define HAVE_SYS_SELECT_H 1
- | #define HAVE_DECL_GETIFADDRS 1
- | #define HAVE_DECL_FREEIFADDRS 1
- | #define HAVE_DECL_STRNLEN 1
- | #define HAVE_DECL_DAEMON 1
- | #define HAVE_DECL_LE16TOH 0
- | #define HAVE_DECL_LE32TOH 0
- | #define HAVE_DECL_LE64TOH 0
- | #define HAVE_DECL_HTOLE16 0
- | #define HAVE_DECL_HTOLE32 0
- | #define HAVE_DECL_HTOLE64 0
- | #define HAVE_DECL_BE16TOH 0
- | #define HAVE_DECL_BE32TOH 0
- | #define HAVE_DECL_BE64TOH 0
- | #define HAVE_DECL_HTOBE16 0
- | #define HAVE_DECL_HTOBE32 0
- | #define HAVE_DECL_HTOBE64 0
- | #define HAVE_DECL_BSWAP_16 0
- | #define HAVE_DECL_BSWAP_32 0
- | #define HAVE_DECL_BSWAP_64 0
- | #define HAVE_DECL___BUILTIN_CLZ 0
- | #define HAVE_DECL___BUILTIN_CLZL 0
- | #define HAVE_DECL___BUILTIN_CLZLL 0
- | #define HAVE_VISIBILITY_ATTRIBUTE 1
- | #define HAVE_GETENTROPY_RAND 1
- | #define HAVE_STD__SYSTEM 1
- | #define HAVE_SYSTEM HAVE_STD__SYSTEM || HAVE_WSYSTEM
- | /* end confdefs.h. */
- |
- | #include <libdb4.8/db_cxx.h>
- |
- | int
- | main ()
- | {
- |
- | #if !((DB_VERSION_MAJOR == 4 && DB_VERSION_MINOR >= 8) || DB_VERSION_MAJOR > 4)
- | #error "failed to find bdb 4.8+"
- | #endif
- |
- | ;
- | return 0;
- | }
- configure:28830: g++ -std=c++11 -c -g -O2 -DHAVE_BUILD_INFO -D__STDC_FORMAT_MACROS -I/usr/local/opt/berkeley-db@4/include -DMAC_OSX conftest.cpp >&5
- conftest.cpp:64:18: fatal error: 'db4.8/db_cxx.h' file not found
- #include <db4.8/db_cxx.h>
- ^~~~~~~~~~~~~~~~
- 1 error generated.
- configure:28830: $? = 1
- configure: failed program was:
- | /* confdefs.h */
- | #define PACKAGE_NAME "Bitcoin Core"
- | #define PACKAGE_TARNAME "bitcoin"
- | #define PACKAGE_VERSION "0.18.99"
- | #define PACKAGE_STRING "Bitcoin Core 0.18.99"
- | #define PACKAGE_BUGREPORT "https://github.com/bitcoin/bitcoin/issues"
- | #define PACKAGE_URL "https://bitcoincore.org/"
- | #define HAVE_CXX11 1
- | #define STDC_HEADERS 1
- | #define HAVE_SYS_TYPES_H 1
- | #define HAVE_SYS_STAT_H 1
- | #define HAVE_STDLIB_H 1
- | #define HAVE_STRING_H 1
- | #define HAVE_MEMORY_H 1
- | #define HAVE_STRINGS_H 1
- | #define HAVE_INTTYPES_H 1
- | #define HAVE_STDINT_H 1
- | #define HAVE_UNISTD_H 1
- | #define HAVE_DLFCN_H 1
- | #define LT_OBJDIR ".libs/"
- | #define USE_ASM 1
- | #define ENABLE_SSE41 1
- | #define ENABLE_AVX2 1
- | #define ENABLE_SHANI 1
- | #define HAVE_PTHREAD_PRIO_INHERIT 1
- | #define HAVE_PTHREAD 1
- | #define HAVE_DECL_STRERROR_R 1
- | #define HAVE_STRERROR_R 1
- | #define HAVE_STDIO_H 1
- | #define HAVE_STDLIB_H 1
- | #define HAVE_UNISTD_H 1
- | #define HAVE_STRINGS_H 1
- | #define HAVE_SYS_TYPES_H 1
- | #define HAVE_SYS_STAT_H 1
- | #define HAVE_SYS_SELECT_H 1
- | #define HAVE_DECL_GETIFADDRS 1
- | #define HAVE_DECL_FREEIFADDRS 1
- | #define HAVE_DECL_STRNLEN 1
- | #define HAVE_DECL_DAEMON 1
- | #define HAVE_DECL_LE16TOH 0
- | #define HAVE_DECL_LE32TOH 0
- | #define HAVE_DECL_LE64TOH 0
- | #define HAVE_DECL_HTOLE16 0
- | #define HAVE_DECL_HTOLE32 0
- | #define HAVE_DECL_HTOLE64 0
- | #define HAVE_DECL_BE16TOH 0
- | #define HAVE_DECL_BE32TOH 0
- | #define HAVE_DECL_BE64TOH 0
- | #define HAVE_DECL_HTOBE16 0
- | #define HAVE_DECL_HTOBE32 0
- | #define HAVE_DECL_HTOBE64 0
- | #define HAVE_DECL_BSWAP_16 0
- | #define HAVE_DECL_BSWAP_32 0
- | #define HAVE_DECL_BSWAP_64 0
- | #define HAVE_DECL___BUILTIN_CLZ 0
- | #define HAVE_DECL___BUILTIN_CLZL 0
- | #define HAVE_DECL___BUILTIN_CLZLL 0
- | #define HAVE_VISIBILITY_ATTRIBUTE 1
- | #define HAVE_GETENTROPY_RAND 1
- | #define HAVE_STD__SYSTEM 1
- | #define HAVE_SYSTEM HAVE_STD__SYSTEM || HAVE_WSYSTEM
- | /* end confdefs.h. */
- |
- | #include <db4.8/db_cxx.h>
- |
- | int
- | main ()
- | {
- |
- | #if !((DB_VERSION_MAJOR == 4 && DB_VERSION_MINOR >= 8) || DB_VERSION_MAJOR > 4)
- | #error "failed to find bdb 4.8+"
- | #endif
- |
- | ;
- | return 0;
- | }
- configure:28830: g++ -std=c++11 -c -g -O2 -DHAVE_BUILD_INFO -D__STDC_FORMAT_MACROS -I/usr/local/opt/berkeley-db@4/include -DMAC_OSX conftest.cpp >&5
- conftest.cpp:64:18: fatal error: 'bdb48/db_cxx.h' file not found
- #include <bdb48/db_cxx.h>
- ^~~~~~~~~~~~~~~~
- 1 error generated.
- configure:28830: $? = 1
- configure: failed program was:
- | /* confdefs.h */
- | #define PACKAGE_NAME "Bitcoin Core"
- | #define PACKAGE_TARNAME "bitcoin"
- | #define PACKAGE_VERSION "0.18.99"
- | #define PACKAGE_STRING "Bitcoin Core 0.18.99"
- | #define PACKAGE_BUGREPORT "https://github.com/bitcoin/bitcoin/issues"
- | #define PACKAGE_URL "https://bitcoincore.org/"
- | #define HAVE_CXX11 1
- | #define STDC_HEADERS 1
- | #define HAVE_SYS_TYPES_H 1
- | #define HAVE_SYS_STAT_H 1
- | #define HAVE_STDLIB_H 1
- | #define HAVE_STRING_H 1
- | #define HAVE_MEMORY_H 1
- | #define HAVE_STRINGS_H 1
- | #define HAVE_INTTYPES_H 1
- | #define HAVE_STDINT_H 1
- | #define HAVE_UNISTD_H 1
- | #define HAVE_DLFCN_H 1
- | #define LT_OBJDIR ".libs/"
- | #define USE_ASM 1
- | #define ENABLE_SSE41 1
- | #define ENABLE_AVX2 1
- | #define ENABLE_SHANI 1
- | #define HAVE_PTHREAD_PRIO_INHERIT 1
- | #define HAVE_PTHREAD 1
- | #define HAVE_DECL_STRERROR_R 1
- | #define HAVE_STRERROR_R 1
- | #define HAVE_STDIO_H 1
- | #define HAVE_STDLIB_H 1
- | #define HAVE_UNISTD_H 1
- | #define HAVE_STRINGS_H 1
- | #define HAVE_SYS_TYPES_H 1
- | #define HAVE_SYS_STAT_H 1
- | #define HAVE_SYS_SELECT_H 1
- | #define HAVE_DECL_GETIFADDRS 1
- | #define HAVE_DECL_FREEIFADDRS 1
- | #define HAVE_DECL_STRNLEN 1
- | #define HAVE_DECL_DAEMON 1
- | #define HAVE_DECL_LE16TOH 0
- | #define HAVE_DECL_LE32TOH 0
- | #define HAVE_DECL_LE64TOH 0
- | #define HAVE_DECL_HTOLE16 0
- | #define HAVE_DECL_HTOLE32 0
- | #define HAVE_DECL_HTOLE64 0
- | #define HAVE_DECL_BE16TOH 0
- | #define HAVE_DECL_BE32TOH 0
- | #define HAVE_DECL_BE64TOH 0
- | #define HAVE_DECL_HTOBE16 0
- | #define HAVE_DECL_HTOBE32 0
- | #define HAVE_DECL_HTOBE64 0
- | #define HAVE_DECL_BSWAP_16 0
- | #define HAVE_DECL_BSWAP_32 0
- | #define HAVE_DECL_BSWAP_64 0
- | #define HAVE_DECL___BUILTIN_CLZ 0
- | #define HAVE_DECL___BUILTIN_CLZL 0
- | #define HAVE_DECL___BUILTIN_CLZLL 0
- | #define HAVE_VISIBILITY_ATTRIBUTE 1
- | #define HAVE_GETENTROPY_RAND 1
- | #define HAVE_STD__SYSTEM 1
- | #define HAVE_SYSTEM HAVE_STD__SYSTEM || HAVE_WSYSTEM
- | /* end confdefs.h. */
- |
- | #include <bdb48/db_cxx.h>
- |
- | int
- | main ()
- | {
- |
- | #if !((DB_VERSION_MAJOR == 4 && DB_VERSION_MINOR >= 8) || DB_VERSION_MAJOR > 4)
- | #error "failed to find bdb 4.8+"
- | #endif
- |
- | ;
- | return 0;
- | }
- configure:28830: g++ -std=c++11 -c -g -O2 -DHAVE_BUILD_INFO -D__STDC_FORMAT_MACROS -I/usr/local/opt/berkeley-db@4/include -DMAC_OSX conftest.cpp >&5
- conftest.cpp:64:18: fatal error: 'libdb48/db_cxx.h' file not found
- #include <libdb48/db_cxx.h>
- ^~~~~~~~~~~~~~~~~~
- 1 error generated.
- configure:28830: $? = 1
- configure: failed program was:
- | /* confdefs.h */
- | #define PACKAGE_NAME "Bitcoin Core"
- | #define PACKAGE_TARNAME "bitcoin"
- | #define PACKAGE_VERSION "0.18.99"
- | #define PACKAGE_STRING "Bitcoin Core 0.18.99"
- | #define PACKAGE_BUGREPORT "https://github.com/bitcoin/bitcoin/issues"
- | #define PACKAGE_URL "https://bitcoincore.org/"
- | #define HAVE_CXX11 1
- | #define STDC_HEADERS 1
- | #define HAVE_SYS_TYPES_H 1
- | #define HAVE_SYS_STAT_H 1
- | #define HAVE_STDLIB_H 1
- | #define HAVE_STRING_H 1
- | #define HAVE_MEMORY_H 1
- | #define HAVE_STRINGS_H 1
- | #define HAVE_INTTYPES_H 1
- | #define HAVE_STDINT_H 1
- | #define HAVE_UNISTD_H 1
- | #define HAVE_DLFCN_H 1
- | #define LT_OBJDIR ".libs/"
- | #define USE_ASM 1
- | #define ENABLE_SSE41 1
- | #define ENABLE_AVX2 1
- | #define ENABLE_SHANI 1
- | #define HAVE_PTHREAD_PRIO_INHERIT 1
- | #define HAVE_PTHREAD 1
- | #define HAVE_DECL_STRERROR_R 1
- | #define HAVE_STRERROR_R 1
- | #define HAVE_STDIO_H 1
- | #define HAVE_STDLIB_H 1
- | #define HAVE_UNISTD_H 1
- | #define HAVE_STRINGS_H 1
- | #define HAVE_SYS_TYPES_H 1
- | #define HAVE_SYS_STAT_H 1
- | #define HAVE_SYS_SELECT_H 1
- | #define HAVE_DECL_GETIFADDRS 1
- | #define HAVE_DECL_FREEIFADDRS 1
- | #define HAVE_DECL_STRNLEN 1
- | #define HAVE_DECL_DAEMON 1
- | #define HAVE_DECL_LE16TOH 0
- | #define HAVE_DECL_LE32TOH 0
- | #define HAVE_DECL_LE64TOH 0
- | #define HAVE_DECL_HTOLE16 0
- | #define HAVE_DECL_HTOLE32 0
- | #define HAVE_DECL_HTOLE64 0
- | #define HAVE_DECL_BE16TOH 0
- | #define HAVE_DECL_BE32TOH 0
- | #define HAVE_DECL_BE64TOH 0
- | #define HAVE_DECL_HTOBE16 0
- | #define HAVE_DECL_HTOBE32 0
- | #define HAVE_DECL_HTOBE64 0
- | #define HAVE_DECL_BSWAP_16 0
- | #define HAVE_DECL_BSWAP_32 0
- | #define HAVE_DECL_BSWAP_64 0
- | #define HAVE_DECL___BUILTIN_CLZ 0
- | #define HAVE_DECL___BUILTIN_CLZL 0
- | #define HAVE_DECL___BUILTIN_CLZLL 0
- | #define HAVE_VISIBILITY_ATTRIBUTE 1
- | #define HAVE_GETENTROPY_RAND 1
- | #define HAVE_STD__SYSTEM 1
- | #define HAVE_SYSTEM HAVE_STD__SYSTEM || HAVE_WSYSTEM
- | /* end confdefs.h. */
- |
- | #include <libdb48/db_cxx.h>
- |
- | int
- | main ()
- | {
- |
- | #if !((DB_VERSION_MAJOR == 4 && DB_VERSION_MINOR >= 8) || DB_VERSION_MAJOR > 4)
- | #error "failed to find bdb 4.8+"
- | #endif
- |
- | ;
- | return 0;
- | }
- configure:28830: g++ -std=c++11 -c -g -O2 -DHAVE_BUILD_INFO -D__STDC_FORMAT_MACROS -I/usr/local/opt/berkeley-db@4/include -DMAC_OSX conftest.cpp >&5
- conftest.cpp:64:18: fatal error: 'db48/db_cxx.h' file not found
- #include <db48/db_cxx.h>
- ^~~~~~~~~~~~~~~
- 1 error generated.
- configure:28830: $? = 1
- configure: failed program was:
- | /* confdefs.h */
- | #define PACKAGE_NAME "Bitcoin Core"
- | #define PACKAGE_TARNAME "bitcoin"
- | #define PACKAGE_VERSION "0.18.99"
- | #define PACKAGE_STRING "Bitcoin Core 0.18.99"
- | #define PACKAGE_BUGREPORT "https://github.com/bitcoin/bitcoin/issues"
- | #define PACKAGE_URL "https://bitcoincore.org/"
- | #define HAVE_CXX11 1
- | #define STDC_HEADERS 1
- | #define HAVE_SYS_TYPES_H 1
- | #define HAVE_SYS_STAT_H 1
- | #define HAVE_STDLIB_H 1
- | #define HAVE_STRING_H 1
- | #define HAVE_MEMORY_H 1
- | #define HAVE_STRINGS_H 1
- | #define HAVE_INTTYPES_H 1
- | #define HAVE_STDINT_H 1
- | #define HAVE_UNISTD_H 1
- | #define HAVE_DLFCN_H 1
- | #define LT_OBJDIR ".libs/"
- | #define USE_ASM 1
- | #define ENABLE_SSE41 1
- | #define ENABLE_AVX2 1
- | #define ENABLE_SHANI 1
- | #define HAVE_PTHREAD_PRIO_INHERIT 1
- | #define HAVE_PTHREAD 1
- | #define HAVE_DECL_STRERROR_R 1
- | #define HAVE_STRERROR_R 1
- | #define HAVE_STDIO_H 1
- | #define HAVE_STDLIB_H 1
- | #define HAVE_UNISTD_H 1
- | #define HAVE_STRINGS_H 1
- | #define HAVE_SYS_TYPES_H 1
- | #define HAVE_SYS_STAT_H 1
- | #define HAVE_SYS_SELECT_H 1
- | #define HAVE_DECL_GETIFADDRS 1
- | #define HAVE_DECL_FREEIFADDRS 1
- | #define HAVE_DECL_STRNLEN 1
- | #define HAVE_DECL_DAEMON 1
- | #define HAVE_DECL_LE16TOH 0
- | #define HAVE_DECL_LE32TOH 0
- | #define HAVE_DECL_LE64TOH 0
- | #define HAVE_DECL_HTOLE16 0
- | #define HAVE_DECL_HTOLE32 0
- | #define HAVE_DECL_HTOLE64 0
- | #define HAVE_DECL_BE16TOH 0
- | #define HAVE_DECL_BE32TOH 0
- | #define HAVE_DECL_BE64TOH 0
- | #define HAVE_DECL_HTOBE16 0
- | #define HAVE_DECL_HTOBE32 0
- | #define HAVE_DECL_HTOBE64 0
- | #define HAVE_DECL_BSWAP_16 0
- | #define HAVE_DECL_BSWAP_32 0
- | #define HAVE_DECL_BSWAP_64 0
- | #define HAVE_DECL___BUILTIN_CLZ 0
- | #define HAVE_DECL___BUILTIN_CLZL 0
- | #define HAVE_DECL___BUILTIN_CLZLL 0
- | #define HAVE_VISIBILITY_ATTRIBUTE 1
- | #define HAVE_GETENTROPY_RAND 1
- | #define HAVE_STD__SYSTEM 1
- | #define HAVE_SYSTEM HAVE_STD__SYSTEM || HAVE_WSYSTEM
- | /* end confdefs.h. */
- |
- | #include <db48/db_cxx.h>
- |
- | int
- | main ()
- | {
- |
- | #if !((DB_VERSION_MAJOR == 4 && DB_VERSION_MINOR >= 8) || DB_VERSION_MAJOR > 4)
- | #error "failed to find bdb 4.8+"
- | #endif
- |
- | ;
- | return 0;
- | }
- configure:28830: g++ -std=c++11 -c -g -O2 -DHAVE_BUILD_INFO -D__STDC_FORMAT_MACROS -I/usr/local/opt/berkeley-db@4/include -DMAC_OSX conftest.cpp >&5
- conftest.cpp:64:18: fatal error: 'bdb4/db_cxx.h' file not found
- #include <bdb4/db_cxx.h>
- ^~~~~~~~~~~~~~~
- 1 error generated.
- configure:28830: $? = 1
- configure: failed program was:
- | /* confdefs.h */
- | #define PACKAGE_NAME "Bitcoin Core"
- | #define PACKAGE_TARNAME "bitcoin"
- | #define PACKAGE_VERSION "0.18.99"
- | #define PACKAGE_STRING "Bitcoin Core 0.18.99"
- | #define PACKAGE_BUGREPORT "https://github.com/bitcoin/bitcoin/issues"
- | #define PACKAGE_URL "https://bitcoincore.org/"
- | #define HAVE_CXX11 1
- | #define STDC_HEADERS 1
- | #define HAVE_SYS_TYPES_H 1
- | #define HAVE_SYS_STAT_H 1
- | #define HAVE_STDLIB_H 1
- | #define HAVE_STRING_H 1
- | #define HAVE_MEMORY_H 1
- | #define HAVE_STRINGS_H 1
- | #define HAVE_INTTYPES_H 1
- | #define HAVE_STDINT_H 1
- | #define HAVE_UNISTD_H 1
- | #define HAVE_DLFCN_H 1
- | #define LT_OBJDIR ".libs/"
- | #define USE_ASM 1
- | #define ENABLE_SSE41 1
- | #define ENABLE_AVX2 1
- | #define ENABLE_SHANI 1
- | #define HAVE_PTHREAD_PRIO_INHERIT 1
- | #define HAVE_PTHREAD 1
- | #define HAVE_DECL_STRERROR_R 1
- | #define HAVE_STRERROR_R 1
- | #define HAVE_STDIO_H 1
- | #define HAVE_STDLIB_H 1
- | #define HAVE_UNISTD_H 1
- | #define HAVE_STRINGS_H 1
- | #define HAVE_SYS_TYPES_H 1
- | #define HAVE_SYS_STAT_H 1
- | #define HAVE_SYS_SELECT_H 1
- | #define HAVE_DECL_GETIFADDRS 1
- | #define HAVE_DECL_FREEIFADDRS 1
- | #define HAVE_DECL_STRNLEN 1
- | #define HAVE_DECL_DAEMON 1
- | #define HAVE_DECL_LE16TOH 0
- | #define HAVE_DECL_LE32TOH 0
- | #define HAVE_DECL_LE64TOH 0
- | #define HAVE_DECL_HTOLE16 0
- | #define HAVE_DECL_HTOLE32 0
- | #define HAVE_DECL_HTOLE64 0
- | #define HAVE_DECL_BE16TOH 0
- | #define HAVE_DECL_BE32TOH 0
- | #define HAVE_DECL_BE64TOH 0
- | #define HAVE_DECL_HTOBE16 0
- | #define HAVE_DECL_HTOBE32 0
- | #define HAVE_DECL_HTOBE64 0
- | #define HAVE_DECL_BSWAP_16 0
- | #define HAVE_DECL_BSWAP_32 0
- | #define HAVE_DECL_BSWAP_64 0
- | #define HAVE_DECL___BUILTIN_CLZ 0
- | #define HAVE_DECL___BUILTIN_CLZL 0
- | #define HAVE_DECL___BUILTIN_CLZLL 0
- | #define HAVE_VISIBILITY_ATTRIBUTE 1
- | #define HAVE_GETENTROPY_RAND 1
- | #define HAVE_STD__SYSTEM 1
- | #define HAVE_SYSTEM HAVE_STD__SYSTEM || HAVE_WSYSTEM
- | /* end confdefs.h. */
- |
- | #include <bdb4/db_cxx.h>
- |
- | int
- | main ()
- | {
- |
- | #if !((DB_VERSION_MAJOR == 4 && DB_VERSION_MINOR >= 8) || DB_VERSION_MAJOR > 4)
- | #error "failed to find bdb 4.8+"
- | #endif
- |
- | ;
- | return 0;
- | }
- configure:28830: g++ -std=c++11 -c -g -O2 -DHAVE_BUILD_INFO -D__STDC_FORMAT_MACROS -I/usr/local/opt/berkeley-db@4/include -DMAC_OSX conftest.cpp >&5
- conftest.cpp:64:18: fatal error: 'libdb4/db_cxx.h' file not found
- #include <libdb4/db_cxx.h>
- ^~~~~~~~~~~~~~~~~
- 1 error generated.
- configure:28830: $? = 1
- configure: failed program was:
- | /* confdefs.h */
- | #define PACKAGE_NAME "Bitcoin Core"
- | #define PACKAGE_TARNAME "bitcoin"
- | #define PACKAGE_VERSION "0.18.99"
- | #define PACKAGE_STRING "Bitcoin Core 0.18.99"
- | #define PACKAGE_BUGREPORT "https://github.com/bitcoin/bitcoin/issues"
- | #define PACKAGE_URL "https://bitcoincore.org/"
- | #define HAVE_CXX11 1
- | #define STDC_HEADERS 1
- | #define HAVE_SYS_TYPES_H 1
- | #define HAVE_SYS_STAT_H 1
- | #define HAVE_STDLIB_H 1
- | #define HAVE_STRING_H 1
- | #define HAVE_MEMORY_H 1
- | #define HAVE_STRINGS_H 1
- | #define HAVE_INTTYPES_H 1
- | #define HAVE_STDINT_H 1
- | #define HAVE_UNISTD_H 1
- | #define HAVE_DLFCN_H 1
- | #define LT_OBJDIR ".libs/"
- | #define USE_ASM 1
- | #define ENABLE_SSE41 1
- | #define ENABLE_AVX2 1
- | #define ENABLE_SHANI 1
- | #define HAVE_PTHREAD_PRIO_INHERIT 1
- | #define HAVE_PTHREAD 1
- | #define HAVE_DECL_STRERROR_R 1
- | #define HAVE_STRERROR_R 1
- | #define HAVE_STDIO_H 1
- | #define HAVE_STDLIB_H 1
- | #define HAVE_UNISTD_H 1
- | #define HAVE_STRINGS_H 1
- | #define HAVE_SYS_TYPES_H 1
- | #define HAVE_SYS_STAT_H 1
- | #define HAVE_SYS_SELECT_H 1
- | #define HAVE_DECL_GETIFADDRS 1
- | #define HAVE_DECL_FREEIFADDRS 1
- | #define HAVE_DECL_STRNLEN 1
- | #define HAVE_DECL_DAEMON 1
- | #define HAVE_DECL_LE16TOH 0
- | #define HAVE_DECL_LE32TOH 0
- | #define HAVE_DECL_LE64TOH 0
- | #define HAVE_DECL_HTOLE16 0
- | #define HAVE_DECL_HTOLE32 0
- | #define HAVE_DECL_HTOLE64 0
- | #define HAVE_DECL_BE16TOH 0
- | #define HAVE_DECL_BE32TOH 0
- | #define HAVE_DECL_BE64TOH 0
- | #define HAVE_DECL_HTOBE16 0
- | #define HAVE_DECL_HTOBE32 0
- | #define HAVE_DECL_HTOBE64 0
- | #define HAVE_DECL_BSWAP_16 0
- | #define HAVE_DECL_BSWAP_32 0
- | #define HAVE_DECL_BSWAP_64 0
- | #define HAVE_DECL___BUILTIN_CLZ 0
- | #define HAVE_DECL___BUILTIN_CLZL 0
- | #define HAVE_DECL___BUILTIN_CLZLL 0
- | #define HAVE_VISIBILITY_ATTRIBUTE 1
- | #define HAVE_GETENTROPY_RAND 1
- | #define HAVE_STD__SYSTEM 1
- | #define HAVE_SYSTEM HAVE_STD__SYSTEM || HAVE_WSYSTEM
- | /* end confdefs.h. */
- |
- | #include <libdb4/db_cxx.h>
- |
- | int
- | main ()
- | {
- |
- | #if !((DB_VERSION_MAJOR == 4 && DB_VERSION_MINOR >= 8) || DB_VERSION_MAJOR > 4)
- | #error "failed to find bdb 4.8+"
- | #endif
- |
- | ;
- | return 0;
- | }
- configure:28830: g++ -std=c++11 -c -g -O2 -DHAVE_BUILD_INFO -D__STDC_FORMAT_MACROS -I/usr/local/opt/berkeley-db@4/include -DMAC_OSX conftest.cpp >&5
- conftest.cpp:64:18: fatal error: 'db4/db_cxx.h' file not found
- #include <db4/db_cxx.h>
- ^~~~~~~~~~~~~~
- 1 error generated.
- configure:28830: $? = 1
- configure: failed program was:
- | /* confdefs.h */
- | #define PACKAGE_NAME "Bitcoin Core"
- | #define PACKAGE_TARNAME "bitcoin"
- | #define PACKAGE_VERSION "0.18.99"
- | #define PACKAGE_STRING "Bitcoin Core 0.18.99"
- | #define PACKAGE_BUGREPORT "https://github.com/bitcoin/bitcoin/issues"
- | #define PACKAGE_URL "https://bitcoincore.org/"
- | #define HAVE_CXX11 1
- | #define STDC_HEADERS 1
- | #define HAVE_SYS_TYPES_H 1
- | #define HAVE_SYS_STAT_H 1
- | #define HAVE_STDLIB_H 1
- | #define HAVE_STRING_H 1
- | #define HAVE_MEMORY_H 1
- | #define HAVE_STRINGS_H 1
- | #define HAVE_INTTYPES_H 1
- | #define HAVE_STDINT_H 1
- | #define HAVE_UNISTD_H 1
- | #define HAVE_DLFCN_H 1
- | #define LT_OBJDIR ".libs/"
- | #define USE_ASM 1
- | #define ENABLE_SSE41 1
- | #define ENABLE_AVX2 1
- | #define ENABLE_SHANI 1
- | #define HAVE_PTHREAD_PRIO_INHERIT 1
- | #define HAVE_PTHREAD 1
- | #define HAVE_DECL_STRERROR_R 1
- | #define HAVE_STRERROR_R 1
- | #define HAVE_STDIO_H 1
- | #define HAVE_STDLIB_H 1
- | #define HAVE_UNISTD_H 1
- | #define HAVE_STRINGS_H 1
- | #define HAVE_SYS_TYPES_H 1
- | #define HAVE_SYS_STAT_H 1
- | #define HAVE_SYS_SELECT_H 1
- | #define HAVE_DECL_GETIFADDRS 1
- | #define HAVE_DECL_FREEIFADDRS 1
- | #define HAVE_DECL_STRNLEN 1
- | #define HAVE_DECL_DAEMON 1
- | #define HAVE_DECL_LE16TOH 0
- | #define HAVE_DECL_LE32TOH 0
- | #define HAVE_DECL_LE64TOH 0
- | #define HAVE_DECL_HTOLE16 0
- | #define HAVE_DECL_HTOLE32 0
- | #define HAVE_DECL_HTOLE64 0
- | #define HAVE_DECL_BE16TOH 0
- | #define HAVE_DECL_BE32TOH 0
- | #define HAVE_DECL_BE64TOH 0
- | #define HAVE_DECL_HTOBE16 0
- | #define HAVE_DECL_HTOBE32 0
- | #define HAVE_DECL_HTOBE64 0
- | #define HAVE_DECL_BSWAP_16 0
- | #define HAVE_DECL_BSWAP_32 0
- | #define HAVE_DECL_BSWAP_64 0
- | #define HAVE_DECL___BUILTIN_CLZ 0
- | #define HAVE_DECL___BUILTIN_CLZL 0
- | #define HAVE_DECL___BUILTIN_CLZLL 0
- | #define HAVE_VISIBILITY_ATTRIBUTE 1
- | #define HAVE_GETENTROPY_RAND 1
- | #define HAVE_STD__SYSTEM 1
- | #define HAVE_SYSTEM HAVE_STD__SYSTEM || HAVE_WSYSTEM
- | /* end confdefs.h. */
- |
- | #include <db4/db_cxx.h>
- |
- | int
- | main ()
- | {
- |
- | #if !((DB_VERSION_MAJOR == 4 && DB_VERSION_MINOR >= 8) || DB_VERSION_MAJOR > 4)
- | #error "failed to find bdb 4.8+"
- | #endif
- |
- | ;
- | return 0;
- | }
- configure:28830: g++ -std=c++11 -c -g -O2 -DHAVE_BUILD_INFO -D__STDC_FORMAT_MACROS -I/usr/local/opt/berkeley-db@4/include -DMAC_OSX conftest.cpp >&5
- conftest.cpp:64:18: fatal error: 'bdb5/db_cxx.h' file not found
- #include <bdb5/db_cxx.h>
- ^~~~~~~~~~~~~~~
- 1 error generated.
- configure:28830: $? = 1
- configure: failed program was:
- | /* confdefs.h */
- | #define PACKAGE_NAME "Bitcoin Core"
- | #define PACKAGE_TARNAME "bitcoin"
- | #define PACKAGE_VERSION "0.18.99"
- | #define PACKAGE_STRING "Bitcoin Core 0.18.99"
- | #define PACKAGE_BUGREPORT "https://github.com/bitcoin/bitcoin/issues"
- | #define PACKAGE_URL "https://bitcoincore.org/"
- | #define HAVE_CXX11 1
- | #define STDC_HEADERS 1
- | #define HAVE_SYS_TYPES_H 1
- | #define HAVE_SYS_STAT_H 1
- | #define HAVE_STDLIB_H 1
- | #define HAVE_STRING_H 1
- | #define HAVE_MEMORY_H 1
- | #define HAVE_STRINGS_H 1
- | #define HAVE_INTTYPES_H 1
- | #define HAVE_STDINT_H 1
- | #define HAVE_UNISTD_H 1
- | #define HAVE_DLFCN_H 1
- | #define LT_OBJDIR ".libs/"
- | #define USE_ASM 1
- | #define ENABLE_SSE41 1
- | #define ENABLE_AVX2 1
- | #define ENABLE_SHANI 1
- | #define HAVE_PTHREAD_PRIO_INHERIT 1
- | #define HAVE_PTHREAD 1
- | #define HAVE_DECL_STRERROR_R 1
- | #define HAVE_STRERROR_R 1
- | #define HAVE_STDIO_H 1
- | #define HAVE_STDLIB_H 1
- | #define HAVE_UNISTD_H 1
- | #define HAVE_STRINGS_H 1
- | #define HAVE_SYS_TYPES_H 1
- | #define HAVE_SYS_STAT_H 1
- | #define HAVE_SYS_SELECT_H 1
- | #define HAVE_DECL_GETIFADDRS 1
- | #define HAVE_DECL_FREEIFADDRS 1
- | #define HAVE_DECL_STRNLEN 1
- | #define HAVE_DECL_DAEMON 1
- | #define HAVE_DECL_LE16TOH 0
- | #define HAVE_DECL_LE32TOH 0
- | #define HAVE_DECL_LE64TOH 0
- | #define HAVE_DECL_HTOLE16 0
- | #define HAVE_DECL_HTOLE32 0
- | #define HAVE_DECL_HTOLE64 0
- | #define HAVE_DECL_BE16TOH 0
- | #define HAVE_DECL_BE32TOH 0
- | #define HAVE_DECL_BE64TOH 0
- | #define HAVE_DECL_HTOBE16 0
- | #define HAVE_DECL_HTOBE32 0
- | #define HAVE_DECL_HTOBE64 0
- | #define HAVE_DECL_BSWAP_16 0
- | #define HAVE_DECL_BSWAP_32 0
- | #define HAVE_DECL_BSWAP_64 0
- | #define HAVE_DECL___BUILTIN_CLZ 0
- | #define HAVE_DECL___BUILTIN_CLZL 0
- | #define HAVE_DECL___BUILTIN_CLZLL 0
- | #define HAVE_VISIBILITY_ATTRIBUTE 1
- | #define HAVE_GETENTROPY_RAND 1
- | #define HAVE_STD__SYSTEM 1
- | #define HAVE_SYSTEM HAVE_STD__SYSTEM || HAVE_WSYSTEM
- | /* end confdefs.h. */
- |
- | #include <bdb5/db_cxx.h>
- |
- | int
- | main ()
- | {
- |
- | #if !((DB_VERSION_MAJOR == 4 && DB_VERSION_MINOR >= 8) || DB_VERSION_MAJOR > 4)
- | #error "failed to find bdb 4.8+"
- | #endif
- |
- | ;
- | return 0;
- | }
- configure:28830: g++ -std=c++11 -c -g -O2 -DHAVE_BUILD_INFO -D__STDC_FORMAT_MACROS -I/usr/local/opt/berkeley-db@4/include -DMAC_OSX conftest.cpp >&5
- conftest.cpp:64:18: fatal error: 'libdb5/db_cxx.h' file not found
- #include <libdb5/db_cxx.h>
- ^~~~~~~~~~~~~~~~~
- 1 error generated.
- configure:28830: $? = 1
- configure: failed program was:
- | /* confdefs.h */
- | #define PACKAGE_NAME "Bitcoin Core"
- | #define PACKAGE_TARNAME "bitcoin"
- | #define PACKAGE_VERSION "0.18.99"
- | #define PACKAGE_STRING "Bitcoin Core 0.18.99"
- | #define PACKAGE_BUGREPORT "https://github.com/bitcoin/bitcoin/issues"
- | #define PACKAGE_URL "https://bitcoincore.org/"
- | #define HAVE_CXX11 1
- | #define STDC_HEADERS 1
- | #define HAVE_SYS_TYPES_H 1
- | #define HAVE_SYS_STAT_H 1
- | #define HAVE_STDLIB_H 1
- | #define HAVE_STRING_H 1
- | #define HAVE_MEMORY_H 1
- | #define HAVE_STRINGS_H 1
- | #define HAVE_INTTYPES_H 1
- | #define HAVE_STDINT_H 1
- | #define HAVE_UNISTD_H 1
- | #define HAVE_DLFCN_H 1
- | #define LT_OBJDIR ".libs/"
- | #define USE_ASM 1
- | #define ENABLE_SSE41 1
- | #define ENABLE_AVX2 1
- | #define ENABLE_SHANI 1
- | #define HAVE_PTHREAD_PRIO_INHERIT 1
- | #define HAVE_PTHREAD 1
- | #define HAVE_DECL_STRERROR_R 1
- | #define HAVE_STRERROR_R 1
- | #define HAVE_STDIO_H 1
- | #define HAVE_STDLIB_H 1
- | #define HAVE_UNISTD_H 1
- | #define HAVE_STRINGS_H 1
- | #define HAVE_SYS_TYPES_H 1
- | #define HAVE_SYS_STAT_H 1
- | #define HAVE_SYS_SELECT_H 1
- | #define HAVE_DECL_GETIFADDRS 1
- | #define HAVE_DECL_FREEIFADDRS 1
- | #define HAVE_DECL_STRNLEN 1
- | #define HAVE_DECL_DAEMON 1
- | #define HAVE_DECL_LE16TOH 0
- | #define HAVE_DECL_LE32TOH 0
- | #define HAVE_DECL_LE64TOH 0
- | #define HAVE_DECL_HTOLE16 0
- | #define HAVE_DECL_HTOLE32 0
- | #define HAVE_DECL_HTOLE64 0
- | #define HAVE_DECL_BE16TOH 0
- | #define HAVE_DECL_BE32TOH 0
- | #define HAVE_DECL_BE64TOH 0
- | #define HAVE_DECL_HTOBE16 0
- | #define HAVE_DECL_HTOBE32 0
- | #define HAVE_DECL_HTOBE64 0
- | #define HAVE_DECL_BSWAP_16 0
- | #define HAVE_DECL_BSWAP_32 0
- | #define HAVE_DECL_BSWAP_64 0
- | #define HAVE_DECL___BUILTIN_CLZ 0
- | #define HAVE_DECL___BUILTIN_CLZL 0
- | #define HAVE_DECL___BUILTIN_CLZLL 0
- | #define HAVE_VISIBILITY_ATTRIBUTE 1
- | #define HAVE_GETENTROPY_RAND 1
- | #define HAVE_STD__SYSTEM 1
- | #define HAVE_SYSTEM HAVE_STD__SYSTEM || HAVE_WSYSTEM
- | /* end confdefs.h. */
- |
- | #include <libdb5/db_cxx.h>
- |
- | int
- | main ()
- | {
- |
- | #if !((DB_VERSION_MAJOR == 4 && DB_VERSION_MINOR >= 8) || DB_VERSION_MAJOR > 4)
- | #error "failed to find bdb 4.8+"
- | #endif
- |
- | ;
- | return 0;
- | }
- configure:28830: g++ -std=c++11 -c -g -O2 -DHAVE_BUILD_INFO -D__STDC_FORMAT_MACROS -I/usr/local/opt/berkeley-db@4/include -DMAC_OSX conftest.cpp >&5
- conftest.cpp:64:18: fatal error: 'db5/db_cxx.h' file not found
- #include <db5/db_cxx.h>
- ^~~~~~~~~~~~~~
- 1 error generated.
- configure:28830: $? = 1
- configure: failed program was:
- | /* confdefs.h */
- | #define PACKAGE_NAME "Bitcoin Core"
- | #define PACKAGE_TARNAME "bitcoin"
- | #define PACKAGE_VERSION "0.18.99"
- | #define PACKAGE_STRING "Bitcoin Core 0.18.99"
- | #define PACKAGE_BUGREPORT "https://github.com/bitcoin/bitcoin/issues"
- | #define PACKAGE_URL "https://bitcoincore.org/"
- | #define HAVE_CXX11 1
- | #define STDC_HEADERS 1
- | #define HAVE_SYS_TYPES_H 1
- | #define HAVE_SYS_STAT_H 1
- | #define HAVE_STDLIB_H 1
- | #define HAVE_STRING_H 1
- | #define HAVE_MEMORY_H 1
- | #define HAVE_STRINGS_H 1
- | #define HAVE_INTTYPES_H 1
- | #define HAVE_STDINT_H 1
- | #define HAVE_UNISTD_H 1
- | #define HAVE_DLFCN_H 1
- | #define LT_OBJDIR ".libs/"
- | #define USE_ASM 1
- | #define ENABLE_SSE41 1
- | #define ENABLE_AVX2 1
- | #define ENABLE_SHANI 1
- | #define HAVE_PTHREAD_PRIO_INHERIT 1
- | #define HAVE_PTHREAD 1
- | #define HAVE_DECL_STRERROR_R 1
- | #define HAVE_STRERROR_R 1
- | #define HAVE_STDIO_H 1
- | #define HAVE_STDLIB_H 1
- | #define HAVE_UNISTD_H 1
- | #define HAVE_STRINGS_H 1
- | #define HAVE_SYS_TYPES_H 1
- | #define HAVE_SYS_STAT_H 1
- | #define HAVE_SYS_SELECT_H 1
- | #define HAVE_DECL_GETIFADDRS 1
- | #define HAVE_DECL_FREEIFADDRS 1
- | #define HAVE_DECL_STRNLEN 1
- | #define HAVE_DECL_DAEMON 1
- | #define HAVE_DECL_LE16TOH 0
- | #define HAVE_DECL_LE32TOH 0
- | #define HAVE_DECL_LE64TOH 0
- | #define HAVE_DECL_HTOLE16 0
- | #define HAVE_DECL_HTOLE32 0
- | #define HAVE_DECL_HTOLE64 0
- | #define HAVE_DECL_BE16TOH 0
- | #define HAVE_DECL_BE32TOH 0
- | #define HAVE_DECL_BE64TOH 0
- | #define HAVE_DECL_HTOBE16 0
- | #define HAVE_DECL_HTOBE32 0
- | #define HAVE_DECL_HTOBE64 0
- | #define HAVE_DECL_BSWAP_16 0
- | #define HAVE_DECL_BSWAP_32 0
- | #define HAVE_DECL_BSWAP_64 0
- | #define HAVE_DECL___BUILTIN_CLZ 0
- | #define HAVE_DECL___BUILTIN_CLZL 0
- | #define HAVE_DECL___BUILTIN_CLZLL 0
- | #define HAVE_VISIBILITY_ATTRIBUTE 1
- | #define HAVE_GETENTROPY_RAND 1
- | #define HAVE_STD__SYSTEM 1
- | #define HAVE_SYSTEM HAVE_STD__SYSTEM || HAVE_WSYSTEM
- | /* end confdefs.h. */
- |
- | #include <db5/db_cxx.h>
- |
- | int
- | main ()
- | {
- |
- | #if !((DB_VERSION_MAJOR == 4 && DB_VERSION_MINOR >= 8) || DB_VERSION_MAJOR > 4)
- | #error "failed to find bdb 4.8+"
- | #endif
- |
- | ;
- | return 0;
- | }
- configure:28830: g++ -std=c++11 -c -g -O2 -DHAVE_BUILD_INFO -D__STDC_FORMAT_MACROS -I/usr/local/opt/berkeley-db@4/include -DMAC_OSX conftest.cpp >&5
- conftest.cpp:64:18: fatal error: 'bdb5.3/db_cxx.h' file not found
- #include <bdb5.3/db_cxx.h>
- ^~~~~~~~~~~~~~~~~
- 1 error generated.
- configure:28830: $? = 1
- configure: failed program was:
- | /* confdefs.h */
- | #define PACKAGE_NAME "Bitcoin Core"
- | #define PACKAGE_TARNAME "bitcoin"
- | #define PACKAGE_VERSION "0.18.99"
- | #define PACKAGE_STRING "Bitcoin Core 0.18.99"
- | #define PACKAGE_BUGREPORT "https://github.com/bitcoin/bitcoin/issues"
- | #define PACKAGE_URL "https://bitcoincore.org/"
- | #define HAVE_CXX11 1
- | #define STDC_HEADERS 1
- | #define HAVE_SYS_TYPES_H 1
- | #define HAVE_SYS_STAT_H 1
- | #define HAVE_STDLIB_H 1
- | #define HAVE_STRING_H 1
- | #define HAVE_MEMORY_H 1
- | #define HAVE_STRINGS_H 1
- | #define HAVE_INTTYPES_H 1
- | #define HAVE_STDINT_H 1
- | #define HAVE_UNISTD_H 1
- | #define HAVE_DLFCN_H 1
- | #define LT_OBJDIR ".libs/"
- | #define USE_ASM 1
- | #define ENABLE_SSE41 1
- | #define ENABLE_AVX2 1
- | #define ENABLE_SHANI 1
- | #define HAVE_PTHREAD_PRIO_INHERIT 1
- | #define HAVE_PTHREAD 1
- | #define HAVE_DECL_STRERROR_R 1
- | #define HAVE_STRERROR_R 1
- | #define HAVE_STDIO_H 1
- | #define HAVE_STDLIB_H 1
- | #define HAVE_UNISTD_H 1
- | #define HAVE_STRINGS_H 1
- | #define HAVE_SYS_TYPES_H 1
- | #define HAVE_SYS_STAT_H 1
- | #define HAVE_SYS_SELECT_H 1
- | #define HAVE_DECL_GETIFADDRS 1
- | #define HAVE_DECL_FREEIFADDRS 1
- | #define HAVE_DECL_STRNLEN 1
- | #define HAVE_DECL_DAEMON 1
- | #define HAVE_DECL_LE16TOH 0
- | #define HAVE_DECL_LE32TOH 0
- | #define HAVE_DECL_LE64TOH 0
- | #define HAVE_DECL_HTOLE16 0
- | #define HAVE_DECL_HTOLE32 0
- | #define HAVE_DECL_HTOLE64 0
- | #define HAVE_DECL_BE16TOH 0
- | #define HAVE_DECL_BE32TOH 0
- | #define HAVE_DECL_BE64TOH 0
- | #define HAVE_DECL_HTOBE16 0
- | #define HAVE_DECL_HTOBE32 0
- | #define HAVE_DECL_HTOBE64 0
- | #define HAVE_DECL_BSWAP_16 0
- | #define HAVE_DECL_BSWAP_32 0
- | #define HAVE_DECL_BSWAP_64 0
- | #define HAVE_DECL___BUILTIN_CLZ 0
- | #define HAVE_DECL___BUILTIN_CLZL 0
- | #define HAVE_DECL___BUILTIN_CLZLL 0
- | #define HAVE_VISIBILITY_ATTRIBUTE 1
- | #define HAVE_GETENTROPY_RAND 1
- | #define HAVE_STD__SYSTEM 1
- | #define HAVE_SYSTEM HAVE_STD__SYSTEM || HAVE_WSYSTEM
- | /* end confdefs.h. */
- |
- | #include <bdb5.3/db_cxx.h>
- |
- | int
- | main ()
- | {
- |
- | #if !((DB_VERSION_MAJOR == 4 && DB_VERSION_MINOR >= 8) || DB_VERSION_MAJOR > 4)
- | #error "failed to find bdb 4.8+"
- | #endif
- |
- | ;
- | return 0;
- | }
- configure:28830: g++ -std=c++11 -c -g -O2 -DHAVE_BUILD_INFO -D__STDC_FORMAT_MACROS -I/usr/local/opt/berkeley-db@4/include -DMAC_OSX conftest.cpp >&5
- conftest.cpp:64:18: fatal error: 'libdb5.3/db_cxx.h' file not found
- #include <libdb5.3/db_cxx.h>
- ^~~~~~~~~~~~~~~~~~~
- 1 error generated.
- configure:28830: $? = 1
- configure: failed program was:
- | /* confdefs.h */
- | #define PACKAGE_NAME "Bitcoin Core"
- | #define PACKAGE_TARNAME "bitcoin"
- | #define PACKAGE_VERSION "0.18.99"
- | #define PACKAGE_STRING "Bitcoin Core 0.18.99"
- | #define PACKAGE_BUGREPORT "https://github.com/bitcoin/bitcoin/issues"
- | #define PACKAGE_URL "https://bitcoincore.org/"
- | #define HAVE_CXX11 1
- | #define STDC_HEADERS 1
- | #define HAVE_SYS_TYPES_H 1
- | #define HAVE_SYS_STAT_H 1
- | #define HAVE_STDLIB_H 1
- | #define HAVE_STRING_H 1
- | #define HAVE_MEMORY_H 1
- | #define HAVE_STRINGS_H 1
- | #define HAVE_INTTYPES_H 1
- | #define HAVE_STDINT_H 1
- | #define HAVE_UNISTD_H 1
- | #define HAVE_DLFCN_H 1
- | #define LT_OBJDIR ".libs/"
- | #define USE_ASM 1
- | #define ENABLE_SSE41 1
- | #define ENABLE_AVX2 1
- | #define ENABLE_SHANI 1
- | #define HAVE_PTHREAD_PRIO_INHERIT 1
- | #define HAVE_PTHREAD 1
- | #define HAVE_DECL_STRERROR_R 1
- | #define HAVE_STRERROR_R 1
- | #define HAVE_STDIO_H 1
- | #define HAVE_STDLIB_H 1
- | #define HAVE_UNISTD_H 1
- | #define HAVE_STRINGS_H 1
- | #define HAVE_SYS_TYPES_H 1
- | #define HAVE_SYS_STAT_H 1
- | #define HAVE_SYS_SELECT_H 1
- | #define HAVE_DECL_GETIFADDRS 1
- | #define HAVE_DECL_FREEIFADDRS 1
- | #define HAVE_DECL_STRNLEN 1
- | #define HAVE_DECL_DAEMON 1
- | #define HAVE_DECL_LE16TOH 0
- | #define HAVE_DECL_LE32TOH 0
- | #define HAVE_DECL_LE64TOH 0
- | #define HAVE_DECL_HTOLE16 0
- | #define HAVE_DECL_HTOLE32 0
- | #define HAVE_DECL_HTOLE64 0
- | #define HAVE_DECL_BE16TOH 0
- | #define HAVE_DECL_BE32TOH 0
- | #define HAVE_DECL_BE64TOH 0
- | #define HAVE_DECL_HTOBE16 0
- | #define HAVE_DECL_HTOBE32 0
- | #define HAVE_DECL_HTOBE64 0
- | #define HAVE_DECL_BSWAP_16 0
- | #define HAVE_DECL_BSWAP_32 0
- | #define HAVE_DECL_BSWAP_64 0
- | #define HAVE_DECL___BUILTIN_CLZ 0
- | #define HAVE_DECL___BUILTIN_CLZL 0
- | #define HAVE_DECL___BUILTIN_CLZLL 0
- | #define HAVE_VISIBILITY_ATTRIBUTE 1
- | #define HAVE_GETENTROPY_RAND 1
- | #define HAVE_STD__SYSTEM 1
- | #define HAVE_SYSTEM HAVE_STD__SYSTEM || HAVE_WSYSTEM
- | /* end confdefs.h. */
- |
- | #include <libdb5.3/db_cxx.h>
- |
- | int
- | main ()
- | {
- |
- | #if !((DB_VERSION_MAJOR == 4 && DB_VERSION_MINOR >= 8) || DB_VERSION_MAJOR > 4)
- | #error "failed to find bdb 4.8+"
- | #endif
- |
- | ;
- | return 0;
- | }
- configure:28830: g++ -std=c++11 -c -g -O2 -DHAVE_BUILD_INFO -D__STDC_FORMAT_MACROS -I/usr/local/opt/berkeley-db@4/include -DMAC_OSX conftest.cpp >&5
- conftest.cpp:64:18: fatal error: 'db5.3/db_cxx.h' file not found
- #include <db5.3/db_cxx.h>
- ^~~~~~~~~~~~~~~~
- 1 error generated.
- configure:28830: $? = 1
- configure: failed program was:
- | /* confdefs.h */
- | #define PACKAGE_NAME "Bitcoin Core"
- | #define PACKAGE_TARNAME "bitcoin"
- | #define PACKAGE_VERSION "0.18.99"
- | #define PACKAGE_STRING "Bitcoin Core 0.18.99"
- | #define PACKAGE_BUGREPORT "https://github.com/bitcoin/bitcoin/issues"
- | #define PACKAGE_URL "https://bitcoincore.org/"
- | #define HAVE_CXX11 1
- | #define STDC_HEADERS 1
- | #define HAVE_SYS_TYPES_H 1
- | #define HAVE_SYS_STAT_H 1
- | #define HAVE_STDLIB_H 1
- | #define HAVE_STRING_H 1
- | #define HAVE_MEMORY_H 1
- | #define HAVE_STRINGS_H 1
- | #define HAVE_INTTYPES_H 1
- | #define HAVE_STDINT_H 1
- | #define HAVE_UNISTD_H 1
- | #define HAVE_DLFCN_H 1
- | #define LT_OBJDIR ".libs/"
- | #define USE_ASM 1
- | #define ENABLE_SSE41 1
- | #define ENABLE_AVX2 1
- | #define ENABLE_SHANI 1
- | #define HAVE_PTHREAD_PRIO_INHERIT 1
- | #define HAVE_PTHREAD 1
- | #define HAVE_DECL_STRERROR_R 1
- | #define HAVE_STRERROR_R 1
- | #define HAVE_STDIO_H 1
- | #define HAVE_STDLIB_H 1
- | #define HAVE_UNISTD_H 1
- | #define HAVE_STRINGS_H 1
- | #define HAVE_SYS_TYPES_H 1
- | #define HAVE_SYS_STAT_H 1
- | #define HAVE_SYS_SELECT_H 1
- | #define HAVE_DECL_GETIFADDRS 1
- | #define HAVE_DECL_FREEIFADDRS 1
- | #define HAVE_DECL_STRNLEN 1
- | #define HAVE_DECL_DAEMON 1
- | #define HAVE_DECL_LE16TOH 0
- | #define HAVE_DECL_LE32TOH 0
- | #define HAVE_DECL_LE64TOH 0
- | #define HAVE_DECL_HTOLE16 0
- | #define HAVE_DECL_HTOLE32 0
- | #define HAVE_DECL_HTOLE64 0
- | #define HAVE_DECL_BE16TOH 0
- | #define HAVE_DECL_BE32TOH 0
- | #define HAVE_DECL_BE64TOH 0
- | #define HAVE_DECL_HTOBE16 0
- | #define HAVE_DECL_HTOBE32 0
- | #define HAVE_DECL_HTOBE64 0
- | #define HAVE_DECL_BSWAP_16 0
- | #define HAVE_DECL_BSWAP_32 0
- | #define HAVE_DECL_BSWAP_64 0
- | #define HAVE_DECL___BUILTIN_CLZ 0
- | #define HAVE_DECL___BUILTIN_CLZL 0
- | #define HAVE_DECL___BUILTIN_CLZLL 0
- | #define HAVE_VISIBILITY_ATTRIBUTE 1
- | #define HAVE_GETENTROPY_RAND 1
- | #define HAVE_STD__SYSTEM 1
- | #define HAVE_SYSTEM HAVE_STD__SYSTEM || HAVE_WSYSTEM
- | /* end confdefs.h. */
- |
- | #include <db5.3/db_cxx.h>
- |
- | int
- | main ()
- | {
- |
- | #if !((DB_VERSION_MAJOR == 4 && DB_VERSION_MINOR >= 8) || DB_VERSION_MAJOR > 4)
- | #error "failed to find bdb 4.8+"
- | #endif
- |
- | ;
- | return 0;
- | }
- configure:28830: g++ -std=c++11 -c -g -O2 -DHAVE_BUILD_INFO -D__STDC_FORMAT_MACROS -I/usr/local/opt/berkeley-db@4/include -DMAC_OSX conftest.cpp >&5
- conftest.cpp:64:18: fatal error: 'bdb/db_cxx.h' file not found
- #include <bdb/db_cxx.h>
- ^~~~~~~~~~~~~~
- 1 error generated.
- configure:28830: $? = 1
- configure: failed program was:
- | /* confdefs.h */
- | #define PACKAGE_NAME "Bitcoin Core"
- | #define PACKAGE_TARNAME "bitcoin"
- | #define PACKAGE_VERSION "0.18.99"
- | #define PACKAGE_STRING "Bitcoin Core 0.18.99"
- | #define PACKAGE_BUGREPORT "https://github.com/bitcoin/bitcoin/issues"
- | #define PACKAGE_URL "https://bitcoincore.org/"
- | #define HAVE_CXX11 1
- | #define STDC_HEADERS 1
- | #define HAVE_SYS_TYPES_H 1
- | #define HAVE_SYS_STAT_H 1
- | #define HAVE_STDLIB_H 1
- | #define HAVE_STRING_H 1
- | #define HAVE_MEMORY_H 1
- | #define HAVE_STRINGS_H 1
- | #define HAVE_INTTYPES_H 1
- | #define HAVE_STDINT_H 1
- | #define HAVE_UNISTD_H 1
- | #define HAVE_DLFCN_H 1
- | #define LT_OBJDIR ".libs/"
- | #define USE_ASM 1
- | #define ENABLE_SSE41 1
- | #define ENABLE_AVX2 1
- | #define ENABLE_SHANI 1
- | #define HAVE_PTHREAD_PRIO_INHERIT 1
- | #define HAVE_PTHREAD 1
- | #define HAVE_DECL_STRERROR_R 1
- | #define HAVE_STRERROR_R 1
- | #define HAVE_STDIO_H 1
- | #define HAVE_STDLIB_H 1
- | #define HAVE_UNISTD_H 1
- | #define HAVE_STRINGS_H 1
- | #define HAVE_SYS_TYPES_H 1
- | #define HAVE_SYS_STAT_H 1
- | #define HAVE_SYS_SELECT_H 1
- | #define HAVE_DECL_GETIFADDRS 1
- | #define HAVE_DECL_FREEIFADDRS 1
- | #define HAVE_DECL_STRNLEN 1
- | #define HAVE_DECL_DAEMON 1
- | #define HAVE_DECL_LE16TOH 0
- | #define HAVE_DECL_LE32TOH 0
- | #define HAVE_DECL_LE64TOH 0
- | #define HAVE_DECL_HTOLE16 0
- | #define HAVE_DECL_HTOLE32 0
- | #define HAVE_DECL_HTOLE64 0
- | #define HAVE_DECL_BE16TOH 0
- | #define HAVE_DECL_BE32TOH 0
- | #define HAVE_DECL_BE64TOH 0
- | #define HAVE_DECL_HTOBE16 0
- | #define HAVE_DECL_HTOBE32 0
- | #define HAVE_DECL_HTOBE64 0
- | #define HAVE_DECL_BSWAP_16 0
- | #define HAVE_DECL_BSWAP_32 0
- | #define HAVE_DECL_BSWAP_64 0
- | #define HAVE_DECL___BUILTIN_CLZ 0
- | #define HAVE_DECL___BUILTIN_CLZL 0
- | #define HAVE_DECL___BUILTIN_CLZLL 0
- | #define HAVE_VISIBILITY_ATTRIBUTE 1
- | #define HAVE_GETENTROPY_RAND 1
- | #define HAVE_STD__SYSTEM 1
- | #define HAVE_SYSTEM HAVE_STD__SYSTEM || HAVE_WSYSTEM
- | /* end confdefs.h. */
- |
- | #include <bdb/db_cxx.h>
- |
- | int
- | main ()
- | {
- |
- | #if !((DB_VERSION_MAJOR == 4 && DB_VERSION_MINOR >= 8) || DB_VERSION_MAJOR > 4)
- | #error "failed to find bdb 4.8+"
- | #endif
- |
- | ;
- | return 0;
- | }
- configure:28830: g++ -std=c++11 -c -g -O2 -DHAVE_BUILD_INFO -D__STDC_FORMAT_MACROS -I/usr/local/opt/berkeley-db@4/include -DMAC_OSX conftest.cpp >&5
- conftest.cpp:64:18: fatal error: 'libdb/db_cxx.h' file not found
- #include <libdb/db_cxx.h>
- ^~~~~~~~~~~~~~~~
- 1 error generated.
- configure:28830: $? = 1
- configure: failed program was:
- | /* confdefs.h */
- | #define PACKAGE_NAME "Bitcoin Core"
- | #define PACKAGE_TARNAME "bitcoin"
- | #define PACKAGE_VERSION "0.18.99"
- | #define PACKAGE_STRING "Bitcoin Core 0.18.99"
- | #define PACKAGE_BUGREPORT "https://github.com/bitcoin/bitcoin/issues"
- | #define PACKAGE_URL "https://bitcoincore.org/"
- | #define HAVE_CXX11 1
- | #define STDC_HEADERS 1
- | #define HAVE_SYS_TYPES_H 1
- | #define HAVE_SYS_STAT_H 1
- | #define HAVE_STDLIB_H 1
- | #define HAVE_STRING_H 1
- | #define HAVE_MEMORY_H 1
- | #define HAVE_STRINGS_H 1
- | #define HAVE_INTTYPES_H 1
- | #define HAVE_STDINT_H 1
- | #define HAVE_UNISTD_H 1
- | #define HAVE_DLFCN_H 1
- | #define LT_OBJDIR ".libs/"
- | #define USE_ASM 1
- | #define ENABLE_SSE41 1
- | #define ENABLE_AVX2 1
- | #define ENABLE_SHANI 1
- | #define HAVE_PTHREAD_PRIO_INHERIT 1
- | #define HAVE_PTHREAD 1
- | #define HAVE_DECL_STRERROR_R 1
- | #define HAVE_STRERROR_R 1
- | #define HAVE_STDIO_H 1
- | #define HAVE_STDLIB_H 1
- | #define HAVE_UNISTD_H 1
- | #define HAVE_STRINGS_H 1
- | #define HAVE_SYS_TYPES_H 1
- | #define HAVE_SYS_STAT_H 1
- | #define HAVE_SYS_SELECT_H 1
- | #define HAVE_DECL_GETIFADDRS 1
- | #define HAVE_DECL_FREEIFADDRS 1
- | #define HAVE_DECL_STRNLEN 1
- | #define HAVE_DECL_DAEMON 1
- | #define HAVE_DECL_LE16TOH 0
- | #define HAVE_DECL_LE32TOH 0
- | #define HAVE_DECL_LE64TOH 0
- | #define HAVE_DECL_HTOLE16 0
- | #define HAVE_DECL_HTOLE32 0
- | #define HAVE_DECL_HTOLE64 0
- | #define HAVE_DECL_BE16TOH 0
- | #define HAVE_DECL_BE32TOH 0
- | #define HAVE_DECL_BE64TOH 0
- | #define HAVE_DECL_HTOBE16 0
- | #define HAVE_DECL_HTOBE32 0
- | #define HAVE_DECL_HTOBE64 0
- | #define HAVE_DECL_BSWAP_16 0
- | #define HAVE_DECL_BSWAP_32 0
- | #define HAVE_DECL_BSWAP_64 0
- | #define HAVE_DECL___BUILTIN_CLZ 0
- | #define HAVE_DECL___BUILTIN_CLZL 0
- | #define HAVE_DECL___BUILTIN_CLZLL 0
- | #define HAVE_VISIBILITY_ATTRIBUTE 1
- | #define HAVE_GETENTROPY_RAND 1
- | #define HAVE_STD__SYSTEM 1
- | #define HAVE_SYSTEM HAVE_STD__SYSTEM || HAVE_WSYSTEM
- | /* end confdefs.h. */
- |
- | #include <libdb/db_cxx.h>
- |
- | int
- | main ()
- | {
- |
- | #if !((DB_VERSION_MAJOR == 4 && DB_VERSION_MINOR >= 8) || DB_VERSION_MAJOR > 4)
- | #error "failed to find bdb 4.8+"
- | #endif
- |
- | ;
- | return 0;
- | }
- configure:28830: g++ -std=c++11 -c -g -O2 -DHAVE_BUILD_INFO -D__STDC_FORMAT_MACROS -I/usr/local/opt/berkeley-db@4/include -DMAC_OSX conftest.cpp >&5
- conftest.cpp:64:18: fatal error: 'db/db_cxx.h' file not found
- #include <db/db_cxx.h>
- ^~~~~~~~~~~~~
- 1 error generated.
- configure:28830: $? = 1
- configure: failed program was:
- | /* confdefs.h */
- | #define PACKAGE_NAME "Bitcoin Core"
- | #define PACKAGE_TARNAME "bitcoin"
- | #define PACKAGE_VERSION "0.18.99"
- | #define PACKAGE_STRING "Bitcoin Core 0.18.99"
- | #define PACKAGE_BUGREPORT "https://github.com/bitcoin/bitcoin/issues"
- | #define PACKAGE_URL "https://bitcoincore.org/"
- | #define HAVE_CXX11 1
- | #define STDC_HEADERS 1
- | #define HAVE_SYS_TYPES_H 1
- | #define HAVE_SYS_STAT_H 1
- | #define HAVE_STDLIB_H 1
- | #define HAVE_STRING_H 1
- | #define HAVE_MEMORY_H 1
- | #define HAVE_STRINGS_H 1
- | #define HAVE_INTTYPES_H 1
- | #define HAVE_STDINT_H 1
- | #define HAVE_UNISTD_H 1
- | #define HAVE_DLFCN_H 1
- | #define LT_OBJDIR ".libs/"
- | #define USE_ASM 1
- | #define ENABLE_SSE41 1
- | #define ENABLE_AVX2 1
- | #define ENABLE_SHANI 1
- | #define HAVE_PTHREAD_PRIO_INHERIT 1
- | #define HAVE_PTHREAD 1
- | #define HAVE_DECL_STRERROR_R 1
- | #define HAVE_STRERROR_R 1
- | #define HAVE_STDIO_H 1
- | #define HAVE_STDLIB_H 1
- | #define HAVE_UNISTD_H 1
- | #define HAVE_STRINGS_H 1
- | #define HAVE_SYS_TYPES_H 1
- | #define HAVE_SYS_STAT_H 1
- | #define HAVE_SYS_SELECT_H 1
- | #define HAVE_DECL_GETIFADDRS 1
- | #define HAVE_DECL_FREEIFADDRS 1
- | #define HAVE_DECL_STRNLEN 1
- | #define HAVE_DECL_DAEMON 1
- | #define HAVE_DECL_LE16TOH 0
- | #define HAVE_DECL_LE32TOH 0
- | #define HAVE_DECL_LE64TOH 0
- | #define HAVE_DECL_HTOLE16 0
- | #define HAVE_DECL_HTOLE32 0
- | #define HAVE_DECL_HTOLE64 0
- | #define HAVE_DECL_BE16TOH 0
- | #define HAVE_DECL_BE32TOH 0
- | #define HAVE_DECL_BE64TOH 0
- | #define HAVE_DECL_HTOBE16 0
- | #define HAVE_DECL_HTOBE32 0
- | #define HAVE_DECL_HTOBE64 0
- | #define HAVE_DECL_BSWAP_16 0
- | #define HAVE_DECL_BSWAP_32 0
- | #define HAVE_DECL_BSWAP_64 0
- | #define HAVE_DECL___BUILTIN_CLZ 0
- | #define HAVE_DECL___BUILTIN_CLZL 0
- | #define HAVE_DECL___BUILTIN_CLZLL 0
- | #define HAVE_VISIBILITY_ATTRIBUTE 1
- | #define HAVE_GETENTROPY_RAND 1
- | #define HAVE_STD__SYSTEM 1
- | #define HAVE_SYSTEM HAVE_STD__SYSTEM || HAVE_WSYSTEM
- | /* end confdefs.h. */
- |
- | #include <db/db_cxx.h>
- |
- | int
- | main ()
- | {
- |
- | #if !((DB_VERSION_MAJOR == 4 && DB_VERSION_MINOR >= 8) || DB_VERSION_MAJOR > 4)
- | #error "failed to find bdb 4.8+"
- | #endif
- |
- | ;
- | return 0;
- | }
- configure:28830: g++ -std=c++11 -c -g -O2 -DHAVE_BUILD_INFO -D__STDC_FORMAT_MACROS -I/usr/local/opt/berkeley-db@4/include -DMAC_OSX conftest.cpp >&5
- configure:28830: $? = 0
- configure:28859: g++ -std=c++11 -c -g -O2 -DHAVE_BUILD_INFO -D__STDC_FORMAT_MACROS -I/usr/local/opt/berkeley-db@4/include -DMAC_OSX conftest.cpp >&5
- configure:28859: $? = 0
- configure:28902: result: default
- configure:28925: checking for main in -ldb_cxx-4.8
- configure:28944: g++ -std=c++11 -o conftest -g -O2 -DHAVE_BUILD_INFO -D__STDC_FORMAT_MACROS -I/usr/local/opt/berkeley-db@4/include -DMAC_OSX -Wl,-headerpad_max_install_names -Wl,-dead_strip conftest.cpp -ldb_cxx-4.8 -L/usr/local/opt/berkeley-db@4/lib >&5
- configure:28944: $? = 0
- configure:28954: result: yes
- configure:28976: checking miniupnpc/miniwget.h usability
- configure:28976: g++ -std=c++11 -c -g -O2 -DHAVE_BUILD_INFO -D__STDC_FORMAT_MACROS -I/usr/local/opt/berkeley-db@4/include -DMAC_OSX conftest.cpp >&5
- configure:28976: $? = 0
- configure:28976: result: yes
- configure:28976: checking miniupnpc/miniwget.h presence
- configure:28976: g++ -std=c++11 -E -DHAVE_BUILD_INFO -D__STDC_FORMAT_MACROS -I/usr/local/opt/berkeley-db@4/include -DMAC_OSX conftest.cpp
- configure:28976: $? = 0
- configure:28976: result: yes
- configure:28976: checking for miniupnpc/miniwget.h
- configure:28976: result: yes
- configure:28981: checking for upnpDiscover in -lminiupnpc
- configure:29006: g++ -std=c++11 -o conftest -g -O2 -DHAVE_BUILD_INFO -D__STDC_FORMAT_MACROS -I/usr/local/opt/berkeley-db@4/include -DMAC_OSX -Wl,-headerpad_max_install_names -Wl,-dead_strip conftest.cpp -lminiupnpc -L/usr/local/opt/berkeley-db@4/lib >&5
- configure:29006: $? = 0
- configure:29015: result: yes
- configure:28976: checking miniupnpc/miniupnpc.h usability
- configure:28976: g++ -std=c++11 -c -g -O2 -DHAVE_BUILD_INFO -D__STDC_FORMAT_MACROS -I/usr/local/opt/berkeley-db@4/include -DMAC_OSX conftest.cpp >&5
- configure:28976: $? = 0
- configure:28976: result: yes
- configure:28976: checking miniupnpc/miniupnpc.h presence
- configure:28976: g++ -std=c++11 -E -DHAVE_BUILD_INFO -D__STDC_FORMAT_MACROS -I/usr/local/opt/berkeley-db@4/include -DMAC_OSX conftest.cpp
- configure:28976: $? = 0
- configure:28976: result: yes
- configure:28976: checking for miniupnpc/miniupnpc.h
- configure:28976: result: yes
- configure:28981: checking for upnpDiscover in -lminiupnpc
- configure:29015: result: yes
- configure:28976: checking miniupnpc/upnpcommands.h usability
- configure:28976: g++ -std=c++11 -c -g -O2 -DHAVE_BUILD_INFO -D__STDC_FORMAT_MACROS -I/usr/local/opt/berkeley-db@4/include -DMAC_OSX conftest.cpp >&5
- configure:28976: $? = 0
- configure:28976: result: yes
- configure:28976: checking miniupnpc/upnpcommands.h presence
- configure:28976: g++ -std=c++11 -E -DHAVE_BUILD_INFO -D__STDC_FORMAT_MACROS -I/usr/local/opt/berkeley-db@4/include -DMAC_OSX conftest.cpp
- configure:28976: $? = 0
- configure:28976: result: yes
- configure:28976: checking for miniupnpc/upnpcommands.h
- configure:28976: result: yes
- configure:28981: checking for upnpDiscover in -lminiupnpc
- configure:29015: result: yes
- configure:28976: checking miniupnpc/upnperrors.h usability
- configure:28976: g++ -std=c++11 -c -g -O2 -DHAVE_BUILD_INFO -D__STDC_FORMAT_MACROS -I/usr/local/opt/berkeley-db@4/include -DMAC_OSX conftest.cpp >&5
- configure:28976: $? = 0
- configure:28976: result: yes
- configure:28976: checking miniupnpc/upnperrors.h presence
- configure:28976: g++ -std=c++11 -E -DHAVE_BUILD_INFO -D__STDC_FORMAT_MACROS -I/usr/local/opt/berkeley-db@4/include -DMAC_OSX conftest.cpp
- configure:28976: $? = 0
- configure:28976: result: yes
- configure:28976: checking for miniupnpc/upnperrors.h
- configure:28976: result: yes
- configure:28981: checking for upnpDiscover in -lminiupnpc
- configure:29015: result: yes
- configure:29031: checking whether miniUPnPc API version is supported
- configure:29052: g++ -std=c++11 -E -DHAVE_BUILD_INFO -D__STDC_FORMAT_MACROS -I/usr/local/opt/berkeley-db@4/include -DMAC_OSX conftest.cpp
- configure:29052: $? = 0
- configure:29054: result: yes
- configure:29217: checking for boostlib >= 1.47.0 (104700)
- configure:29249: g++ -std=c++11 -c -g -O2 -DHAVE_BUILD_INFO -D__STDC_FORMAT_MACROS -I/usr/local/opt/berkeley-db@4/include -DMAC_OSX -I/usr/local/include conftest.cpp >&5
- configure:29249: $? = 0
- configure:29251: result: yes
- configure:29446: checking whether the Boost::System library is available
- configure:29471: g++ -std=c++11 -c -DHAVE_BUILD_INFO -D__STDC_FORMAT_MACROS -I/usr/local/opt/berkeley-db@4/include -DMAC_OSX -I/usr/local/include conftest.cpp >&5
- configure:29471: $? = 0
- configure:29486: result: yes
- configure:29501: checking for exit in -lboost_system
- configure:29526: g++ -std=c++11 -o conftest -g -O2 -DHAVE_BUILD_INFO -D__STDC_FORMAT_MACROS -I/usr/local/opt/berkeley-db@4/include -DMAC_OSX -I/usr/local/include -Wl,-headerpad_max_install_names -Wl,-dead_strip -L/usr/local/lib conftest.cpp -lboost_system -L/usr/local/opt/berkeley-db@4/lib >&5
- configure:29526: $? = 0
- configure:29536: result: yes
- configure:29691: checking whether the Boost::Filesystem library is available
- configure:29715: g++ -std=c++11 -c -g -O2 -DHAVE_BUILD_INFO -D__STDC_FORMAT_MACROS -I/usr/local/opt/berkeley-db@4/include -DMAC_OSX -I/usr/local/include conftest.cpp >&5
- configure:29715: $? = 0
- configure:29729: result: yes
- configure:29741: checking for exit in -lboost_filesystem
- configure:29766: g++ -std=c++11 -o conftest -g -O2 -DHAVE_BUILD_INFO -D__STDC_FORMAT_MACROS -I/usr/local/opt/berkeley-db@4/include -DMAC_OSX -I/usr/local/include -Wl,-headerpad_max_install_names -Wl,-dead_strip -L/usr/local/lib conftest.cpp -lboost_filesystem -L/usr/local/opt/berkeley-db@4/lib -lboost_system >&5
- configure:29766: $? = 0
- configure:29776: result: yes
- configure:29928: checking whether the Boost::Thread library is available
- configure:29960: g++ -std=c++11 -c -pthread -g -O2 -DHAVE_BUILD_INFO -D__STDC_FORMAT_MACROS -I/usr/local/opt/berkeley-db@4/include -DMAC_OSX -I/usr/local/include conftest.cpp >&5
- configure:29960: $? = 0
- configure:29975: result: yes
- configure:30005: checking for exit in -lboost_thread-mt
- configure:30030: g++ -std=c++11 -o conftest -g -O2 -DHAVE_BUILD_INFO -D__STDC_FORMAT_MACROS -I/usr/local/opt/berkeley-db@4/include -DMAC_OSX -I/usr/local/include -Wl,-headerpad_max_install_names -Wl,-dead_strip -L/usr/local/lib conftest.cpp -lboost_thread-mt -L/usr/local/opt/berkeley-db@4/lib >&5
- configure:30030: $? = 0
- configure:30040: result: yes
- configure:30200: checking whether the Boost::Chrono library is available
- configure:30224: g++ -std=c++11 -c -g -O2 -DHAVE_BUILD_INFO -D__STDC_FORMAT_MACROS -I/usr/local/opt/berkeley-db@4/include -DMAC_OSX -pthread -I/usr/local/include conftest.cpp >&5
- configure:30224: $? = 0
- configure:30239: result: yes
- configure:30254: checking for exit in -lboost_chrono-mt
- configure:30279: g++ -std=c++11 -o conftest -g -O2 -DHAVE_BUILD_INFO -D__STDC_FORMAT_MACROS -I/usr/local/opt/berkeley-db@4/include -DMAC_OSX -pthread -I/usr/local/include -Wl,-headerpad_max_install_names -Wl,-dead_strip -L/usr/local/lib conftest.cpp -lboost_chrono-mt -L/usr/local/opt/berkeley-db@4/lib >&5
- configure:30279: $? = 0
- configure:30289: result: yes
- configure:30531: checking whether the Boost::Unit_Test_Framework library is available
- configure:30554: g++ -std=c++11 -c -g -O2 -DHAVE_BUILD_INFO -D__STDC_FORMAT_MACROS -I/usr/local/opt/berkeley-db@4/include -DMAC_OSX -DBOOST_SP_USE_STD_ATOMIC -DBOOST_AC_USE_STD_ATOMIC -pthread -I/usr/local/include conftest.cpp >&5
- configure:30554: $? = 0
- configure:30568: result: yes
- configure:30679: checking for dynamic linked boost test
- configure:30694: g++ -std=c++11 -o conftest -g -O2 -DHAVE_BUILD_INFO -D__STDC_FORMAT_MACROS -I/usr/local/opt/berkeley-db@4/include -DMAC_OSX -DBOOST_SP_USE_STD_ATOMIC -DBOOST_AC_USE_STD_ATOMIC -pthread -I/usr/local/include -Wl,-headerpad_max_install_names -Wl,-dead_strip conftest.cpp -L/usr/local/opt/berkeley-db@4/lib -L/usr/local/lib -lboost_unit_test_framework-mt >&5
- configure:30694: $? = 0
- configure:30695: result: yes
- configure:30721: checking for mismatched boost c++11 scoped enums
- configure:30749: g++ -std=c++11 -o conftest -g -O2 -DHAVE_BUILD_INFO -D__STDC_FORMAT_MACROS -I/usr/local/opt/berkeley-db@4/include -DMAC_OSX -DBOOST_SP_USE_STD_ATOMIC -DBOOST_AC_USE_STD_ATOMIC -pthread -I/usr/local/include -Wl,-headerpad_max_install_names -Wl,-dead_strip conftest.cpp -L/usr/local/lib -lboost_system -lboost_filesystem -lboost_thread-mt -lboost_chrono-mt -L/usr/local/opt/berkeley-db@4/lib >&5
- conftest.cpp:90:5: error: use of undeclared identifier 'choke'
- choke;
- ^
- 1 error generated.
- configure:30749: $? = 1
- configure: failed program was:
- | /* confdefs.h */
- | #define PACKAGE_NAME "Bitcoin Core"
- | #define PACKAGE_TARNAME "bitcoin"
- | #define PACKAGE_VERSION "0.18.99"
- | #define PACKAGE_STRING "Bitcoin Core 0.18.99"
- | #define PACKAGE_BUGREPORT "https://github.com/bitcoin/bitcoin/issues"
- | #define PACKAGE_URL "https://bitcoincore.org/"
- | #define HAVE_CXX11 1
- | #define STDC_HEADERS 1
- | #define HAVE_SYS_TYPES_H 1
- | #define HAVE_SYS_STAT_H 1
- | #define HAVE_STDLIB_H 1
- | #define HAVE_STRING_H 1
- | #define HAVE_MEMORY_H 1
- | #define HAVE_STRINGS_H 1
- | #define HAVE_INTTYPES_H 1
- | #define HAVE_STDINT_H 1
- | #define HAVE_UNISTD_H 1
- | #define HAVE_DLFCN_H 1
- | #define LT_OBJDIR ".libs/"
- | #define USE_ASM 1
- | #define ENABLE_SSE41 1
- | #define ENABLE_AVX2 1
- | #define ENABLE_SHANI 1
- | #define HAVE_PTHREAD_PRIO_INHERIT 1
- | #define HAVE_PTHREAD 1
- | #define HAVE_DECL_STRERROR_R 1
- | #define HAVE_STRERROR_R 1
- | #define HAVE_STDIO_H 1
- | #define HAVE_STDLIB_H 1
- | #define HAVE_UNISTD_H 1
- | #define HAVE_STRINGS_H 1
- | #define HAVE_SYS_TYPES_H 1
- | #define HAVE_SYS_STAT_H 1
- | #define HAVE_SYS_SELECT_H 1
- | #define HAVE_DECL_GETIFADDRS 1
- | #define HAVE_DECL_FREEIFADDRS 1
- | #define HAVE_DECL_STRNLEN 1
- | #define HAVE_DECL_DAEMON 1
- | #define HAVE_DECL_LE16TOH 0
- | #define HAVE_DECL_LE32TOH 0
- | #define HAVE_DECL_LE64TOH 0
- | #define HAVE_DECL_HTOLE16 0
- | #define HAVE_DECL_HTOLE32 0
- | #define HAVE_DECL_HTOLE64 0
- | #define HAVE_DECL_BE16TOH 0
- | #define HAVE_DECL_BE32TOH 0
- | #define HAVE_DECL_BE64TOH 0
- | #define HAVE_DECL_HTOBE16 0
- | #define HAVE_DECL_HTOBE32 0
- | #define HAVE_DECL_HTOBE64 0
- | #define HAVE_DECL_BSWAP_16 0
- | #define HAVE_DECL_BSWAP_32 0
- | #define HAVE_DECL_BSWAP_64 0
- | #define HAVE_DECL___BUILTIN_CLZ 0
- | #define HAVE_DECL___BUILTIN_CLZL 0
- | #define HAVE_DECL___BUILTIN_CLZLL 0
- | #define HAVE_VISIBILITY_ATTRIBUTE 1
- | #define HAVE_GETENTROPY_RAND 1
- | #define HAVE_STD__SYSTEM 1
- | #define HAVE_SYSTEM HAVE_STD__SYSTEM || HAVE_WSYSTEM
- | #define HAVE_MINIUPNPC_MINIWGET_H 1
- | #define HAVE_MINIUPNPC_MINIUPNPC_H 1
- | #define HAVE_MINIUPNPC_UPNPCOMMANDS_H 1
- | #define HAVE_MINIUPNPC_UPNPERRORS_H 1
- | #define HAVE_BOOST /**/
- | #define HAVE_BOOST_SYSTEM /**/
- | #define HAVE_BOOST_FILESYSTEM /**/
- | #define HAVE_BOOST_THREAD /**/
- | #define HAVE_BOOST_CHRONO /**/
- | #define HAVE_BOOST_UNIT_TEST_FRAMEWORK /**/
- | /* end confdefs.h. */
- |
- | #include <boost/config.hpp>
- | #include <boost/version.hpp>
- | #if !defined(BOOST_NO_SCOPED_ENUMS) && !defined(BOOST_NO_CXX11_SCOPED_ENUMS) && BOOST_VERSION < 105700
- | #define BOOST_NO_SCOPED_ENUMS
- | #define BOOST_NO_CXX11_SCOPED_ENUMS
- | #define CHECK
- | #endif
- | #include <boost/filesystem.hpp>
- |
- | int
- | main ()
- | {
- |
- | #if defined(CHECK)
- | boost::filesystem::copy_file("foo", "bar");
- | #else
- | choke;
- | #endif
- |
- | ;
- | return 0;
- | }
- configure:30753: result: ok
- configure:30785: g++ -std=c++11 -o conftest -g -O2 -DHAVE_BUILD_INFO -D__STDC_FORMAT_MACROS -I/usr/local/opt/berkeley-db@4/include -DMAC_OSX -DBOOST_SP_USE_STD_ATOMIC -DBOOST_AC_USE_STD_ATOMIC -pthread -I/usr/local/include -Wl,-headerpad_max_install_names -Wl,-dead_strip conftest.cpp -L/usr/local/lib -lboost_system -lboost_filesystem -lboost_thread-mt -lboost_chrono-mt -L/usr/local/opt/berkeley-db@4/lib >&5
- configure:30785: $? = 0
- configure:30847: checking for libssl
- configure:30854: $PKG_CONFIG --exists --print-errors "libssl"
- configure:30857: $? = 0
- configure:30871: $PKG_CONFIG --exists --print-errors "libssl"
- configure:30874: $? = 0
- configure:30912: result: yes
- configure:30918: checking for libcrypto
- configure:30925: $PKG_CONFIG --exists --print-errors "libcrypto"
- configure:30928: $? = 0
- configure:30942: $PKG_CONFIG --exists --print-errors "libcrypto"
- configure:30945: $? = 0
- configure:30983: result: yes
- configure:30993: checking for protobuf
- configure:31000: $PKG_CONFIG --exists --print-errors "protobuf"
- configure:31003: $? = 0
- configure:31017: $PKG_CONFIG --exists --print-errors "protobuf"
- configure:31020: $? = 0
- configure:31058: result: yes
- configure:31074: checking for libqrencode
- configure:31081: $PKG_CONFIG --exists --print-errors "libqrencode"
- configure:31084: $? = 0
- configure:31098: $PKG_CONFIG --exists --print-errors "libqrencode"
- configure:31101: $? = 0
- configure:31139: result: yes
- configure:31152: checking for libevent
- configure:31159: $PKG_CONFIG --exists --print-errors "libevent"
- configure:31162: $? = 0
- configure:31176: $PKG_CONFIG --exists --print-errors "libevent"
- configure:31179: $? = 0
- configure:31217: result: yes
- configure:31224: checking for libevent_pthreads
- configure:31231: $PKG_CONFIG --exists --print-errors "libevent_pthreads"
- configure:31234: $? = 0
- configure:31248: $PKG_CONFIG --exists --print-errors "libevent_pthreads"
- configure:31251: $? = 0
- configure:31289: result: yes
- configure:31299: checking for libzmq >= 4
- configure:31306: $PKG_CONFIG --exists --print-errors "libzmq >= 4"
- Package libzmq was not found in the pkg-config search path.
- Perhaps you should add the directory containing `libzmq.pc'
- to the PKG_CONFIG_PATH environment variable
- No package 'libzmq' found
- configure:31309: $? = 1
- configure:31323: $PKG_CONFIG --exists --print-errors "libzmq >= 4"
- Package libzmq was not found in the pkg-config search path.
- Perhaps you should add the directory containing `libzmq.pc'
- to the PKG_CONFIG_PATH environment variable
- No package 'libzmq' found
- configure:31326: $? = 1
- configure:31340: result: no
- No package 'libzmq' found
- configure:31359: WARNING: libzmq version 4.x or greater not found, disabling
- configure:31758: checking whether EVP_MD_CTX_new is declared
- configure:31758: g++ -std=c++11 -c -g -O2 -I/usr/local/Cellar/openssl/1.0.2s/include -I/usr/local/Cellar/openssl/1.0.2s/include -DHAVE_BUILD_INFO -D__STDC_FORMAT_MACROS -I/usr/local/opt/berkeley-db@4/include -DMAC_OSX conftest.cpp >&5
- conftest.cpp:116:10: error: use of undeclared identifier 'EVP_MD_CTX_new'
- (void) EVP_MD_CTX_new;
- ^
- 1 error generated.
- configure:31758: $? = 1
- configure: failed program was:
- | /* confdefs.h */
- | #define PACKAGE_NAME "Bitcoin Core"
- | #define PACKAGE_TARNAME "bitcoin"
- | #define PACKAGE_VERSION "0.18.99"
- | #define PACKAGE_STRING "Bitcoin Core 0.18.99"
- | #define PACKAGE_BUGREPORT "https://github.com/bitcoin/bitcoin/issues"
- | #define PACKAGE_URL "https://bitcoincore.org/"
- | #define HAVE_CXX11 1
- | #define STDC_HEADERS 1
- | #define HAVE_SYS_TYPES_H 1
- | #define HAVE_SYS_STAT_H 1
- | #define HAVE_STDLIB_H 1
- | #define HAVE_STRING_H 1
- | #define HAVE_MEMORY_H 1
- | #define HAVE_STRINGS_H 1
- | #define HAVE_INTTYPES_H 1
- | #define HAVE_STDINT_H 1
- | #define HAVE_UNISTD_H 1
- | #define HAVE_DLFCN_H 1
- | #define LT_OBJDIR ".libs/"
- | #define USE_ASM 1
- | #define ENABLE_SSE41 1
- | #define ENABLE_AVX2 1
- | #define ENABLE_SHANI 1
- | #define HAVE_PTHREAD_PRIO_INHERIT 1
- | #define HAVE_PTHREAD 1
- | #define HAVE_DECL_STRERROR_R 1
- | #define HAVE_STRERROR_R 1
- | #define HAVE_STDIO_H 1
- | #define HAVE_STDLIB_H 1
- | #define HAVE_UNISTD_H 1
- | #define HAVE_STRINGS_H 1
- | #define HAVE_SYS_TYPES_H 1
- | #define HAVE_SYS_STAT_H 1
- | #define HAVE_SYS_SELECT_H 1
- | #define HAVE_DECL_GETIFADDRS 1
- | #define HAVE_DECL_FREEIFADDRS 1
- | #define HAVE_DECL_STRNLEN 1
- | #define HAVE_DECL_DAEMON 1
- | #define HAVE_DECL_LE16TOH 0
- | #define HAVE_DECL_LE32TOH 0
- | #define HAVE_DECL_LE64TOH 0
- | #define HAVE_DECL_HTOLE16 0
- | #define HAVE_DECL_HTOLE32 0
- | #define HAVE_DECL_HTOLE64 0
- | #define HAVE_DECL_BE16TOH 0
- | #define HAVE_DECL_BE32TOH 0
- | #define HAVE_DECL_BE64TOH 0
- | #define HAVE_DECL_HTOBE16 0
- | #define HAVE_DECL_HTOBE32 0
- | #define HAVE_DECL_HTOBE64 0
- | #define HAVE_DECL_BSWAP_16 0
- | #define HAVE_DECL_BSWAP_32 0
- | #define HAVE_DECL_BSWAP_64 0
- | #define HAVE_DECL___BUILTIN_CLZ 0
- | #define HAVE_DECL___BUILTIN_CLZL 0
- | #define HAVE_DECL___BUILTIN_CLZLL 0
- | #define HAVE_VISIBILITY_ATTRIBUTE 1
- | #define HAVE_GETENTROPY_RAND 1
- | #define HAVE_STD__SYSTEM 1
- | #define HAVE_SYSTEM HAVE_STD__SYSTEM || HAVE_WSYSTEM
- | #define HAVE_MINIUPNPC_MINIWGET_H 1
- | #define HAVE_MINIUPNPC_MINIUPNPC_H 1
- | #define HAVE_MINIUPNPC_UPNPCOMMANDS_H 1
- | #define HAVE_MINIUPNPC_UPNPERRORS_H 1
- | #define HAVE_BOOST /**/
- | #define HAVE_BOOST_SYSTEM /**/
- | #define HAVE_BOOST_FILESYSTEM /**/
- | #define HAVE_BOOST_THREAD /**/
- | #define HAVE_BOOST_CHRONO /**/
- | #define HAVE_BOOST_UNIT_TEST_FRAMEWORK /**/
- | #define HAVE_WORKING_BOOST_SLEEP_FOR 1
- | #define ENABLE_ZMQ 0
- | /* end confdefs.h. */
- | #include <stdio.h>
- | #ifdef HAVE_SYS_TYPES_H
- | # include <sys/types.h>
- | #endif
- | #ifdef HAVE_SYS_STAT_H
- | # include <sys/stat.h>
- | #endif
- | #ifdef STDC_HEADERS
- | # include <stdlib.h>
- | # include <stddef.h>
- | #else
- | # ifdef HAVE_STDLIB_H
- | # include <stdlib.h>
- | # endif
- | #endif
- | #ifdef HAVE_STRING_H
- | # if !defined STDC_HEADERS && defined HAVE_MEMORY_H
- | # include <memory.h>
- | # endif
- | # include <string.h>
- | #endif
- | #ifdef HAVE_STRINGS_H
- | # include <strings.h>
- | #endif
- | #ifdef HAVE_INTTYPES_H
- | # include <inttypes.h>
- | #endif
- | #ifdef HAVE_STDINT_H
- | # include <stdint.h>
- | #endif
- | #ifdef HAVE_UNISTD_H
- | # include <unistd.h>
- | #endif
- | #include <openssl/x509_vfy.h>
- |
- |
- | int
- | main ()
- | {
- | #ifndef EVP_MD_CTX_new
- | #ifdef __cplusplus
- | (void) EVP_MD_CTX_new;
- | #else
- | (void) EVP_MD_CTX_new;
- | #endif
- | #endif
- |
- | ;
- | return 0;
- | }
- configure:31758: result: no
- configure:31779: checking rapidcheck.h usability
- configure:31779: g++ -std=c++11 -c -g -O2 -DHAVE_BUILD_INFO -D__STDC_FORMAT_MACROS -I/usr/local/opt/berkeley-db@4/include -DMAC_OSX conftest.cpp >&5
- conftest.cpp:109:10: fatal error: 'rapidcheck.h' file not found
- #include <rapidcheck.h>
- ^~~~~~~~~~~~~~
- 1 error generated.
- configure:31779: $? = 1
- configure: failed program was:
- | /* confdefs.h */
- | #define PACKAGE_NAME "Bitcoin Core"
- | #define PACKAGE_TARNAME "bitcoin"
- | #define PACKAGE_VERSION "0.18.99"
- | #define PACKAGE_STRING "Bitcoin Core 0.18.99"
- | #define PACKAGE_BUGREPORT "https://github.com/bitcoin/bitcoin/issues"
- | #define PACKAGE_URL "https://bitcoincore.org/"
- | #define HAVE_CXX11 1
- | #define STDC_HEADERS 1
- | #define HAVE_SYS_TYPES_H 1
- | #define HAVE_SYS_STAT_H 1
- | #define HAVE_STDLIB_H 1
- | #define HAVE_STRING_H 1
- | #define HAVE_MEMORY_H 1
- | #define HAVE_STRINGS_H 1
- | #define HAVE_INTTYPES_H 1
- | #define HAVE_STDINT_H 1
- | #define HAVE_UNISTD_H 1
- | #define HAVE_DLFCN_H 1
- | #define LT_OBJDIR ".libs/"
- | #define USE_ASM 1
- | #define ENABLE_SSE41 1
- | #define ENABLE_AVX2 1
- | #define ENABLE_SHANI 1
- | #define HAVE_PTHREAD_PRIO_INHERIT 1
- | #define HAVE_PTHREAD 1
- | #define HAVE_DECL_STRERROR_R 1
- | #define HAVE_STRERROR_R 1
- | #define HAVE_STDIO_H 1
- | #define HAVE_STDLIB_H 1
- | #define HAVE_UNISTD_H 1
- | #define HAVE_STRINGS_H 1
- | #define HAVE_SYS_TYPES_H 1
- | #define HAVE_SYS_STAT_H 1
- | #define HAVE_SYS_SELECT_H 1
- | #define HAVE_DECL_GETIFADDRS 1
- | #define HAVE_DECL_FREEIFADDRS 1
- | #define HAVE_DECL_STRNLEN 1
- | #define HAVE_DECL_DAEMON 1
- | #define HAVE_DECL_LE16TOH 0
- | #define HAVE_DECL_LE32TOH 0
- | #define HAVE_DECL_LE64TOH 0
- | #define HAVE_DECL_HTOLE16 0
- | #define HAVE_DECL_HTOLE32 0
- | #define HAVE_DECL_HTOLE64 0
- | #define HAVE_DECL_BE16TOH 0
- | #define HAVE_DECL_BE32TOH 0
- | #define HAVE_DECL_BE64TOH 0
- | #define HAVE_DECL_HTOBE16 0
- | #define HAVE_DECL_HTOBE32 0
- | #define HAVE_DECL_HTOBE64 0
- | #define HAVE_DECL_BSWAP_16 0
- | #define HAVE_DECL_BSWAP_32 0
- | #define HAVE_DECL_BSWAP_64 0
- | #define HAVE_DECL___BUILTIN_CLZ 0
- | #define HAVE_DECL___BUILTIN_CLZL 0
- | #define HAVE_DECL___BUILTIN_CLZLL 0
- | #define HAVE_VISIBILITY_ATTRIBUTE 1
- | #define HAVE_GETENTROPY_RAND 1
- | #define HAVE_STD__SYSTEM 1
- | #define HAVE_SYSTEM HAVE_STD__SYSTEM || HAVE_WSYSTEM
- | #define HAVE_MINIUPNPC_MINIWGET_H 1
- | #define HAVE_MINIUPNPC_MINIUPNPC_H 1
- | #define HAVE_MINIUPNPC_UPNPCOMMANDS_H 1
- | #define HAVE_MINIUPNPC_UPNPERRORS_H 1
- | #define HAVE_BOOST /**/
- | #define HAVE_BOOST_SYSTEM /**/
- | #define HAVE_BOOST_FILESYSTEM /**/
- | #define HAVE_BOOST_THREAD /**/
- | #define HAVE_BOOST_CHRONO /**/
- | #define HAVE_BOOST_UNIT_TEST_FRAMEWORK /**/
- | #define HAVE_WORKING_BOOST_SLEEP_FOR 1
- | #define ENABLE_ZMQ 0
- | #define HAVE_DECL_EVP_MD_CTX_NEW 0
- | /* end confdefs.h. */
- | #include <stdio.h>
- | #ifdef HAVE_SYS_TYPES_H
- | # include <sys/types.h>
- | #endif
- | #ifdef HAVE_SYS_STAT_H
- | # include <sys/stat.h>
- | #endif
- | #ifdef STDC_HEADERS
- | # include <stdlib.h>
- | # include <stddef.h>
- | #else
- | # ifdef HAVE_STDLIB_H
- | # include <stdlib.h>
- | # endif
- | #endif
- | #ifdef HAVE_STRING_H
- | # if !defined STDC_HEADERS && defined HAVE_MEMORY_H
- | # include <memory.h>
- | # endif
- | # include <string.h>
- | #endif
- | #ifdef HAVE_STRINGS_H
- | # include <strings.h>
- | #endif
- | #ifdef HAVE_INTTYPES_H
- | # include <inttypes.h>
- | #endif
- | #ifdef HAVE_STDINT_H
- | # include <stdint.h>
- | #endif
- | #ifdef HAVE_UNISTD_H
- | # include <unistd.h>
- | #endif
- | #include <rapidcheck.h>
- configure:31779: result: no
- configure:31779: checking rapidcheck.h presence
- configure:31779: g++ -std=c++11 -E -DHAVE_BUILD_INFO -D__STDC_FORMAT_MACROS -I/usr/local/opt/berkeley-db@4/include -DMAC_OSX conftest.cpp
- conftest.cpp:76:10: fatal error: 'rapidcheck.h' file not found
- #include <rapidcheck.h>
- ^~~~~~~~~~~~~~
- 1 error generated.
- configure:31779: $? = 1
- configure: failed program was:
- | /* confdefs.h */
- | #define PACKAGE_NAME "Bitcoin Core"
- | #define PACKAGE_TARNAME "bitcoin"
- | #define PACKAGE_VERSION "0.18.99"
- | #define PACKAGE_STRING "Bitcoin Core 0.18.99"
- | #define PACKAGE_BUGREPORT "https://github.com/bitcoin/bitcoin/issues"
- | #define PACKAGE_URL "https://bitcoincore.org/"
- | #define HAVE_CXX11 1
- | #define STDC_HEADERS 1
- | #define HAVE_SYS_TYPES_H 1
- | #define HAVE_SYS_STAT_H 1
- | #define HAVE_STDLIB_H 1
- | #define HAVE_STRING_H 1
- | #define HAVE_MEMORY_H 1
- | #define HAVE_STRINGS_H 1
- | #define HAVE_INTTYPES_H 1
- | #define HAVE_STDINT_H 1
- | #define HAVE_UNISTD_H 1
- | #define HAVE_DLFCN_H 1
- | #define LT_OBJDIR ".libs/"
- | #define USE_ASM 1
- | #define ENABLE_SSE41 1
- | #define ENABLE_AVX2 1
- | #define ENABLE_SHANI 1
- | #define HAVE_PTHREAD_PRIO_INHERIT 1
- | #define HAVE_PTHREAD 1
- | #define HAVE_DECL_STRERROR_R 1
- | #define HAVE_STRERROR_R 1
- | #define HAVE_STDIO_H 1
- | #define HAVE_STDLIB_H 1
- | #define HAVE_UNISTD_H 1
- | #define HAVE_STRINGS_H 1
- | #define HAVE_SYS_TYPES_H 1
- | #define HAVE_SYS_STAT_H 1
- | #define HAVE_SYS_SELECT_H 1
- | #define HAVE_DECL_GETIFADDRS 1
- | #define HAVE_DECL_FREEIFADDRS 1
- | #define HAVE_DECL_STRNLEN 1
- | #define HAVE_DECL_DAEMON 1
- | #define HAVE_DECL_LE16TOH 0
- | #define HAVE_DECL_LE32TOH 0
- | #define HAVE_DECL_LE64TOH 0
- | #define HAVE_DECL_HTOLE16 0
- | #define HAVE_DECL_HTOLE32 0
- | #define HAVE_DECL_HTOLE64 0
- | #define HAVE_DECL_BE16TOH 0
- | #define HAVE_DECL_BE32TOH 0
- | #define HAVE_DECL_BE64TOH 0
- | #define HAVE_DECL_HTOBE16 0
- | #define HAVE_DECL_HTOBE32 0
- | #define HAVE_DECL_HTOBE64 0
- | #define HAVE_DECL_BSWAP_16 0
- | #define HAVE_DECL_BSWAP_32 0
- | #define HAVE_DECL_BSWAP_64 0
- | #define HAVE_DECL___BUILTIN_CLZ 0
- | #define HAVE_DECL___BUILTIN_CLZL 0
- | #define HAVE_DECL___BUILTIN_CLZLL 0
- | #define HAVE_VISIBILITY_ATTRIBUTE 1
- | #define HAVE_GETENTROPY_RAND 1
- | #define HAVE_STD__SYSTEM 1
- | #define HAVE_SYSTEM HAVE_STD__SYSTEM || HAVE_WSYSTEM
- | #define HAVE_MINIUPNPC_MINIWGET_H 1
- | #define HAVE_MINIUPNPC_MINIUPNPC_H 1
- | #define HAVE_MINIUPNPC_UPNPCOMMANDS_H 1
- | #define HAVE_MINIUPNPC_UPNPERRORS_H 1
- | #define HAVE_BOOST /**/
- | #define HAVE_BOOST_SYSTEM /**/
- | #define HAVE_BOOST_FILESYSTEM /**/
- | #define HAVE_BOOST_THREAD /**/
- | #define HAVE_BOOST_CHRONO /**/
- | #define HAVE_BOOST_UNIT_TEST_FRAMEWORK /**/
- | #define HAVE_WORKING_BOOST_SLEEP_FOR 1
- | #define ENABLE_ZMQ 0
- | #define HAVE_DECL_EVP_MD_CTX_NEW 0
- | /* end confdefs.h. */
- | #include <rapidcheck.h>
- configure:31779: result: no
- configure:31779: checking for rapidcheck.h
- configure:31779: result: no
- configure:32030: checking for protoc
- configure:32048: found /usr/local/bin/protoc
- configure:32060: result: /usr/local/bin/protoc
- configure:32095: checking whether to build bitcoind
- configure:32105: result: yes
- configure:32108: checking whether to build bitcoin-cli
- configure:32118: result: yes
- configure:32121: checking whether to build bitcoin-tx
- configure:32131: result: yes
- configure:32134: checking whether to build bitcoin-wallet
- configure:32144: result: yes
- configure:32147: checking whether to build libraries
- configure:32164: result: yes
- configure:32175: checking if ccache should be used
- configure:32188: result: no
- configure:32229: checking if wallet should be enabled
- configure:32232: result: yes
- configure:32245: checking whether to build with support for UPnP
- configure:32256: result: yes
- configure:32258: checking whether to build with UPnP enabled by default
- configure:32266: result: no
- configure:32284: checking whether to build GUI with support for D-Bus
- configure:32291: result: yes
- configure:32294: checking whether to build GUI with support for QR codes
- configure:32304: result: yes
- configure:32317: WARNING: "xgettext is required to update qt translations"
- configure:32321: checking whether to build test_bitcoin-qt
- configure:32324: result: yes
- configure:32332: checking whether to build BIP70 support
- configure:32347: result: yes
- configure:32365: checking whether to build test_bitcoin
- configure:32368: result: yes
- configure:32377: checking whether to reduce exports
- configure:32383: result: no
- configure:32788: checking that generated files are newer than configure
- configure:32794: result: done
- configure:32950: creating ./config.status
- ## ---------------------- ##
- ## Running config.status. ##
- ## ---------------------- ##
- This file was extended by Bitcoin Core config.status 0.18.99, which was
- generated by GNU Autoconf 2.69. Invocation command line was
- CONFIG_FILES =
- CONFIG_HEADERS =
- CONFIG_LINKS =
- CONFIG_COMMANDS =
- $ ./config.status
- on f008.local
- config.status:1457: creating libbitcoinconsensus.pc
- config.status:1457: creating Makefile
- config.status:1457: creating src/Makefile
- config.status:1457: creating doc/man/Makefile
- config.status:1457: creating share/setup.nsi
- config.status:1457: creating share/qt/Info.plist
- config.status:1457: creating test/config.ini
- config.status:1457: creating contrib/devtools/split-debug.sh
- config.status:1457: creating src/config/bitcoin-config.h
- config.status:1717: executing depfiles commands
- config.status:1794: cd src && sed -e '/# am--include-marker/d' Makefile | make -f - am--depfiles
- config.status:1799: $? = 0
- config.status:1717: executing libtool commands
- configure:35475: === configuring in src/univalue (/Users/brent/bitcoin/src/univalue)
- configure:35538: running /bin/sh ./configure --disable-option-checking '--prefix=/usr/local' '--disable-shared' '--with-pic' '--with-bignum=no' '--enable-module-recovery' '--disable-jni' --cache-file=/dev/null --srcdir=.
- configure:35475: === configuring in src/secp256k1 (/Users/brent/bitcoin/src/secp256k1)
- configure:35538: running /bin/sh ./configure --disable-option-checking '--prefix=/usr/local' '--disable-shared' '--with-pic' '--with-bignum=no' '--enable-module-recovery' '--disable-jni' --cache-file=/dev/null --srcdir=.
- ## ---------------- ##
- ## Cache variables. ##
- ## ---------------- ##
- ac_cv_build=x86_64-apple-darwin18.7.0
- ac_cv_c_bigendian=no
- ac_cv_c_compiler_gnu=yes
- ac_cv_cxx_compiler_gnu=yes
- ac_cv_env_ARFLAGS_set=
- ac_cv_env_ARFLAGS_value=
- ac_cv_env_BDB_CFLAGS_set=
- ac_cv_env_BDB_CFLAGS_value=
- ac_cv_env_BDB_LIBS_set=
- ac_cv_env_BDB_LIBS_value=
- ac_cv_env_CCC_set=
- ac_cv_env_CCC_value=
- ac_cv_env_CC_set=
- ac_cv_env_CC_value=
- ac_cv_env_CFLAGS_set=
- ac_cv_env_CFLAGS_value=
- ac_cv_env_CPPFLAGS_set=
- ac_cv_env_CPPFLAGS_value=
- ac_cv_env_CPP_set=
- ac_cv_env_CPP_value=
- ac_cv_env_CRYPTO_CFLAGS_set=
- ac_cv_env_CRYPTO_CFLAGS_value=
- ac_cv_env_CRYPTO_LIBS_set=
- ac_cv_env_CRYPTO_LIBS_value=
- ac_cv_env_CXXCPP_set=
- ac_cv_env_CXXCPP_value=
- ac_cv_env_CXXFLAGS_set=
- ac_cv_env_CXXFLAGS_value=
- ac_cv_env_CXX_set=
- ac_cv_env_CXX_value=
- ac_cv_env_EVENT_CFLAGS_set=
- ac_cv_env_EVENT_CFLAGS_value=
- ac_cv_env_EVENT_LIBS_set=
- ac_cv_env_EVENT_LIBS_value=
- ac_cv_env_EVENT_PTHREADS_CFLAGS_set=
- ac_cv_env_EVENT_PTHREADS_CFLAGS_value=
- ac_cv_env_EVENT_PTHREADS_LIBS_set=
- ac_cv_env_EVENT_PTHREADS_LIBS_value=
- ac_cv_env_LDFLAGS_set=
- ac_cv_env_LDFLAGS_value=
- ac_cv_env_LIBS_set=
- ac_cv_env_LIBS_value=
- ac_cv_env_LT_SYS_LIBRARY_PATH_set=
- ac_cv_env_LT_SYS_LIBRARY_PATH_value=
- ac_cv_env_OBJCXXFLAGS_set=
- ac_cv_env_OBJCXXFLAGS_value=
- ac_cv_env_OBJCXX_set=
- ac_cv_env_OBJCXX_value=
- ac_cv_env_PKG_CONFIG_LIBDIR_set=
- ac_cv_env_PKG_CONFIG_LIBDIR_value=
- ac_cv_env_PKG_CONFIG_PATH_set=
- ac_cv_env_PKG_CONFIG_PATH_value=
- ac_cv_env_PKG_CONFIG_set=
- ac_cv_env_PKG_CONFIG_value=
- ac_cv_env_PROTOBUF_CFLAGS_set=
- ac_cv_env_PROTOBUF_CFLAGS_value=
- ac_cv_env_PROTOBUF_LIBS_set=
- ac_cv_env_PROTOBUF_LIBS_value=
- ac_cv_env_PYTHONPATH_set=
- ac_cv_env_PYTHONPATH_value=
- ac_cv_env_QR_CFLAGS_set=
- ac_cv_env_QR_CFLAGS_value=
- ac_cv_env_QR_LIBS_set=
- ac_cv_env_QR_LIBS_value=
- ac_cv_env_QT5_CFLAGS_set=
- ac_cv_env_QT5_CFLAGS_value=
- ac_cv_env_QT5_LIBS_set=
- ac_cv_env_QT5_LIBS_value=
- ac_cv_env_QTACCESSIBILITY_CFLAGS_set=
- ac_cv_env_QTACCESSIBILITY_CFLAGS_value=
- ac_cv_env_QTACCESSIBILITY_LIBS_set=
- ac_cv_env_QTACCESSIBILITY_LIBS_value=
- ac_cv_env_QTCGL_CFLAGS_set=
- ac_cv_env_QTCGL_CFLAGS_value=
- ac_cv_env_QTCGL_LIBS_set=
- ac_cv_env_QTCGL_LIBS_value=
- ac_cv_env_QTCLIPBOARD_CFLAGS_set=
- ac_cv_env_QTCLIPBOARD_CFLAGS_value=
- ac_cv_env_QTCLIPBOARD_LIBS_set=
- ac_cv_env_QTCLIPBOARD_LIBS_value=
- ac_cv_env_QTDEVICEDISCOVERY_CFLAGS_set=
- ac_cv_env_QTDEVICEDISCOVERY_CFLAGS_value=
- ac_cv_env_QTDEVICEDISCOVERY_LIBS_set=
- ac_cv_env_QTDEVICEDISCOVERY_LIBS_value=
- ac_cv_env_QTEVENTDISPATCHER_CFLAGS_set=
- ac_cv_env_QTEVENTDISPATCHER_CFLAGS_value=
- ac_cv_env_QTEVENTDISPATCHER_LIBS_set=
- ac_cv_env_QTEVENTDISPATCHER_LIBS_value=
- ac_cv_env_QTFB_CFLAGS_set=
- ac_cv_env_QTFB_CFLAGS_value=
- ac_cv_env_QTFB_LIBS_set=
- ac_cv_env_QTFB_LIBS_value=
- ac_cv_env_QTFONTDATABASE_CFLAGS_set=
- ac_cv_env_QTFONTDATABASE_CFLAGS_value=
- ac_cv_env_QTFONTDATABASE_LIBS_set=
- ac_cv_env_QTFONTDATABASE_LIBS_value=
- ac_cv_env_QTGRAPHICS_CFLAGS_set=
- ac_cv_env_QTGRAPHICS_CFLAGS_value=
- ac_cv_env_QTGRAPHICS_LIBS_set=
- ac_cv_env_QTGRAPHICS_LIBS_value=
- ac_cv_env_QTPLATFORM_CFLAGS_set=
- ac_cv_env_QTPLATFORM_CFLAGS_value=
- ac_cv_env_QTPLATFORM_LIBS_set=
- ac_cv_env_QTPLATFORM_LIBS_value=
- ac_cv_env_QTTHEME_CFLAGS_set=
- ac_cv_env_QTTHEME_CFLAGS_value=
- ac_cv_env_QTTHEME_LIBS_set=
- ac_cv_env_QTTHEME_LIBS_value=
- ac_cv_env_QTXCBQPA_CFLAGS_set=
- ac_cv_env_QTXCBQPA_CFLAGS_value=
- ac_cv_env_QTXCBQPA_LIBS_set=
- ac_cv_env_QTXCBQPA_LIBS_value=
- ac_cv_env_QT_DBUS_CFLAGS_set=
- ac_cv_env_QT_DBUS_CFLAGS_value=
- ac_cv_env_QT_DBUS_LIBS_set=
- ac_cv_env_QT_DBUS_LIBS_value=
- ac_cv_env_QT_TEST_CFLAGS_set=
- ac_cv_env_QT_TEST_CFLAGS_value=
- ac_cv_env_QT_TEST_LIBS_set=
- ac_cv_env_QT_TEST_LIBS_value=
- ac_cv_env_SSL_CFLAGS_set=
- ac_cv_env_SSL_CFLAGS_value=
- ac_cv_env_SSL_LIBS_set=
- ac_cv_env_SSL_LIBS_value=
- ac_cv_env_UNIVALUE_CFLAGS_set=
- ac_cv_env_UNIVALUE_CFLAGS_value=
- ac_cv_env_UNIVALUE_LIBS_set=
- ac_cv_env_UNIVALUE_LIBS_value=
- ac_cv_env_ZMQ_CFLAGS_set=
- ac_cv_env_ZMQ_CFLAGS_value=
- ac_cv_env_ZMQ_LIBS_set=
- ac_cv_env_ZMQ_LIBS_value=
- ac_cv_env_build_alias_set=
- ac_cv_env_build_alias_value=
- ac_cv_env_host_alias_set=
- ac_cv_env_host_alias_value=
- ac_cv_env_target_alias_set=
- ac_cv_env_target_alias_value=
- ac_cv_func_strerror_r=yes
- ac_cv_func_strerror_r_char_p=no
- ac_cv_have_decl_EVP_MD_CTX_new=no
- ac_cv_have_decl___builtin_clz=no
- ac_cv_have_decl___builtin_clzl=no
- ac_cv_have_decl___builtin_clzll=no
- ac_cv_have_decl_be16toh=no
- ac_cv_have_decl_be32toh=no
- ac_cv_have_decl_be64toh=no
- ac_cv_have_decl_bswap_16=no
- ac_cv_have_decl_bswap_32=no
- ac_cv_have_decl_bswap_64=no
- ac_cv_have_decl_daemon=yes
- ac_cv_have_decl_freeifaddrs=yes
- ac_cv_have_decl_getifaddrs=yes
- ac_cv_have_decl_htobe16=no
- ac_cv_have_decl_htobe32=no
- ac_cv_have_decl_htobe64=no
- ac_cv_have_decl_htole16=no
- ac_cv_have_decl_htole32=no
- ac_cv_have_decl_htole64=no
- ac_cv_have_decl_le16toh=no
- ac_cv_have_decl_le32toh=no
- ac_cv_have_decl_le64toh=no
- ac_cv_have_decl_strerror_r=yes
- ac_cv_have_decl_strnlen=yes
- ac_cv_header_byteswap_h=no
- ac_cv_header_dlfcn_h=yes
- ac_cv_header_endian_h=no
- ac_cv_header_inttypes_h=yes
- ac_cv_header_memory_h=yes
- ac_cv_header_miniupnpc_miniupnpc_h=yes
- ac_cv_header_miniupnpc_miniwget_h=yes
- ac_cv_header_miniupnpc_upnpcommands_h=yes
- ac_cv_header_miniupnpc_upnperrors_h=yes
- ac_cv_header_rapidcheck_h=no
- ac_cv_header_stdc=yes
- ac_cv_header_stdint_h=yes
- ac_cv_header_stdio_h=yes
- ac_cv_header_stdlib_h=yes
- ac_cv_header_string_h=yes
- ac_cv_header_strings_h=yes
- ac_cv_header_sys_endian_h=no
- ac_cv_header_sys_prctl_h=no
- ac_cv_header_sys_select_h=yes
- ac_cv_header_sys_stat_h=yes
- ac_cv_header_sys_types_h=yes
- ac_cv_header_unistd_h=yes
- ac_cv_host=x86_64-apple-darwin18.7.0
- ac_cv_lib_boost_chrono_mt___exit=yes
- ac_cv_lib_boost_filesystem___exit=yes
- ac_cv_lib_boost_system___exit=yes
- ac_cv_lib_boost_thread_mt___exit=yes
- ac_cv_lib_db_cxx_4_8___main=yes
- ac_cv_lib_miniupnpc_upnpDiscover=yes
- ac_cv_objcxx_compiler_gnu=yes
- ac_cv_objext=o
- ac_cv_path_EGREP='/usr/bin/grep -E'
- ac_cv_path_FGREP='/usr/bin/grep -F'
- ac_cv_path_GIT=/usr/bin/git
- ac_cv_path_GREP=/usr/bin/grep
- ac_cv_path_HEXDUMP=/usr/bin/hexdump
- ac_cv_path_LRELEASE=/usr/local/Cellar/qt/5.12.1/bin/lrelease
- ac_cv_path_LUPDATE=/usr/local/Cellar/qt/5.12.1/bin/lupdate
- ac_cv_path_MOC=/usr/local/Cellar/qt/5.12.1/bin/moc
- ac_cv_path_PROTOC=/usr/local/bin/protoc
- ac_cv_path_PYTHON=/usr/local/bin/python3.7
- ac_cv_path_RCC=/usr/local/Cellar/qt/5.12.1/bin/rcc
- ac_cv_path_RSVG_CONVERT=/usr/local/bin/rsvg-convert
- ac_cv_path_SED=/usr/bin/sed
- ac_cv_path_UIC=/usr/local/Cellar/qt/5.12.1/bin/uic
- ac_cv_path_ac_pt_AR=/usr/bin/ar
- ac_cv_path_ac_pt_CPPFILT=/usr/bin/c++filt
- ac_cv_path_ac_pt_GCOV=/usr/bin/gcov
- ac_cv_path_ac_pt_PKG_CONFIG=/usr/local/bin/pkg-config
- ac_cv_path_ac_pt_RANLIB=/usr/bin/ranlib
- ac_cv_path_ac_pt_STRIP=/usr/bin/strip
- ac_cv_path_install='/usr/bin/install -c'
- ac_cv_path_lt_DD=/bin/dd
- ac_cv_prog_AWK=awk
- ac_cv_prog_BREW=brew
- ac_cv_prog_CPP='gcc -E'
- ac_cv_prog_CXXCPP='g++ -std=c++11 -E'
- ac_cv_prog_ac_ct_AR=ar
- ac_cv_prog_ac_ct_CC=gcc
- ac_cv_prog_ac_ct_CXX=g++
- ac_cv_prog_ac_ct_DSYMUTIL=dsymutil
- ac_cv_prog_ac_ct_LIPO=lipo
- ac_cv_prog_ac_ct_NMEDIT=nmedit
- ac_cv_prog_ac_ct_OBJDUMP=objdump
- ac_cv_prog_ac_ct_OTOOL=otool
- ac_cv_prog_ac_ct_RANLIB=ranlib
- ac_cv_prog_ac_ct_STRIP=strip
- ac_cv_prog_cc_c89=
- ac_cv_prog_cc_g=yes
- ac_cv_prog_cxx_g=yes
- ac_cv_prog_make_make_set=yes
- ac_cv_prog_objcxx_g=yes
- ac_cv_search_clock_gettime='none required'
- ac_cv_sys_file_offset_bits=no
- ac_cv_sys_largefile_CC=no
- am_cv_CC_dependencies_compiler_type=gcc3
- am_cv_CXX_dependencies_compiler_type=gcc3
- am_cv_OBJCXX_dependencies_compiler_type=gcc3
- am_cv_make_support_nested_variables=yes
- am_cv_prog_cc_c_o=yes
- ax_cv_PTHREAD_CLANG=yes
- ax_cv_PTHREAD_CLANG_NO_WARN_FLAG=no
- ax_cv_PTHREAD_JOINABLE_ATTR=PTHREAD_CREATE_JOINABLE
- ax_cv_PTHREAD_PRIO_INHERIT=yes
- ax_cv_PTHREAD_SPECIAL_FLAGS=no
- ax_cv_boost_chrono=yes
- ax_cv_boost_filesystem=yes
- ax_cv_boost_system=yes
- ax_cv_boost_thread=yes
- ax_cv_boost_unit_test_framework=yes
- ax_cv_check_cxxcppflags___D_FORTIFY_SOURCE_2=yes
- ax_cv_check_cxxcppflags___U_FORTIFY_SOURCE=yes
- ax_cv_check_cxxflags__Wall=yes
- ax_cv_check_cxxflags__Wdeprecated_register=yes
- ax_cv_check_cxxflags__Wextra=yes
- ax_cv_check_cxxflags__Wformat=yes
- ax_cv_check_cxxflags__Wformat_security=yes
- ax_cv_check_cxxflags__Wimplicit_fallthrough=yes
- ax_cv_check_cxxflags__Wrange_loop_analysis=yes
- ax_cv_check_cxxflags__Wredundant_decls=yes
- ax_cv_check_cxxflags__Wself_assign=yes
- ax_cv_check_cxxflags__Wswitch=yes
- ax_cv_check_cxxflags__Wthread_safety_analysis=yes
- ax_cv_check_cxxflags__Wunused_local_typedef=yes
- ax_cv_check_cxxflags__Wunused_parameter=yes
- ax_cv_check_cxxflags__Wvla=yes
- ax_cv_check_cxxflags___Werror=yes
- ax_cv_check_cxxflags___Wstack_protector=yes
- ax_cv_check_cxxflags___fPIC=yes
- ax_cv_check_cxxflags___fstack_protector_all=yes
- ax_cv_check_cxxflags___fstack_reuse_none=no
- ax_cv_check_cxxflags__mavx__mavx2=yes
- ax_cv_check_cxxflags__msse4_1=yes
- ax_cv_check_cxxflags__msse4_2=yes
- ax_cv_check_cxxflags__msse4__msha=yes
- ax_cv_check_ldflags___Wl___dynamicbase=no
- ax_cv_check_ldflags___Wl___high_entropy_va=no
- ax_cv_check_ldflags___Wl___large_address_aware=no
- ax_cv_check_ldflags___Wl___nxcompat=no
- ax_cv_check_ldflags___Wl__dead_strip=yes
- ax_cv_check_ldflags___Wl__headerpad_max_install_names=yes
- ax_cv_check_ldflags___Wl__z_now=no
- ax_cv_check_ldflags___Wl__z_relro=no
- ax_cv_check_ldflags___framework_Foundation__framework_ApplicationServices__framework_AppKit=yes
- ax_cv_check_ldflags__fPIE__pie=no
- ax_cv_cxx_compile_cxx11__std_cpp11=yes
- ax_cv_have_func_attribute_dllexport=no
- ax_cv_have_func_attribute_dllimport=no
- ax_cv_have_func_attribute_visibility=no
- bitcoin_cv_static_qt=no
- lt_cv_apple_cc_single_mod=yes
- lt_cv_ar_at_file=no
- lt_cv_deplibs_check_method=pass_all
- lt_cv_file_magic_cmd='$MAGIC_CMD'
- lt_cv_file_magic_test_file=
- lt_cv_ld_exported_symbols_list=yes
- lt_cv_ld_force_load=yes
- lt_cv_ld_reload_flag=-r
- lt_cv_nm_interface='BSD nm'
- lt_cv_objdir=.libs
- lt_cv_path_LD=/Applications/Xcode.app/Contents/Developer/Toolchains/XcodeDefault.xctoolchain/usr/bin/ld
- lt_cv_path_LDCXX=/Applications/Xcode.app/Contents/Developer/Toolchains/XcodeDefault.xctoolchain/usr/bin/ld
- lt_cv_path_NM='/usr/bin/nm -B'
- lt_cv_path_mainfest_tool=no
- lt_cv_prog_compiler_c_o=yes
- lt_cv_prog_compiler_c_o_CXX=yes
- lt_cv_prog_compiler_pic='-fno-common -DPIC'
- lt_cv_prog_compiler_pic_CXX='-fno-common -DPIC'
- lt_cv_prog_compiler_pic_works=yes
- lt_cv_prog_compiler_pic_works_CXX=yes
- lt_cv_prog_compiler_rtti_exceptions=yes
- lt_cv_prog_compiler_static_works=no
- lt_cv_prog_compiler_static_works_CXX=no
- lt_cv_prog_gnu_ld=no
- lt_cv_prog_gnu_ldcxx=no
- lt_cv_sharedlib_from_linklib_cmd='printf %s\n'
- lt_cv_sys_global_symbol_pipe='sed -n -e '\''s/^.*[ ]\([BCDEGRST][BCDEGRST]*\)[ ][ ]*_\([_A-Za-z][_A-Za-z0-9]*\)$/\1 _\2 \2/p'\'' | sed '\''/ __gnu_lto/d'\'''
- lt_cv_sys_global_symbol_to_c_name_address='sed -n -e '\''s/^: \(.*\) .*$/ {"\1", (void *) 0},/p'\'' -e '\''s/^[BCDEGRST][BCDEGRST]* .* \(.*\)$/ {"\1", (void *) \&\1},/p'\'''
- lt_cv_sys_global_symbol_to_c_name_address_lib_prefix='sed -n -e '\''s/^: \(.*\) .*$/ {"\1", (void *) 0},/p'\'' -e '\''s/^[BCDEGRST][BCDEGRST]* .* \(lib.*\)$/ {"\1", (void *) \&\1},/p'\'' -e '\''s/^[BCDEGRST][BCDEGRST]* .* \(.*\)$/ {"lib\1", (void *) \&\1},/p'\'''
- lt_cv_sys_global_symbol_to_cdecl='sed -n -e '\''s/^T .* \(.*\)$/extern int \1();/p'\'' -e '\''s/^[BCDEGRST][BCDEGRST]* .* \(.*\)$/extern char \1;/p'\'''
- lt_cv_sys_global_symbol_to_import=
- lt_cv_sys_max_cmd_len=196608
- lt_cv_to_host_file_cmd=func_convert_file_noop
- lt_cv_to_tool_file_cmd=func_convert_file_noop
- lt_cv_truncate_bin='/bin/dd bs=4096 count=1'
- pkg_cv_CRYPTO_CFLAGS=-I/usr/local/Cellar/openssl/1.0.2s/include
- pkg_cv_CRYPTO_LIBS='-L/usr/local/Cellar/openssl/1.0.2s/lib -lcrypto'
- pkg_cv_EVENT_CFLAGS=-I/usr/local/Cellar/libevent/2.1.11/include
- pkg_cv_EVENT_LIBS='-L/usr/local/Cellar/libevent/2.1.11/lib -levent'
- pkg_cv_EVENT_PTHREADS_CFLAGS='-D_THREAD_SAFE -I/usr/local/Cellar/libevent/2.1.11/include'
- pkg_cv_EVENT_PTHREADS_LIBS='-L/usr/local/Cellar/libevent/2.1.11/lib -levent_pthreads -levent'
- pkg_cv_PROTOBUF_CFLAGS='-pthread -I/usr/local/Cellar/protobuf/3.6.1.3/include'
- pkg_cv_PROTOBUF_LIBS='-L/usr/local/Cellar/protobuf/3.6.1.3/lib -lprotobuf -pthread'
- pkg_cv_QR_CFLAGS=-I/usr/local/Cellar/qrencode/4.0.2/include
- pkg_cv_QR_LIBS='-L/usr/local/Cellar/qrencode/4.0.2/lib -lqrencode'
- pkg_cv_QT5_CFLAGS='-DQT_NETWORK_LIB -F/usr/local/Cellar/qt/5.12.1/lib -DQT_WIDGETS_LIB -F/usr/local/Cellar/qt/5.12.1/lib -DQT_GUI_LIB -F/usr/local/Cellar/qt/5.12.1/lib -DQT_CORE_LIB -F/usr/local/Cellar/qt/5.12.1/lib -I/usr/local/Cellar/qt/5.12.1/lib/QtNetwork.framework/Headers -I/usr/local/Cellar/qt/5.12.1/lib/QtWidgets.framework/Headers -I/usr/local/Cellar/qt/5.12.1/lib/QtGui.framework/Headers -I/usr/local/Cellar/qt/5.12.1/lib/QtCore.framework/Headers'
- pkg_cv_QT5_LIBS='-F/usr/local/Cellar/qt/5.12.1/lib -framework QtNetwork -F/usr/local/Cellar/qt/5.12.1/lib -framework QtWidgets -F/usr/local/Cellar/qt/5.12.1/lib -framework QtGui -F/usr/local/Cellar/qt/5.12.1/lib -framework QtCore'
- pkg_cv_QT_DBUS_CFLAGS='-DQT_DBUS_LIB -F/usr/local/Cellar/qt/5.12.1/lib -DQT_CORE_LIB -F/usr/local/Cellar/qt/5.12.1/lib -I/usr/local/Cellar/qt/5.12.1/lib/QtDBus.framework/Headers -I/usr/local/Cellar/qt/5.12.1/lib/QtCore.framework/Headers'
- pkg_cv_QT_DBUS_LIBS='-F/usr/local/Cellar/qt/5.12.1/lib -framework QtDBus -F/usr/local/Cellar/qt/5.12.1/lib -framework QtCore'
- pkg_cv_QT_TEST_CFLAGS='-DQT_TESTLIB_LIB -F/usr/local/Cellar/qt/5.12.1/lib -DQT_CORE_LIB -F/usr/local/Cellar/qt/5.12.1/lib -I/usr/local/Cellar/qt/5.12.1/lib/QtTest.framework/Headers -I/usr/local/Cellar/qt/5.12.1/lib/QtCore.framework/Headers'
- pkg_cv_QT_TEST_LIBS='-F/usr/local/Cellar/qt/5.12.1/lib -framework QtTest -F/usr/local/Cellar/qt/5.12.1/lib -framework QtCore'
- pkg_cv_SSL_CFLAGS=-I/usr/local/Cellar/openssl/1.0.2s/include
- pkg_cv_SSL_LIBS='-L/usr/local/Cellar/openssl/1.0.2s/lib -lssl'
- ## ----------------- ##
- ## Output variables. ##
- ## ----------------- ##
- ACLOCAL='${SHELL} /Users/brent/bitcoin/build-aux/missing aclocal-1.16'
- AMDEPBACKSLASH='\'
- AMDEP_FALSE='#'
- AMDEP_TRUE=''
- AMTAR='$${TAR-tar}'
- AM_BACKSLASH='\'
- AM_DEFAULT_V='$(AM_DEFAULT_VERBOSITY)'
- AM_DEFAULT_VERBOSITY='0'
- AM_V='$(V)'
- AR='/usr/bin/ar'
- ARFLAGS='cr'
- AUTOCONF='${SHELL} /Users/brent/bitcoin/build-aux/missing autoconf'
- AUTOHEADER='${SHELL} /Users/brent/bitcoin/build-aux/missing autoheader'
- AUTOMAKE='${SHELL} /Users/brent/bitcoin/build-aux/missing automake-1.16'
- AVX2_CXXFLAGS='-mavx -mavx2'
- AWK='awk'
- BDB_CFLAGS=''
- BDB_CPPFLAGS=''
- BDB_LIBS='-ldb_cxx-4.8'
- BITCOIN_CLI_NAME='bitcoin-cli'
- BITCOIN_DAEMON_NAME='bitcoind'
- BITCOIN_GUI_NAME='bitcoin-qt'
- BITCOIN_TX_NAME='bitcoin-tx'
- BITCOIN_WALLET_TOOL_NAME='bitcoin-wallet'
- BOOST_CHRONO_LIB='-lboost_chrono-mt'
- BOOST_CPPFLAGS='-DBOOST_SP_USE_STD_ATOMIC -DBOOST_AC_USE_STD_ATOMIC -pthread -I/usr/local/include'
- BOOST_FILESYSTEM_LIB='-lboost_filesystem'
- BOOST_LDFLAGS='-L/usr/local/lib'
- BOOST_LIBS='-L/usr/local/lib -lboost_system -lboost_filesystem -lboost_thread-mt -lboost_chrono-mt'
- BOOST_SYSTEM_LIB='-lboost_system'
- BOOST_THREAD_LIB='-lboost_thread-mt'
- BOOST_UNIT_TEST_FRAMEWORK_LIB='-lboost_unit_test_framework-mt'
- BREW='brew'
- BUILD_BITCOIND_FALSE='#'
- BUILD_BITCOIND_TRUE=''
- BUILD_BITCOIN_CLI_FALSE='#'
- BUILD_BITCOIN_CLI_TRUE=''
- BUILD_BITCOIN_LIBS_FALSE='#'
- BUILD_BITCOIN_LIBS_TRUE=''
- BUILD_BITCOIN_TX_FALSE='#'
- BUILD_BITCOIN_TX_TRUE=''
- BUILD_BITCOIN_WALLET_FALSE='#'
- BUILD_BITCOIN_WALLET_TRUE=''
- BUILD_DARWIN_FALSE='#'
- BUILD_DARWIN_TRUE=''
- CC='gcc'
- CCACHE=''
- CCDEPMODE='depmode=gcc3'
- CFLAGS='-g -O2'
- CLIENT_VERSION_BUILD='0'
- CLIENT_VERSION_IS_RELEASE='false'
- CLIENT_VERSION_MAJOR='0'
- CLIENT_VERSION_MINOR='18'
- CLIENT_VERSION_REVISION='99'
- COMPAT_LDFLAGS=''
- COPYRIGHT_HOLDERS='The %s developers'
- COPYRIGHT_HOLDERS_FINAL='The Bitcoin Core developers'
- COPYRIGHT_HOLDERS_SUBSTITUTION='Bitcoin Core'
- COPYRIGHT_YEAR='2019'
- CPP='gcc -E'
- CPPFILT='/usr/bin/c++filt'
- CPPFLAGS=' -DHAVE_BUILD_INFO -D__STDC_FORMAT_MACROS -I/usr/local/opt/berkeley-db@4/include -DMAC_OSX'
- CRYPTO_CFLAGS='-I/usr/local/Cellar/openssl/1.0.2s/include'
- CRYPTO_LIBS='-L/usr/local/Cellar/openssl/1.0.2s/lib -lcrypto'
- CXX='g++ -std=c++11'
- CXXCPP='g++ -std=c++11 -E'
- CXXDEPMODE='depmode=gcc3'
- CXXFLAGS='-g -O2'
- CYGPATH_W='echo'
- DEBUG_CPPFLAGS=''
- DEBUG_CXXFLAGS=''
- DEFS='-DHAVE_CONFIG_H'
- DEPDIR='.deps'
- DLLTOOL='false'
- DOXYGEN=''
- DSYMUTIL='dsymutil'
- DUMPBIN=''
- ECHO_C='\c'
- ECHO_N=''
- ECHO_T=''
- EGREP='/usr/bin/grep -E'
- EMBEDDED_LEVELDB_FALSE='#'
- EMBEDDED_LEVELDB_TRUE=''
- EMBEDDED_UNIVALUE_FALSE='#'
- EMBEDDED_UNIVALUE_TRUE=''
- ENABLE_AVX2_FALSE='#'
- ENABLE_AVX2_TRUE=''
- ENABLE_BENCH_FALSE='#'
- ENABLE_BENCH_TRUE=''
- ENABLE_BIP70_FALSE='#'
- ENABLE_BIP70_TRUE=''
- ENABLE_FUZZ_FALSE=''
- ENABLE_FUZZ_TRUE='#'
- ENABLE_HWCRC32_FALSE='#'
- ENABLE_HWCRC32_TRUE=''
- ENABLE_MAN_FALSE='#'
- ENABLE_MAN_TRUE=''
- ENABLE_PROPERTY_TESTS_FALSE=''
- ENABLE_PROPERTY_TESTS_TRUE='#'
- ENABLE_QT_FALSE='#'
- ENABLE_QT_TESTS_FALSE='#'
- ENABLE_QT_TESTS_TRUE=''
- ENABLE_QT_TRUE=''
- ENABLE_SHANI_FALSE='#'
- ENABLE_SHANI_TRUE=''
- ENABLE_SSE41_FALSE='#'
- ENABLE_SSE41_TRUE=''
- ENABLE_TESTS_FALSE='#'
- ENABLE_TESTS_TRUE=''
- ENABLE_WALLET_FALSE='#'
- ENABLE_WALLET_TRUE=''
- ENABLE_ZMQ_FALSE=''
- ENABLE_ZMQ_TRUE='#'
- ERROR_CXXFLAGS=''
- EVENT_CFLAGS='-I/usr/local/Cellar/libevent/2.1.11/include'
- EVENT_LIBS='-L/usr/local/Cellar/libevent/2.1.11/lib -levent'
- EVENT_PTHREADS_CFLAGS='-D_THREAD_SAFE -I/usr/local/Cellar/libevent/2.1.11/include'
- EVENT_PTHREADS_LIBS='-L/usr/local/Cellar/libevent/2.1.11/lib -levent_pthreads -levent'
- EXEEXT=''
- EXTENDED_FUNCTIONAL_TESTS=''
- FGREP='/usr/bin/grep -F'
- GCOV='/usr/bin/gcov'
- GENHTML=''
- GENISOIMAGE=''
- GIT='/usr/bin/git'
- GLIBC_BACK_COMPAT_FALSE=''
- GLIBC_BACK_COMPAT_TRUE='#'
- GPROF_CXXFLAGS=''
- GPROF_LDFLAGS=''
- GREP='/usr/bin/grep'
- HARDENED_CPPFLAGS=' -U_FORTIFY_SOURCE -D_FORTIFY_SOURCE=2'
- HARDENED_CXXFLAGS=' -Wstack-protector -fstack-protector-all'
- HARDENED_LDFLAGS=''
- HARDEN_FALSE='#'
- HARDEN_TRUE=''
- HAVE_CXX11='1'
- HAVE_DOXYGEN_FALSE=''
- HAVE_DOXYGEN_TRUE='#'
- HEXDUMP='/usr/bin/hexdump'
- IMAGEMAGICK_CONVERT=''
- INSTALLNAMETOOL=''
- INSTALL_DATA='${INSTALL} -m 644'
- INSTALL_PROGRAM='${INSTALL}'
- INSTALL_SCRIPT='${INSTALL}'
- INSTALL_STRIP_PROGRAM='$(install_sh) -c -s'
- LCOV=''
- LCOV_OPTS=''
- LD='/Applications/Xcode.app/Contents/Developer/Toolchains/XcodeDefault.xctoolchain/usr/bin/ld'
- LDFLAGS=' -Wl,-headerpad_max_install_names -Wl,-dead_strip'
- LEVELDB_CPPFLAGS=''
- LEVELDB_TARGET_FLAGS='-DOS_MACOSX'
- LIBLEVELDB=''
- LIBMEMENV=''
- LIBOBJS=''
- LIBS=' -L/usr/local/opt/berkeley-db@4/lib'
- LIBTOOL='$(SHELL) $(top_builddir)/libtool'
- LIBTOOL_APP_LDFLAGS=''
- LIPO='lipo'
- LN_S='ln -s'
- LRELEASE='/usr/local/Cellar/qt/5.12.1/bin/lrelease'
- LTLIBOBJS=''
- LT_SYS_LIBRARY_PATH=''
- LUPDATE='/usr/local/Cellar/qt/5.12.1/bin/lupdate'
- MAINT=''
- MAINTAINER_MODE_FALSE='#'
- MAINTAINER_MODE_TRUE=''
- MAKEINFO='${SHELL} /Users/brent/bitcoin/build-aux/missing makeinfo'
- MAKENSIS=''
- MANIFEST_TOOL=':'
- MINIUPNPC_CPPFLAGS=''
- MINIUPNPC_LIBS='-lminiupnpc'
- MKDIR_P='build-aux/install-sh -c -d'
- MOC='/usr/local/Cellar/qt/5.12.1/bin/moc'
- MOC_DEFS='-DHAVE_CONFIG_H -I$(srcdir) -DQ_OS_MAC'
- NM='/usr/bin/nm -B'
- NMEDIT='nmedit'
- NOWARN_CXXFLAGS=' -Wno-unused-parameter -Wno-self-assign -Wno-unused-local-typedef -Wno-deprecated-register -Wno-implicit-fallthrough'
- OBJCOPY=''
- OBJCXX='g++ -std=c++11'
- OBJCXXDEPMODE='depmode=gcc3'
- OBJCXXFLAGS='-g -O2'
- OBJDUMP='objdump'
- OBJEXT='o'
- OTOOL64=':'
- OTOOL='otool'
- PACKAGE='bitcoin'
- PACKAGE_BUGREPORT='https://github.com/bitcoin/bitcoin/issues'
- PACKAGE_NAME='Bitcoin Core'
- PACKAGE_STRING='Bitcoin Core 0.18.99'
- PACKAGE_TARNAME='bitcoin'
- PACKAGE_URL='https://bitcoincore.org/'
- PACKAGE_VERSION='0.18.99'
- PATH_SEPARATOR=':'
- PIC_FLAGS='-fPIC'
- PIE_FLAGS=''
- PKG_CONFIG='/usr/local/bin/pkg-config'
- PKG_CONFIG_LIBDIR=''
- PKG_CONFIG_PATH='/usr/local/opt/qt/lib/pkgconfig:/usr/local/opt/openssl/lib/pkgconfig:'
- PROTOBUF_CFLAGS='-pthread -I/usr/local/Cellar/protobuf/3.6.1.3/include'
- PROTOBUF_LIBS='-L/usr/local/Cellar/protobuf/3.6.1.3/lib -lprotobuf -pthread'
- PROTOC='/usr/local/bin/protoc'
- PTHREAD_CC='gcc'
- PTHREAD_CFLAGS='-pthread'
- PTHREAD_LIBS=''
- PYTHON='/usr/local/bin/python3.7'
- PYTHONPATH=''
- QR_CFLAGS='-I/usr/local/Cellar/qrencode/4.0.2/include'
- QR_LIBS='-L/usr/local/Cellar/qrencode/4.0.2/lib -lqrencode'
- QT5_CFLAGS='-DQT_NETWORK_LIB -F/usr/local/Cellar/qt/5.12.1/lib -DQT_WIDGETS_LIB -F/usr/local/Cellar/qt/5.12.1/lib -DQT_GUI_LIB -F/usr/local/Cellar/qt/5.12.1/lib -DQT_CORE_LIB -F/usr/local/Cellar/qt/5.12.1/lib -I/usr/local/Cellar/qt/5.12.1/lib/QtNetwork.framework/Headers -I/usr/local/Cellar/qt/5.12.1/lib/QtWidgets.framework/Headers -I/usr/local/Cellar/qt/5.12.1/lib/QtGui.framework/Headers -I/usr/local/Cellar/qt/5.12.1/lib/QtCore.framework/Headers'
- QT5_LIBS='-F/usr/local/Cellar/qt/5.12.1/lib -framework QtNetwork -F/usr/local/Cellar/qt/5.12.1/lib -framework QtWidgets -F/usr/local/Cellar/qt/5.12.1/lib -framework QtGui -F/usr/local/Cellar/qt/5.12.1/lib -framework QtCore'
- QTACCESSIBILITY_CFLAGS=''
- QTACCESSIBILITY_LIBS=''
- QTCGL_CFLAGS=''
- QTCGL_LIBS=''
- QTCLIPBOARD_CFLAGS=''
- QTCLIPBOARD_LIBS=''
- QTDEVICEDISCOVERY_CFLAGS=''
- QTDEVICEDISCOVERY_LIBS=''
- QTEVENTDISPATCHER_CFLAGS=''
- QTEVENTDISPATCHER_LIBS=''
- QTFB_CFLAGS=''
- QTFB_LIBS=''
- QTFONTDATABASE_CFLAGS=''
- QTFONTDATABASE_LIBS=''
- QTGRAPHICS_CFLAGS=''
- QTGRAPHICS_LIBS=''
- QTPLATFORM_CFLAGS=''
- QTPLATFORM_LIBS=''
- QTTHEME_CFLAGS=''
- QTTHEME_LIBS=''
- QTXCBQPA_CFLAGS=''
- QTXCBQPA_LIBS=''
- QT_DBUS_CFLAGS='-DQT_DBUS_LIB -F/usr/local/Cellar/qt/5.12.1/lib -DQT_CORE_LIB -F/usr/local/Cellar/qt/5.12.1/lib -I/usr/local/Cellar/qt/5.12.1/lib/QtDBus.framework/Headers -I/usr/local/Cellar/qt/5.12.1/lib/QtCore.framework/Headers'
- QT_DBUS_INCLUDES='-DQT_DBUS_LIB -F/usr/local/Cellar/qt/5.12.1/lib -DQT_CORE_LIB -F/usr/local/Cellar/qt/5.12.1/lib -I/usr/local/Cellar/qt/5.12.1/lib/QtDBus.framework/Headers -I/usr/local/Cellar/qt/5.12.1/lib/QtCore.framework/Headers'
- QT_DBUS_LIBS='-F/usr/local/Cellar/qt/5.12.1/lib -framework QtDBus -F/usr/local/Cellar/qt/5.12.1/lib -framework QtCore'
- QT_INCLUDES='-DQT_NETWORK_LIB -F/usr/local/Cellar/qt/5.12.1/lib -DQT_WIDGETS_LIB -F/usr/local/Cellar/qt/5.12.1/lib -DQT_GUI_LIB -F/usr/local/Cellar/qt/5.12.1/lib -DQT_CORE_LIB -F/usr/local/Cellar/qt/5.12.1/lib -I/usr/local/Cellar/qt/5.12.1/lib/QtNetwork.framework/Headers -I/usr/local/Cellar/qt/5.12.1/lib/QtWidgets.framework/Headers -I/usr/local/Cellar/qt/5.12.1/lib/QtGui.framework/Headers -I/usr/local/Cellar/qt/5.12.1/lib/QtCore.framework/Headers'
- QT_LDFLAGS=''
- QT_LIBS='-F/usr/local/Cellar/qt/5.12.1/lib -framework QtNetwork -F/usr/local/Cellar/qt/5.12.1/lib -framework QtWidgets -F/usr/local/Cellar/qt/5.12.1/lib -framework QtGui -F/usr/local/Cellar/qt/5.12.1/lib -framework QtCore -framework Foundation -framework ApplicationServices -framework AppKit'
- QT_PIE_FLAGS=''
- QT_SELECT='qt5'
- QT_TEST_CFLAGS='-DQT_TESTLIB_LIB -F/usr/local/Cellar/qt/5.12.1/lib -DQT_CORE_LIB -F/usr/local/Cellar/qt/5.12.1/lib -I/usr/local/Cellar/qt/5.12.1/lib/QtTest.framework/Headers -I/usr/local/Cellar/qt/5.12.1/lib/QtCore.framework/Headers'
- QT_TEST_INCLUDES='-DQT_TESTLIB_LIB -F/usr/local/Cellar/qt/5.12.1/lib -DQT_CORE_LIB -F/usr/local/Cellar/qt/5.12.1/lib -I/usr/local/Cellar/qt/5.12.1/lib/QtTest.framework/Headers -I/usr/local/Cellar/qt/5.12.1/lib/QtCore.framework/Headers'
- QT_TEST_LIBS='-F/usr/local/Cellar/qt/5.12.1/lib -framework QtTest -F/usr/local/Cellar/qt/5.12.1/lib -framework QtCore'
- QT_TRANSLATION_DIR=''
- RANLIB='/usr/bin/ranlib'
- RAPIDCHECK_LIBS=''
- RCC='/usr/local/Cellar/qt/5.12.1/bin/rcc'
- READELF=''
- RELDFLAGS=''
- RSVG_CONVERT='/usr/local/bin/rsvg-convert'
- SANITIZER_CXXFLAGS=''
- SANITIZER_LDFLAGS=''
- SED='/usr/bin/sed'
- SET_MAKE=''
- SHANI_CXXFLAGS='-msse4 -msha'
- SHELL='/bin/sh'
- SSE41_CXXFLAGS='-msse4.1'
- SSE42_CXXFLAGS='-msse4.2'
- SSL_CFLAGS='-I/usr/local/Cellar/openssl/1.0.2s/include'
- SSL_LIBS='-L/usr/local/Cellar/openssl/1.0.2s/lib -lssl'
- STRIP='/usr/bin/strip'
- TARGET_DARWIN_FALSE='#'
- TARGET_DARWIN_TRUE=''
- TARGET_WINDOWS_FALSE=''
- TARGET_WINDOWS_TRUE='#'
- TESTDEFS=' -DBOOST_TEST_DYN_LINK'
- TIFFCP=''
- UIC='/usr/local/Cellar/qt/5.12.1/bin/uic'
- UNIVALUE_CFLAGS='-I$(srcdir)/univalue/include'
- UNIVALUE_LIBS='univalue/libunivalue.la'
- USE_ASM_FALSE='#'
- USE_ASM_TRUE=''
- USE_LCOV_FALSE=''
- USE_LCOV_TRUE='#'
- USE_QRCODE=''
- USE_QRCODE_FALSE='#'
- USE_QRCODE_TRUE=''
- USE_UPNP=''
- VERSION='0.18.99'
- WARN_CXXFLAGS=' -Wall -Wextra -Wformat -Wvla -Wswitch -Wformat-security -Wthread-safety-analysis -Wrange-loop-analysis -Wredundant-decls'
- WINDOWS_BITS=''
- WINDRES=''
- XGETTEXT=''
- ZMQ_CFLAGS=''
- ZMQ_LIBS=''
- ac_ct_AR='ar'
- ac_ct_CC='gcc'
- ac_ct_CXX='g++'
- ac_ct_DUMPBIN=''
- ac_ct_OBJCXX=''
- am__EXEEXT_FALSE=''
- am__EXEEXT_TRUE='#'
- am__fastdepCC_FALSE='#'
- am__fastdepCC_TRUE=''
- am__fastdepCXX_FALSE='#'
- am__fastdepCXX_TRUE=''
- am__fastdepOBJCXX_FALSE='#'
- am__fastdepOBJCXX_TRUE=''
- am__include='include'
- am__isrc=''
- am__leading_dot='.'
- am__nodep='_no'
- am__quote=''
- am__tar='$${TAR-tar} chof - "$$tardir"'
- am__untar='$${TAR-tar} xf -'
- ax_pthread_config=''
- bindir='${exec_prefix}/bin'
- build='x86_64-apple-darwin18.7.0'
- build_alias=''
- build_cpu='x86_64'
- build_os='darwin18.7.0'
- build_vendor='apple'
- datadir='${datarootdir}'
- datarootdir='${prefix}/share'
- docdir='${datarootdir}/doc/${PACKAGE_TARNAME}'
- dvidir='${docdir}'
- exec_prefix='${prefix}'
- host='x86_64-apple-darwin18.7.0'
- host_alias=''
- host_cpu='x86_64'
- host_os='darwin18.7.0'
- host_vendor='apple'
- htmldir='${docdir}'
- includedir='${prefix}/include'
- infodir='${datarootdir}/info'
- install_sh='${SHELL} /Users/brent/bitcoin/build-aux/install-sh'
- libdir='${exec_prefix}/lib'
- libexecdir='${exec_prefix}/libexec'
- localedir='${datarootdir}/locale'
- localstatedir='${prefix}/var'
- mandir='${datarootdir}/man'
- mkdir_p='$(MKDIR_P)'
- oldincludedir='/usr/include'
- pdfdir='${docdir}'
- prefix='/usr/local'
- program_transform_name='s,x,x,'
- psdir='${docdir}'
- sbindir='${exec_prefix}/sbin'
- sharedstatedir='${prefix}/com'
- subdirs=' src/univalue src/secp256k1'
- sysconfdir='${prefix}/etc'
- target_alias=''
- ## ----------- ##
- ## confdefs.h. ##
- ## ----------- ##
- /* confdefs.h */
- #define PACKAGE_NAME "Bitcoin Core"
- #define PACKAGE_TARNAME "bitcoin"
- #define PACKAGE_VERSION "0.18.99"
- #define PACKAGE_STRING "Bitcoin Core 0.18.99"
- #define PACKAGE_BUGREPORT "https://github.com/bitcoin/bitcoin/issues"
- #define PACKAGE_URL "https://bitcoincore.org/"
- #define HAVE_CXX11 1
- #define STDC_HEADERS 1
- #define HAVE_SYS_TYPES_H 1
- #define HAVE_SYS_STAT_H 1
- #define HAVE_STDLIB_H 1
- #define HAVE_STRING_H 1
- #define HAVE_MEMORY_H 1
- #define HAVE_STRINGS_H 1
- #define HAVE_INTTYPES_H 1
- #define HAVE_STDINT_H 1
- #define HAVE_UNISTD_H 1
- #define HAVE_DLFCN_H 1
- #define LT_OBJDIR ".libs/"
- #define USE_ASM 1
- #define ENABLE_SSE41 1
- #define ENABLE_AVX2 1
- #define ENABLE_SHANI 1
- #define HAVE_PTHREAD_PRIO_INHERIT 1
- #define HAVE_PTHREAD 1
- #define HAVE_DECL_STRERROR_R 1
- #define HAVE_STRERROR_R 1
- #define HAVE_STDIO_H 1
- #define HAVE_STDLIB_H 1
- #define HAVE_UNISTD_H 1
- #define HAVE_STRINGS_H 1
- #define HAVE_SYS_TYPES_H 1
- #define HAVE_SYS_STAT_H 1
- #define HAVE_SYS_SELECT_H 1
- #define HAVE_DECL_GETIFADDRS 1
- #define HAVE_DECL_FREEIFADDRS 1
- #define HAVE_DECL_STRNLEN 1
- #define HAVE_DECL_DAEMON 1
- #define HAVE_DECL_LE16TOH 0
- #define HAVE_DECL_LE32TOH 0
- #define HAVE_DECL_LE64TOH 0
- #define HAVE_DECL_HTOLE16 0
- #define HAVE_DECL_HTOLE32 0
- #define HAVE_DECL_HTOLE64 0
- #define HAVE_DECL_BE16TOH 0
- #define HAVE_DECL_BE32TOH 0
- #define HAVE_DECL_BE64TOH 0
- #define HAVE_DECL_HTOBE16 0
- #define HAVE_DECL_HTOBE32 0
- #define HAVE_DECL_HTOBE64 0
- #define HAVE_DECL_BSWAP_16 0
- #define HAVE_DECL_BSWAP_32 0
- #define HAVE_DECL_BSWAP_64 0
- #define HAVE_DECL___BUILTIN_CLZ 0
- #define HAVE_DECL___BUILTIN_CLZL 0
- #define HAVE_DECL___BUILTIN_CLZLL 0
- #define HAVE_VISIBILITY_ATTRIBUTE 1
- #define HAVE_GETENTROPY_RAND 1
- #define HAVE_STD__SYSTEM 1
- #define HAVE_SYSTEM HAVE_STD__SYSTEM || HAVE_WSYSTEM
- #define HAVE_MINIUPNPC_MINIWGET_H 1
- #define HAVE_MINIUPNPC_MINIUPNPC_H 1
- #define HAVE_MINIUPNPC_UPNPCOMMANDS_H 1
- #define HAVE_MINIUPNPC_UPNPERRORS_H 1
- #define HAVE_BOOST /**/
- #define HAVE_BOOST_SYSTEM /**/
- #define HAVE_BOOST_FILESYSTEM /**/
- #define HAVE_BOOST_THREAD /**/
- #define HAVE_BOOST_CHRONO /**/
- #define HAVE_BOOST_UNIT_TEST_FRAMEWORK /**/
- #define HAVE_WORKING_BOOST_SLEEP_FOR 1
- #define ENABLE_ZMQ 0
- #define HAVE_DECL_EVP_MD_CTX_NEW 0
- #define HAVE_CONSENSUS_LIB 1
- #define ENABLE_WALLET 1
- #define USE_UPNP 0
- #define USE_DBUS 1
- #define USE_QRCODE 1
- #define ENABLE_BIP70 1
- #define CLIENT_VERSION_MAJOR 0
- #define CLIENT_VERSION_MINOR 18
- #define CLIENT_VERSION_REVISION 99
- #define CLIENT_VERSION_BUILD 0
- #define CLIENT_VERSION_IS_RELEASE false
- #define COPYRIGHT_YEAR 2019
- #define COPYRIGHT_HOLDERS "The %s developers"
- #define COPYRIGHT_HOLDERS_SUBSTITUTION "Bitcoin Core"
- #define COPYRIGHT_HOLDERS_FINAL "The Bitcoin Core developers"
- configure: exit 0
Advertisement
Add Comment
Please, Sign In to add comment